{"text_format":"2","workbook":"xlsx","n_sheets":18,"sheets":["Permit","2021 FUT","Open","Senior","Adult","Youth","Derby","Highstakes","2020 Fut","12 & Under","Future champs","Average","BFA 2D Payout","2D Payout","3D Payout","4D Payout BBR","5D Payout BBR","DON'T TOUCH"],"not_rendered":{"charts":0,"images":0,"macros":0,"external_links":0,"defined_names":7,"comments":0,"pivot_tables":0},"unopened":[],"bounds":{"document_bytes":16777216,"sheet_cells":100000,"run_cost":"one","rows_first":2000,"rows_last":500,"rows_between":2000,"halvings":0,"cell_chars":16384,"cell_head_chars":4096},"cells_cut":0,"cells_raw":0,"read":"whole","date_system":"1900"}

{"sheet":"Permit","index":0,"n_rows":301,"n_cols":12,"rows_kept":301,"cut":false,"hidden":false,"merged":[]}
["Futurity","Der","Age Inct.","BBR","Draw","Rider Name","Horse Name","Pen","Time","Final Time","Placing","Money Earned"]
[{"$nulls":4},1,"Lacy Billingsley","PV Watchmeneighneigh","OP",15.842000000000001,null,"1st",379.9]
[{"$nulls":4},2,"Anna Johnson","Famous Resurection",null,15.861000000000001,null,"2nd",314.14]
[{"$nulls":4},3,"Jesse Harris","Running For Honors",null,16.103000000000002,null,"3rd",248.9]
[{"$nulls":4},4,"Delaney Siebert","Guys Classy Colours",null,16.222000000000001,null,"4th",183.4]
[{"$nulls":4},5,"KK Rule","A Juicy Adventure",null,16.222999999999999,null,"5th",117.9]
[{"$nulls":4},6,"Fallon Forbes","Another Bug Leo",null,16.271000000000001,null,"6th",65.5]
[{"$nulls":4},7,"Savannah Hays","Perkzilla",null,16.327999999999999]
[{"$nulls":4},8,"Nadia Defelice","Downrite Spectacular",null,16.361999999999998]
[{"$nulls":4},9,"Jamie Olsen","Miss Famous Beduino","OP",16.456]
[{"$nulls":4},10,"Shelly Lilley","Winston",null,16.472000000000001]
[{"$nulls":4},11,"Michelle Tyler","KissesFOrCaris",null,16.527000000000001]
[{"$nulls":4},12,"Lindsey Stevens","JM I Got Faith",null,16.623999999999999]
[{"$nulls":4},13,"Keley Bissett","Diamond Bar Flit",null,16.645]
[{"$nulls":4},14,"Randi Roberts","Boom Slicka Boom","OAP",17.018999999999998]
[{"$nulls":4},15,"Summer Tharp","Barley",null,17.263000000000002]
[{"$nulls":4},16,"Brittany Pierson","CF Dash N Dirty",null,"nt16.182"]
[{"$nulls":4},17,"Shelby Rowe","Beggars Pobre Flit",null,"nt16.532"]
[{"$nulls":4},18,"Jamie Cramblit","Pipers Magic",null,"nt16.622"]
[{"$nulls":4},19]
[{"$nulls":4},20]
[{"$nulls":4},21]
[{"$nulls":4},22]
[{"$nulls":4},23]
[{"$nulls":4},24]
[{"$nulls":4},25]
[{"$nulls":4},26]
[{"$nulls":4},27]
[{"$nulls":4},28]
[{"$nulls":4},29]
[{"$nulls":4},30]
[{"$nulls":4},31]
[{"$nulls":4},32]
[{"$nulls":4},33]
[{"$nulls":4},34]
[{"$nulls":4},35]
[{"$nulls":4},36]
[{"$nulls":4},37]
[{"$nulls":4},38]
[{"$nulls":4},39]
[{"$nulls":4},40]
[{"$nulls":4},41]
[{"$nulls":4},42]
[{"$nulls":4},43]
[{"$nulls":4},44]
[{"$nulls":4},45]
[{"$nulls":4},46]
[{"$nulls":4},47]
[{"$nulls":4},48]
[{"$nulls":4},49]
[{"$nulls":4},50]
[{"$nulls":4},51]
[{"$nulls":4},52]
[{"$nulls":4},53]
[{"$nulls":4},54]
[{"$nulls":4},55]
[{"$nulls":4},56]
[{"$nulls":4},57]
[{"$nulls":4},58]
[{"$nulls":4},59]
[{"$nulls":4},60]
[{"$nulls":4},61]
[{"$nulls":4},62]
[{"$nulls":4},63]
[{"$nulls":4},64]
[{"$nulls":4},65]
[{"$nulls":4},66,{"$nulls":4},{"$f":"IF(OR(H67=5,H67=10, H67=15, H67=\"BP\",H67=\"SCR\"),\"NT\",I67)","v":0}]
[{"$nulls":4},67,{"$nulls":4},0]
[{"$nulls":4},68,{"$nulls":4},0]
[{"$nulls":4},69,{"$nulls":4},0]
[{"$nulls":4},70,{"$nulls":4},0]
[{"$nulls":4},71,{"$nulls":4},0]
[{"$nulls":4},72,{"$nulls":4},0]
[{"$nulls":4},73,{"$nulls":4},0]
[{"$nulls":4},74,{"$nulls":4},0]
[{"$nulls":4},75,{"$nulls":4},0]
[{"$nulls":4},76,{"$nulls":4},0]
[{"$nulls":4},77,{"$nulls":4},0]
[{"$nulls":4},78,{"$nulls":4},0]
[{"$nulls":4},79,{"$nulls":4},0]
[{"$nulls":4},80,{"$nulls":4},0]
[{"$nulls":4},81,{"$nulls":4},0]
[{"$nulls":4},82,{"$nulls":4},0]
[{"$nulls":4},83,{"$nulls":4},0]
[{"$nulls":4},84,{"$nulls":4},0]
[{"$nulls":4},85,{"$nulls":4},0]
[{"$nulls":4},86,{"$nulls":4},0]
[{"$nulls":4},87,{"$nulls":4},0]
[{"$nulls":4},88,{"$nulls":4},0]
[{"$nulls":4},89,{"$nulls":4},0]
[{"$nulls":4},90,{"$nulls":4},0]
[{"$nulls":4},91,{"$nulls":4},0]
[{"$nulls":4},92,{"$nulls":4},0]
[{"$nulls":4},93,{"$nulls":4},0]
[{"$nulls":4},94,{"$nulls":4},0]
[{"$nulls":4},95,{"$nulls":4},0]
[{"$nulls":4},96,{"$nulls":4},0]
[{"$nulls":4},97,{"$nulls":4},0]
[{"$nulls":4},98,{"$nulls":4},0]
[{"$nulls":4},99,{"$nulls":4},0]
[{"$nulls":4},100,{"$nulls":4},0]
[{"$nulls":4},101,{"$nulls":4},0]
[{"$nulls":4},102,{"$nulls":4},0]
[{"$nulls":4},103,{"$nulls":4},0]
[{"$nulls":4},104,{"$nulls":4},0]
[{"$nulls":4},105,{"$nulls":4},0]
[{"$nulls":4},106,{"$nulls":4},0]
[{"$nulls":4},107,{"$nulls":4},0]
[{"$nulls":4},108,{"$nulls":4},0]
[{"$nulls":4},109,{"$nulls":4},0]
[{"$nulls":4},110,{"$nulls":4},0]
[{"$nulls":4},111,{"$nulls":4},0]
[{"$nulls":4},112,{"$nulls":4},0]
[{"$nulls":4},113,{"$nulls":4},0]
[{"$nulls":4},114,{"$nulls":4},0]
[{"$nulls":4},115,{"$nulls":4},0]
[{"$nulls":4},116,{"$nulls":4},0]
[{"$nulls":4},117,{"$nulls":4},0]
[{"$nulls":4},118,{"$nulls":4},0]
[{"$nulls":4},119,{"$nulls":4},0]
[{"$nulls":4},120,{"$nulls":4},0]
[{"$nulls":4},121,{"$nulls":4},0]
[{"$nulls":4},122,{"$nulls":4},0]
[{"$nulls":4},123,{"$nulls":4},0]
[{"$nulls":4},124,{"$nulls":4},0]
[{"$nulls":4},125,{"$nulls":4},0]
[{"$nulls":4},126,{"$nulls":4},0]
[{"$nulls":4},127,{"$nulls":4},0]
[{"$nulls":4},128,{"$nulls":4},0]
[{"$nulls":4},129,{"$nulls":4},0]
[{"$nulls":4},130,{"$nulls":4},{"$f":"IF(OR(H131=5,H131=10, H131=15, H131=\"BP\",H131=\"SCR\"),\"NT\",I131)","v":0}]
[{"$nulls":4},131,{"$nulls":4},0]
[{"$nulls":4},132,{"$nulls":4},0]
[{"$nulls":4},133,{"$nulls":4},0]
[{"$nulls":4},134,{"$nulls":4},0]
[{"$nulls":4},135,{"$nulls":4},0]
[{"$nulls":4},136,{"$nulls":4},0]
[{"$nulls":4},137,{"$nulls":4},0]
[{"$nulls":4},138,{"$nulls":4},0]
[{"$nulls":4},139,{"$nulls":4},0]
[{"$nulls":4},140,{"$nulls":4},0]
[{"$nulls":4},141,{"$nulls":4},0]
[{"$nulls":4},142,{"$nulls":4},0]
[{"$nulls":4},143,{"$nulls":4},0]
[{"$nulls":4},144,{"$nulls":4},0]
[{"$nulls":4},145,{"$nulls":4},0]
[{"$nulls":4},146,{"$nulls":4},0]
[{"$nulls":4},147,{"$nulls":4},0]
[{"$nulls":4},148,{"$nulls":4},0]
[{"$nulls":4},149,{"$nulls":4},0]
[{"$nulls":4},150,{"$nulls":4},0]
[{"$nulls":4},151,{"$nulls":4},0]
[{"$nulls":4},152,{"$nulls":4},0]
[{"$nulls":4},153,{"$nulls":4},0]
[{"$nulls":4},154,{"$nulls":4},0]
[{"$nulls":4},155,{"$nulls":4},0]
[{"$nulls":4},156,{"$nulls":4},0]
[{"$nulls":4},157,{"$nulls":4},0]
[{"$nulls":4},158,{"$nulls":4},0]
[{"$nulls":4},159,{"$nulls":4},0]
[{"$nulls":4},160,{"$nulls":4},0]
[{"$nulls":4},161,{"$nulls":4},0]
[{"$nulls":4},162,{"$nulls":4},0]
[{"$nulls":4},163,{"$nulls":4},0]
[{"$nulls":4},164,{"$nulls":4},0]
[{"$nulls":4},165,{"$nulls":4},0]
[{"$nulls":4},166,{"$nulls":4},0]
[{"$nulls":4},167,{"$nulls":4},0]
[{"$nulls":4},168,{"$nulls":4},0]
[{"$nulls":4},169,{"$nulls":4},0]
[{"$nulls":4},170,{"$nulls":4},0]
[{"$nulls":4},171,{"$nulls":4},0]
[{"$nulls":4},172,{"$nulls":4},0]
[{"$nulls":4},173,{"$nulls":4},0]
[{"$nulls":4},174,{"$nulls":4},0]
[{"$nulls":4},175,{"$nulls":4},0]
[{"$nulls":4},176,{"$nulls":4},0]
[{"$nulls":4},177,{"$nulls":4},0]
[{"$nulls":4},178,{"$nulls":4},0]
[{"$nulls":4},179,{"$nulls":4},0]
[{"$nulls":4},180,{"$nulls":4},0]
[{"$nulls":4},181,{"$nulls":4},0]
[{"$nulls":4},182,{"$nulls":4},0]
[{"$nulls":4},183,{"$nulls":4},0]
[{"$nulls":4},184,{"$nulls":4},0]
[{"$nulls":4},185,{"$nulls":4},0]
[{"$nulls":4},186,{"$nulls":4},0]
[{"$nulls":4},187,{"$nulls":4},0]
[{"$nulls":4},188,{"$nulls":4},0]
[{"$nulls":4},189,{"$nulls":4},0]
[{"$nulls":4},190,{"$nulls":4},0]
[{"$nulls":4},191,{"$nulls":4},0]
[{"$nulls":4},192,{"$nulls":4},0]
[{"$nulls":4},193,{"$nulls":4},0]
[{"$nulls":4},194,{"$nulls":4},{"$f":"IF(OR(H195=5,H195=10, H195=15, H195=\"BP\",H195=\"SCR\"),\"NT\",I195)","v":0}]
[{"$nulls":4},195,{"$nulls":4},0]
[{"$nulls":4},196,{"$nulls":4},0]
[{"$nulls":4},197,{"$nulls":4},0]
[{"$nulls":4},198,{"$nulls":4},0]
[{"$nulls":4},199,{"$nulls":4},0]
[{"$nulls":4},200,{"$nulls":4},0]
[{"$nulls":4},201,{"$nulls":4},0]
[{"$nulls":4},202,{"$nulls":4},0]
[{"$nulls":4},203,{"$nulls":4},0]
[{"$nulls":4},204,{"$nulls":4},0]
[{"$nulls":4},205,{"$nulls":4},0]
[{"$nulls":4},206,{"$nulls":4},0]
[{"$nulls":4},207,{"$nulls":4},0]
[{"$nulls":4},208,{"$nulls":4},0]
[{"$nulls":4},209,{"$nulls":4},0]
[{"$nulls":4},210,{"$nulls":4},0]
[{"$nulls":4},211,{"$nulls":4},0]
[{"$nulls":4},212,{"$nulls":4},0]
[{"$nulls":4},213,{"$nulls":4},0]
[{"$nulls":4},214,{"$nulls":4},0]
[{"$nulls":4},215,{"$nulls":4},0]
[{"$nulls":4},216,{"$nulls":4},0]
[{"$nulls":4},217,{"$nulls":4},0]
[{"$nulls":4},218,{"$nulls":4},0]
[{"$nulls":4},219,{"$nulls":4},0]
[{"$nulls":4},220,{"$nulls":4},0]
[{"$nulls":4},221,{"$nulls":4},0]
[{"$nulls":4},222,{"$nulls":4},0]
[{"$nulls":4},223,{"$nulls":4},0]
[{"$nulls":4},224,{"$nulls":4},0]
[{"$nulls":4},225,{"$nulls":4},0]
[{"$nulls":4},226,{"$nulls":4},0]
[{"$nulls":4},227,{"$nulls":4},0]
[{"$nulls":4},228,{"$nulls":4},0]
[{"$nulls":4},229,{"$nulls":4},0]
[{"$nulls":4},230,{"$nulls":4},0]
[{"$nulls":4},231,{"$nulls":4},0]
[{"$nulls":4},232,{"$nulls":4},0]
[{"$nulls":4},233,{"$nulls":4},0]
[{"$nulls":4},234,{"$nulls":4},0]
[{"$nulls":4},235,{"$nulls":4},0]
[{"$nulls":4},236,{"$nulls":4},0]
[{"$nulls":4},237,{"$nulls":4},0]
[{"$nulls":4},238,{"$nulls":4},0]
[{"$nulls":4},239,{"$nulls":4},0]
[{"$nulls":4},240,{"$nulls":4},0]
[{"$nulls":4},241,{"$nulls":4},0]
[{"$nulls":4},242,{"$nulls":4},0]
[{"$nulls":4},243,{"$nulls":4},0]
[{"$nulls":4},244,{"$nulls":4},0]
[{"$nulls":4},245,{"$nulls":4},0]
[{"$nulls":4},246,{"$nulls":4},0]
[{"$nulls":4},247,{"$nulls":4},0]
[{"$nulls":4},248,{"$nulls":4},0]
[{"$nulls":4},249,{"$nulls":4},0]
[{"$nulls":4},250,{"$nulls":4},0]
[{"$nulls":4},251,{"$nulls":4},0]
[{"$nulls":4},252,{"$nulls":4},0]
[{"$nulls":4},253,{"$nulls":4},0]
[{"$nulls":4},254,{"$nulls":4},0]
[{"$nulls":4},255,{"$nulls":4},0]
[{"$nulls":4},256,{"$nulls":4},0]
[{"$nulls":4},257,{"$nulls":4},0]
[{"$nulls":4},258,{"$nulls":4},{"$f":"IF(OR(H259=5,H259=10, H259=15, H259=\"BP\",H259=\"SCR\"),\"NT\",I259)","v":0}]
[{"$nulls":4},259,{"$nulls":4},0]
[{"$nulls":4},260,{"$nulls":4},0]
[{"$nulls":4},261,{"$nulls":4},0]
[{"$nulls":4},262,{"$nulls":4},0]
[{"$nulls":4},263,{"$nulls":4},0]
[{"$nulls":4},264,{"$nulls":4},0]
[{"$nulls":4},265,{"$nulls":4},0]
[{"$nulls":4},266,{"$nulls":4},0]
[{"$nulls":4},267,{"$nulls":4},0]
[{"$nulls":4},268,{"$nulls":4},0]
[{"$nulls":4},269,{"$nulls":4},0]
[{"$nulls":4},270,{"$nulls":4},0]
[{"$nulls":4},271,{"$nulls":4},0]
[{"$nulls":4},272,{"$nulls":4},0]
[{"$nulls":4},273,{"$nulls":4},0]
[{"$nulls":4},274,{"$nulls":4},0]
[{"$nulls":4},275,{"$nulls":4},0]
[{"$nulls":4},276,{"$nulls":4},0]
[{"$nulls":4},277,{"$nulls":4},0]
[{"$nulls":4},278,{"$nulls":4},0]
[{"$nulls":4},279,{"$nulls":4},0]
[{"$nulls":4},280,{"$nulls":4},0]
[{"$nulls":4},281,{"$nulls":4},0]
[{"$nulls":4},282,{"$nulls":4},0]
[{"$nulls":4},283,{"$nulls":4},0]
[{"$nulls":4},284,{"$nulls":4},0]
[{"$nulls":4},285,{"$nulls":4},0]
[{"$nulls":4},286,{"$nulls":4},0]
[{"$nulls":4},287,{"$nulls":4},0]
[{"$nulls":4},288,{"$nulls":4},0]
[{"$nulls":4},289,{"$nulls":4},0]
[{"$nulls":4},290,{"$nulls":4},0]
[{"$nulls":4},291,{"$nulls":4},0]
[{"$nulls":4},292,{"$nulls":4},0]
[{"$nulls":4},293,{"$nulls":4},0]
[{"$nulls":4},294,{"$nulls":4},0]
[{"$nulls":4},295,{"$nulls":4},0]
[{"$nulls":4},296,{"$nulls":4},0]
[{"$nulls":4},297,{"$nulls":4},0]
[{"$nulls":4},298,{"$nulls":4},0]
[{"$nulls":4},299,{"$nulls":4},0]
[{"$nulls":4},300,{"$nulls":4},0]

{"sheet":"2021 FUT","index":1,"n_rows":301,"n_cols":12,"rows_kept":301,"cut":false,"hidden":false,"merged":[]}
["Futurity","Der","Age Inct.","BBR","Draw","Rider Name","Horse Name","c/o","Time","Final Time","Placing","Money Earned"]
[{"$nulls":4},24,"Fonda Melby","Fling The French","O",15.951000000000001,{"$f":"IF(OR(H2=5,H2=10, H2=15, H2=\"BP\",H2=\"SCR\"),\"NT\",I2)","v":15.951000000000001},"1D 1st",1823.5]
[{"$nulls":4},52,"Molli Montgomery","The Woman Loves Fame","O",16.041,null,"1D 2nd",1458.8000000000002]
[{"$nulls":4},26,"Hallie Hannsen","Epic Calendar Girl","O",16.052,{"$f":"IF(OR(H4=5,H4=10, H4=15, H4=\"BP\",H4=\"SCR\"),\"NT\",I4)","v":16.052},"1D 3rd",1312.9199999999998]
[{"$nulls":4},14,"Kylie Bowles","Slick A Lena","O",16.093,16.093,"1D 4th",1094.0999999999999]
[{"$nulls":4},12,"Sharin Hall","Rocket Fire Ta Fame","O",16.175999999999998,16.175999999999998,"1D 5th",875.28]
[{"$nulls":4},11,"Sierra Melby","Aflingwithfreckles","O",16.189,16.189,"1D 6th",729.40000000000009]
[{"$nulls":4},13,"Scamper Cole","French Stinson","O",16.216000000000001,16.216000000000001]
[{"$nulls":4},65,"Skylar Eisinger","All Bugged Up","OY",16.233000000000001,16.233000000000001]
[{"$nulls":4},27,"Lacey Harmon","Rumoure Has It","O",16.234999999999999,16.234999999999999]
[{"$nulls":4},38,"Tallaney Clark","Perks Hickory Cat","O",16.248999999999999]
[{"$nulls":4},16,"Rylee Shields","Im Ferious 123","O",16.276,{"$f":"IF(OR(H12=5,H12=10, H12=15, H12=\"BP\",H12=\"SCR\"),\"NT\",I12)","v":16.276}]
[{"$nulls":4},36,"Abigail Plants","KN Baileys Sidecar","O",16.291,{"$f":"IF(OR(H13=5,H13=10, H13=15, H13=\"BP\",H13=\"SCR\"),\"NT\",I13)","v":16.291}]
[{"$nulls":4},57,"Hallie Hannsen","UX Swayzi Stinson","O",16.306000000000001,{"$f":"IF(OR(H14=5,H14=10, H14=15, H14=\"BP\",H14=\"SCR\"),\"NT\",I14)","v":16.306000000000001}]
[{"$nulls":4},8,"Molli Montgomery","SV Dudewheresmysocks","O",16.317]
[{"$nulls":4},58,"Ashley Schafer","KN Harley Quinn","O",16.323,{"$f":"IF(OR(H16=5,H16=10, H16=15, H16=\"BP\",H16=\"SCR\"),\"NT\",I16)","v":16.323}]
[{"$nulls":4},43,"Caroline Boucher","MP Hot Hayday","O",16.343]
[{"$nulls":4},18,"Kyle Leleux","Dollys Streakin Badger","O",16.344000000000001,{"$f":"IF(OR(H18=5,H18=10, H18=15, H18=\"BP\",H18=\"SCR\"),\"NT\",I18)","v":16.344000000000001}]
[{"$nulls":4},54,"Bo Hill","Jakk","O",16.370999999999999,16.370999999999999]
[{"$nulls":4},20,"Caroline Boucher","Streakin Lil Fling","O",16.385999999999999,16.385999999999999]
[{"$nulls":4},63,"Shelly Shields","Tres French Kiss","O",16.396999999999998,16.396999999999998]
[{"$nulls":4},4,"Hallie Hannsen","Seis Wild","O",16.41,16.41]
[{"$nulls":4},53,"Fonda Melby","RF Back For The Cash","O",16.489000000000001,16.489000000000001]
[{"$nulls":4},59,"Sierra Melby","VF Victoria Stinson","O",16.489999999999998,16.489999999999998]
[{"$nulls":4},23,"Cassidy Teague","RLC Gone Streakin","O",16.526,16.526]
[{"$nulls":4},44,"Jennifer Burgess","IFIWASUIDWANNABEME 2","O",16.579000000000001]
[{"$nulls":4},33,"Janee' Ornelas","BQX TX Streaktorodeo","o",16.579999999999998,{"$f":"IF(OR(H27=5,H27=10, H27=15, H27=\"BP\",H27=\"SCR\"),\"NT\",I27)","v":16.579999999999998}]
[{"$nulls":4},25,"Keely Perkins","Wahinis In Bikinis","O",16.582999999999998,{"$f":"IF(OR(H28=5,H28=10, H28=15, H28=\"BP\",H28=\"SCR\"),\"NT\",I28)","v":16.582999999999998}]
[{"$nulls":4},17,"Shelly Shields","Streakingaround NBack","O",16.641999999999999,{"$f":"IF(OR(H29=5,H29=10, H29=15, H29=\"BP\",H29=\"SCR\"),\"NT\",I29)","v":16.641999999999999}]
[{"$nulls":4},3,"Fonda Melby","Fiddle Me To Gold","O",16.652000000000001,{"$f":"IF(OR(H30=5,H30=10, H30=15, H30=\"BP\",H30=\"SCR\"),\"NT\",I30)","v":16.652000000000001}]
[{"$nulls":4},30,"Lindsey Sears","SME One Of A Kind","O",16.655999999999999,{"$f":"IF(OR(H31=5,H31=10, H31=15, H31=\"BP\",H31=\"SCR\"),\"NT\",I31)","v":16.655999999999999}]
[{"$nulls":4},10,"Jennifer Burgess","Streakin Dynamo","O",16.702000000000002]
[{"$nulls":4},6,"Cassidy Teague","On The Run With a Gun","O",16.73]
[{"$nulls":4},42,"Josh Seeger","Wins Famous Lady","O",16.760000000000002]
[{"$nulls":4},31,"Whitney Godinez","Chilla On The Rocks","OA",16.763000000000002,{"$f":"IF(OR(H35=5,H35=10, H35=15, H35=\"BP\",H35=\"SCR\"),\"NT\",I35)","v":16.763000000000002}]
[{"$nulls":4},34,"Wyatt Paul","MJ Condo Cowboy","O",16.768999999999998,{"$f":"IF(OR(H36=5,H36=10, H36=15, H36=\"BP\",H36=\"SCR\"),\"NT\",I36)","v":16.768999999999998}]
[{"$nulls":4},56,"Cassidy Teague","Fabs Little Rose","O",16.89,{"$f":"IF(OR(H37=5,H37=10, H37=15, H37=\"BP\",H37=\"SCR\"),\"NT\",I37)","v":16.89}]
[{"$nulls":4},41,"Jolene Jones","Mark Me Angels","OS",16.899000000000001]
[{"$nulls":4},66,"Chelsea Bartlett","EJ Flirty French Girl","O",16.946000000000002,{"$f":"IF(OR(H39=5,H39=10, H39=15, H39=\"BP\",H39=\"SCR\"),\"NT\",I39)","v":16.946000000000002}]
[{"$nulls":4},19,"Tiffany Durham","Stolin Rubies","OA",16.957000000000001,{"$f":"IF(OR(H40=5,H40=10, H40=15, H40=\"BP\",H40=\"SCR\"),\"NT\",I40)","v":16.957000000000001},"2D 1st",781.5]
[{"$nulls":4},28,"Jordan Moore-Miller","TR Famous Badger","O",16.978999999999999,{"$f":"IF(OR(H41=5,H41=10, H41=15, H41=\"BP\",H41=\"SCR\"),\"NT\",I41)","v":16.978999999999999},"2D 2nd",625.20000000000005]
[{"$nulls":4},15,"Taylor Langle","Snakin Thru Traffic","O",16.998999999999999,{"$f":"IF(OR(H42=5,H42=10, H42=15, H42=\"BP\",H42=\"SCR\"),\"NT\",I42)","v":16.998999999999999},"2D 3rd",562.67999999999995]
[{"$nulls":4},47,"Renee Douglas","Ticket Ta Fame","OS",17.009,null,"2D 4th",468.9]
[{"$nulls":4},32,"Kara Kreder","ZZI Rojo Magic","O",17.050999999999998,{"$f":"IF(OR(H44=5,H44=10, H44=15, H44=\"BP\",H44=\"SCR\"),\"NT\",I44)","v":17.050999999999998},"2D 5th",375.12]
[{"$nulls":4},22,"Ashley Schafer","Famous Cash Can","O",17.113,{"$f":"IF(OR(H45=5,H45=10, H45=15, H45=\"BP\",H45=\"SCR\"),\"NT\",I45)","v":17.113},"2D 6th",312.60000000000002]
[{"$nulls":4},64,"Mary Van Cleve","This Buds For Fame","OA",17.164999999999999,{"$f":"IF(OR(H46=5,H46=10, H46=15, H46=\"BP\",H46=\"SCR\"),\"NT\",I46)","v":17.164999999999999}]
[{"$nulls":4},55,"Scamper Cole","Cartels Lil Secert","O",17.306000000000001,{"$f":"IF(OR(H47=5,H47=10, H47=15, H47=\"BP\",H47=\"SCR\"),\"NT\",I47)","v":17.306000000000001}]
[{"$nulls":4},50,"Odale Comer","Trump Train La Fame","O",17.306999999999999]
[{"$nulls":4},49,"Kylee Scribner","Firewater Rey","O",17.356999999999999]
[{"$nulls":4},35,"Cassidy Champlin","TDZ Toast The Wind","O",17.407,{"$f":"IF(OR(H50=5,H50=10, H50=15, H50=\"BP\",H50=\"SCR\"),\"NT\",I50)","v":17.407}]
[{"$nulls":4},9,"Kylee Scribner","Corona and Firewater","O",17.481000000000002]
[{"$nulls":4},62,"Caroline Boucher","Gotta B Heavenly","O",17.501999999999999]
[{"$nulls":4},48,"Michaela Robertson","RSR Guys Speed Com","O",17.651]
[{"$nulls":4},37,"Becca Fellman","Jesses Corona",null,17.856000000000002]
[{"$nulls":4},29,"Brittany Baton","Savagely Smooth","O",17.876000000000001,{"$f":"IF(OR(H55=5,H55=10, H55=15, H55=\"BP\",H55=\"SCR\"),\"NT\",I55)","v":17.876000000000001}]
[{"$nulls":4},51,"Madi Roelofsen","TVR Sullivan Dancer","O",18.315000000000001]
[{"$nulls":4},46,"Lori Berryman","Separate Luv For M21","OA",18.446000000000002]
[{"$nulls":4},45,"Gracie Ayers","Laramie Wild Card","O",18.501999999999999]
[{"$nulls":4},60,"Sharin Hall","Hello Stella","O","nt",{"$f":"IF(OR(H59=5,H59=10, H59=15, H59=\"BP\",H59=\"SCR\"),\"NT\",I59)","v":"nt"}]
[{"$nulls":4},61,"Joao Leao","Florari","O","nt",{"$f":"IF(OR(H60=5,H60=10, H60=15, H60=\"BP\",H60=\"SCR\"),\"NT\",I60)","v":"nt"}]
[{"$nulls":4},5,"Ashley Schafer","Streakin TilMidnight","O","nt 16.471",{"$f":"IF(OR(H61=5,H61=10, H61=15, H61=\"BP\",H61=\"SCR\"),\"NT\",I61)","v":"nt 16.471"}]
[{"$nulls":4},7,"Bo Hill","Thomaz","O","nt16.121",{"$f":"IF(OR(H62=5,H62=10, H62=15, H62=\"BP\",H62=\"SCR\"),\"NT\",I62)","v":"nt16.121"}]
[{"$nulls":4},2,"Joao Leao","Special For Trez Pz","O","nt16.176"]
[{"$nulls":4},39,"Ben McDonnell","AJ ShakeItLike Elvis","O","nt16.732"]
[{"$nulls":4},21,"Joao Leao","Tres Candies Pz","O","nt16.908"]
[{"$nulls":4},1,"Caroline Boucher","Mayfling First Sign","O","nt16.969"]
[{"$nulls":4},40,"Genevieve Blanchard","Hot Traffic Pursuit","OY","nt17.364"]
[{"$nulls":4},67,{"$nulls":4},{"$f":"IF(OR(H68=5,H68=10, H68=15, H68=\"BP\",H68=\"SCR\"),\"NT\",I68)","v":0}]
[{"$nulls":4},68,{"$nulls":4},0]
[{"$nulls":4},69,{"$nulls":4},0]
[{"$nulls":4},70,{"$nulls":4},0]
[{"$nulls":4},71,{"$nulls":4},0]
[{"$nulls":4},72,{"$nulls":4},0]
[{"$nulls":4},73,{"$nulls":4},0]
[{"$nulls":4},74,{"$nulls":4},0]
[{"$nulls":4},75,{"$nulls":4},0]
[{"$nulls":4},76,{"$nulls":4},0]
[{"$nulls":4},77,{"$nulls":4},0]
[{"$nulls":4},78,{"$nulls":4},0]
[{"$nulls":4},79,{"$nulls":4},0]
[{"$nulls":4},80,{"$nulls":4},0]
[{"$nulls":4},81,{"$nulls":4},0]
[{"$nulls":4},82,{"$nulls":4},0]
[{"$nulls":4},83,{"$nulls":4},0]
[{"$nulls":4},84,{"$nulls":4},0]
[{"$nulls":4},85,{"$nulls":4},0]
[{"$nulls":4},86,{"$nulls":4},0]
[{"$nulls":4},87,{"$nulls":4},0]
[{"$nulls":4},88,{"$nulls":4},0]
[{"$nulls":4},89,{"$nulls":4},0]
[{"$nulls":4},90,{"$nulls":4},0]
[{"$nulls":4},91,{"$nulls":4},0]
[{"$nulls":4},92,{"$nulls":4},0]
[{"$nulls":4},93,{"$nulls":4},0]
[{"$nulls":4},94,{"$nulls":4},0]
[{"$nulls":4},95,{"$nulls":4},0]
[{"$nulls":4},96,{"$nulls":4},0]
[{"$nulls":4},97,{"$nulls":4},0]
[{"$nulls":4},98,{"$nulls":4},0]
[{"$nulls":4},99,{"$nulls":4},0]
[{"$nulls":4},100,{"$nulls":4},0]
[{"$nulls":4},101,{"$nulls":4},0]
[{"$nulls":4},102,{"$nulls":4},0]
[{"$nulls":4},103,{"$nulls":4},0]
[{"$nulls":4},104,{"$nulls":4},0]
[{"$nulls":4},105,{"$nulls":4},0]
[{"$nulls":4},106,{"$nulls":4},0]
[{"$nulls":4},107,{"$nulls":4},0]
[{"$nulls":4},108,{"$nulls":4},0]
[{"$nulls":4},109,{"$nulls":4},0]
[{"$nulls":4},110,{"$nulls":4},0]
[{"$nulls":4},111,{"$nulls":4},0]
[{"$nulls":4},112,{"$nulls":4},0]
[{"$nulls":4},113,{"$nulls":4},0]
[{"$nulls":4},114,{"$nulls":4},0]
[{"$nulls":4},115,{"$nulls":4},0]
[{"$nulls":4},116,{"$nulls":4},0]
[{"$nulls":4},117,{"$nulls":4},0]
[{"$nulls":4},118,{"$nulls":4},0]
[{"$nulls":4},119,{"$nulls":4},0]
[{"$nulls":4},120,{"$nulls":4},0]
[{"$nulls":4},121,{"$nulls":4},0]
[{"$nulls":4},122,{"$nulls":4},0]
[{"$nulls":4},123,{"$nulls":4},0]
[{"$nulls":4},124,{"$nulls":4},0]
[{"$nulls":4},125,{"$nulls":4},0]
[{"$nulls":4},126,{"$nulls":4},0]
[{"$nulls":4},127,{"$nulls":4},0]
[{"$nulls":4},128,{"$nulls":4},0]
[{"$nulls":4},129,{"$nulls":4},0]
[{"$nulls":4},130,{"$nulls":4},0]
[{"$nulls":4},131,{"$nulls":4},{"$f":"IF(OR(H132=5,H132=10, H132=15, H132=\"BP\",H132=\"SCR\"),\"NT\",I132)","v":0}]
[{"$nulls":4},132,{"$nulls":4},0]
[{"$nulls":4},133,{"$nulls":4},0]
[{"$nulls":4},134,{"$nulls":4},0]
[{"$nulls":4},135,{"$nulls":4},0]
[{"$nulls":4},136,{"$nulls":4},0]
[{"$nulls":4},137,{"$nulls":4},0]
[{"$nulls":4},138,{"$nulls":4},0]
[{"$nulls":4},139,{"$nulls":4},0]
[{"$nulls":4},140,{"$nulls":4},0]
[{"$nulls":4},141,{"$nulls":4},0]
[{"$nulls":4},142,{"$nulls":4},0]
[{"$nulls":4},143,{"$nulls":4},0]
[{"$nulls":4},144,{"$nulls":4},0]
[{"$nulls":4},145,{"$nulls":4},0]
[{"$nulls":4},146,{"$nulls":4},0]
[{"$nulls":4},147,{"$nulls":4},0]
[{"$nulls":4},148,{"$nulls":4},0]
[{"$nulls":4},149,{"$nulls":4},0]
[{"$nulls":4},150,{"$nulls":4},0]
[{"$nulls":4},151,{"$nulls":4},0]
[{"$nulls":4},152,{"$nulls":4},0]
[{"$nulls":4},153,{"$nulls":4},0]
[{"$nulls":4},154,{"$nulls":4},0]
[{"$nulls":4},155,{"$nulls":4},0]
[{"$nulls":4},156,{"$nulls":4},0]
[{"$nulls":4},157,{"$nulls":4},0]
[{"$nulls":4},158,{"$nulls":4},0]
[{"$nulls":4},159,{"$nulls":4},0]
[{"$nulls":4},160,{"$nulls":4},0]
[{"$nulls":4},161,{"$nulls":4},0]
[{"$nulls":4},162,{"$nulls":4},0]
[{"$nulls":4},163,{"$nulls":4},0]
[{"$nulls":4},164,{"$nulls":4},0]
[{"$nulls":4},165,{"$nulls":4},0]
[{"$nulls":4},166,{"$nulls":4},0]
[{"$nulls":4},167,{"$nulls":4},0]
[{"$nulls":4},168,{"$nulls":4},0]
[{"$nulls":4},169,{"$nulls":4},0]
[{"$nulls":4},170,{"$nulls":4},0]
[{"$nulls":4},171,{"$nulls":4},0]
[{"$nulls":4},172,{"$nulls":4},0]
[{"$nulls":4},173,{"$nulls":4},0]
[{"$nulls":4},174,{"$nulls":4},0]
[{"$nulls":4},175,{"$nulls":4},0]
[{"$nulls":4},176,{"$nulls":4},0]
[{"$nulls":4},177,{"$nulls":4},0]
[{"$nulls":4},178,{"$nulls":4},0]
[{"$nulls":4},179,{"$nulls":4},0]
[{"$nulls":4},180,{"$nulls":4},0]
[{"$nulls":4},181,{"$nulls":4},0]
[{"$nulls":4},182,{"$nulls":4},0]
[{"$nulls":4},183,{"$nulls":4},0]
[{"$nulls":4},184,{"$nulls":4},0]
[{"$nulls":4},185,{"$nulls":4},0]
[{"$nulls":4},186,{"$nulls":4},0]
[{"$nulls":4},187,{"$nulls":4},0]
[{"$nulls":4},188,{"$nulls":4},0]
[{"$nulls":4},189,{"$nulls":4},0]
[{"$nulls":4},190,{"$nulls":4},0]
[{"$nulls":4},191,{"$nulls":4},0]
[{"$nulls":4},192,{"$nulls":4},0]
[{"$nulls":4},193,{"$nulls":4},0]
[{"$nulls":4},194,{"$nulls":4},0]
[{"$nulls":4},195,{"$nulls":4},{"$f":"IF(OR(H196=5,H196=10, H196=15, H196=\"BP\",H196=\"SCR\"),\"NT\",I196)","v":0}]
[{"$nulls":4},196,{"$nulls":4},0]
[{"$nulls":4},197,{"$nulls":4},0]
[{"$nulls":4},198,{"$nulls":4},0]
[{"$nulls":4},199,{"$nulls":4},0]
[{"$nulls":4},200,{"$nulls":4},0]
[{"$nulls":4},201,{"$nulls":4},0]
[{"$nulls":4},202,{"$nulls":4},0]
[{"$nulls":4},203,{"$nulls":4},0]
[{"$nulls":4},204,{"$nulls":4},0]
[{"$nulls":4},205,{"$nulls":4},0]
[{"$nulls":4},206,{"$nulls":4},0]
[{"$nulls":4},207,{"$nulls":4},0]
[{"$nulls":4},208,{"$nulls":4},0]
[{"$nulls":4},209,{"$nulls":4},0]
[{"$nulls":4},210,{"$nulls":4},0]
[{"$nulls":4},211,{"$nulls":4},0]
[{"$nulls":4},212,{"$nulls":4},0]
[{"$nulls":4},213,{"$nulls":4},0]
[{"$nulls":4},214,{"$nulls":4},0]
[{"$nulls":4},215,{"$nulls":4},0]
[{"$nulls":4},216,{"$nulls":4},0]
[{"$nulls":4},217,{"$nulls":4},0]
[{"$nulls":4},218,{"$nulls":4},0]
[{"$nulls":4},219,{"$nulls":4},0]
[{"$nulls":4},220,{"$nulls":4},0]
[{"$nulls":4},221,{"$nulls":4},0]
[{"$nulls":4},222,{"$nulls":4},0]
[{"$nulls":4},223,{"$nulls":4},0]
[{"$nulls":4},224,{"$nulls":4},0]
[{"$nulls":4},225,{"$nulls":4},0]
[{"$nulls":4},226,{"$nulls":4},0]
[{"$nulls":4},227,{"$nulls":4},0]
[{"$nulls":4},228,{"$nulls":4},0]
[{"$nulls":4},229,{"$nulls":4},0]
[{"$nulls":4},230,{"$nulls":4},0]
[{"$nulls":4},231,{"$nulls":4},0]
[{"$nulls":4},232,{"$nulls":4},0]
[{"$nulls":4},233,{"$nulls":4},0]
[{"$nulls":4},234,{"$nulls":4},0]
[{"$nulls":4},235,{"$nulls":4},0]
[{"$nulls":4},236,{"$nulls":4},0]
[{"$nulls":4},237,{"$nulls":4},0]
[{"$nulls":4},238,{"$nulls":4},0]
[{"$nulls":4},239,{"$nulls":4},0]
[{"$nulls":4},240,{"$nulls":4},0]
[{"$nulls":4},241,{"$nulls":4},0]
[{"$nulls":4},242,{"$nulls":4},0]
[{"$nulls":4},243,{"$nulls":4},0]
[{"$nulls":4},244,{"$nulls":4},0]
[{"$nulls":4},245,{"$nulls":4},0]
[{"$nulls":4},246,{"$nulls":4},0]
[{"$nulls":4},247,{"$nulls":4},0]
[{"$nulls":4},248,{"$nulls":4},0]
[{"$nulls":4},249,{"$nulls":4},0]
[{"$nulls":4},250,{"$nulls":4},0]
[{"$nulls":4},251,{"$nulls":4},0]
[{"$nulls":4},252,{"$nulls":4},0]
[{"$nulls":4},253,{"$nulls":4},0]
[{"$nulls":4},254,{"$nulls":4},0]
[{"$nulls":4},255,{"$nulls":4},0]
[{"$nulls":4},256,{"$nulls":4},0]
[{"$nulls":4},257,{"$nulls":4},0]
[{"$nulls":4},258,{"$nulls":4},0]
[{"$nulls":4},259,{"$nulls":4},{"$f":"IF(OR(H260=5,H260=10, H260=15, H260=\"BP\",H260=\"SCR\"),\"NT\",I260)","v":0}]
[{"$nulls":4},260,{"$nulls":4},0]
[{"$nulls":4},261,{"$nulls":4},0]
[{"$nulls":4},262,{"$nulls":4},0]
[{"$nulls":4},263,{"$nulls":4},0]
[{"$nulls":4},264,{"$nulls":4},0]
[{"$nulls":4},265,{"$nulls":4},0]
[{"$nulls":4},266,{"$nulls":4},0]
[{"$nulls":4},267,{"$nulls":4},0]
[{"$nulls":4},268,{"$nulls":4},0]
[{"$nulls":4},269,{"$nulls":4},0]
[{"$nulls":4},270,{"$nulls":4},0]
[{"$nulls":4},271,{"$nulls":4},0]
[{"$nulls":4},272,{"$nulls":4},0]
[{"$nulls":4},273,{"$nulls":4},0]
[{"$nulls":4},274,{"$nulls":4},0]
[{"$nulls":4},275,{"$nulls":4},0]
[{"$nulls":4},276,{"$nulls":4},0]
[{"$nulls":4},277,{"$nulls":4},0]
[{"$nulls":4},278,{"$nulls":4},0]
[{"$nulls":4},279,{"$nulls":4},0]
[{"$nulls":4},280,{"$nulls":4},0]
[{"$nulls":4},281,{"$nulls":4},0]
[{"$nulls":4},282,{"$nulls":4},0]
[{"$nulls":4},283,{"$nulls":4},0]
[{"$nulls":4},284,{"$nulls":4},0]
[{"$nulls":4},285,{"$nulls":4},0]
[{"$nulls":4},286,{"$nulls":4},0]
[{"$nulls":4},287,{"$nulls":4},0]
[{"$nulls":4},288,{"$nulls":4},0]
[{"$nulls":4},289,{"$nulls":4},0]
[{"$nulls":4},290,{"$nulls":4},0]
[{"$nulls":4},291,{"$nulls":4},0]
[{"$nulls":4},292,{"$nulls":4},0]
[{"$nulls":4},293,{"$nulls":4},0]
[{"$nulls":4},294,{"$nulls":4},0]
[{"$nulls":4},295,{"$nulls":4},0]
[{"$nulls":4},296,{"$nulls":4},0]
[{"$nulls":4},297,{"$nulls":4},0]
[{"$nulls":4},298,{"$nulls":4},0]
[{"$nulls":4},299,{"$nulls":4},0]
[{"$nulls":4},300,{"$nulls":4},0]

{"sheet":"Open","index":2,"n_rows":504,"n_cols":19,"rows_kept":504,"cut":false,"hidden":false,"merged":[[0,0,0,14],[14,16,14,17],[16,16,16,17],[17,16,17,17],[2,16,2,17],[10,16,10,17],[11,16,11,17],[13,16,13,17]]}
[]
[]
["Futurity","Der","HS","Age Inct.","Open C/O","YOU","Per","Draw","Rider Name","Horse Name","C/O","Time","Final Time","Placing","Money Earned",null,"D Placing",null,"Split"]
[null,null,null,"S",null,null,null,287,"Donna Kay Rule","High Valor",null,15.515000000000001,null,"1D 1st",1237.32,null,"1D"]
[{"$nulls":7},271,"Schelli Creacy","Nico",null,15.672000000000001,null,"1D 2nd",1060.56,null,"2D",{"$f":"SUM(R4+0.5)","v":0.5},0.5]
[{"$nulls":7},392,"Cassidy Champlin","DG Excuse My French","O",15.731999999999999,null,"1D 3rd",883.8,null,"3D",{"$f":"SUM(R4+1)","v":1}]
[null,null,null,"S",null,null,null,256,"Jenny Zant","Raise Me Ta Fame",null,15.736000000000001,null,"1D 4th",707.04,null,"4D",{"$f":"SUM(R4+1.5)","v":1.5},0.5]
[{"$nulls":4},"X","X",null,250,"Brianna Woodmansee","CC Fancy Lil Cowgirl",null,15.747999999999999,null,"1D 5th",530.28,null,"5D",{"$f":"SUM(R4+2)","v":2},0.5]
[null,null,"X","A",null,null,null,367,"Kylee Scribner","Firewater Cartel","OAH",15.760999999999999,null,"1D 6th",412.44000000000005]
[{"$nulls":7},316,"Emery Mask","Little Powerproof",null,15.835000000000001,null,"1D 7th",353.52]
[{"$nulls":6},"X",368,"Lacy Billingsley","PV Watchmeneighneigh","OP",15.842000000000001,null,"1D 8th",294.60000000000002,null,"# Entered"]
[{"$nulls":7},393,"Lacey Harmon","Mended Heart","O",15.855,null,"1D 9th",235.68,null,{"$f":"COUNTA(I4:I504)","v":461}]
[{"$nulls":6},"X",200,"Anna Johnson","Famous Resurection",null,15.861000000000001,null,"1D 10th",176.76]
[null,null,null,"S",null,null,null,103,"Shelly Shields","Toast Ta Val",null,15.869,{"$nulls":4},"# Ran"]
[{"$nulls":7},110,"Karlee Kalberer","Krazy Karen",null,15.898,{"$nulls":4},{"$f":"COUNTA(L4:L504)","v":461}]
[null,null,"X","A",null,null,null,369,"Whitney Godinez","Im Dun Smokin Bugs","OAH",15.903]
[null,null,"X",{"$nulls":4},370,"Hallie Hannsen","Jesswatchmestreak","OH",15.916,{"$nulls":4},"# Left"]
[null,null,null,"A",null,null,null,371,"Kelly Allen","Miss JB 165","OA",15.943,{"$nulls":4},{"$f":"$Q$12-$Q$15","v":0}]
[{"$nulls":7},416,"Fonda Melby","Fling The French","O",15.951000000000001,{"$f":"IF(OR(K19=5,K19=10, K19=15, K19=\"BP\",K19=\"SCR\"),\"NT\",L19)","v":15.951000000000001}]
[{"$nulls":7},394,"Sharin Hall","Rare Packin Six","O",15.97]
[{"$nulls":4},"X","X",null,10,"Oceane Veilleux","DR Rise N Shine",null,15.973000000000001]
[{"$nulls":7},246,"Brandee Hawkins","Max",null,15.977]
[{"$nulls":7},164,"Kyra Boling","Teninas Hayday",null,15.984]
[{"$nulls":4},"X","X",null,172,"Kate Neill","SHS Short Go Ike",null,15.993]
[{"$nulls":7},53,"Cierra Melby","SR Plainlyimspecial",null,16.004999999999999]
[{"$nulls":7},162,"Brooke Sully","EZ Shake Em",null,16.006]
[null,null,null,"S",null,null,null,228,"Sherri Barnes","Racing For Perks",null,16.027000000000001,null,"2D 1st",1031.0999999999999]
[null,null,null,"A",null,null,null,232,"Jamie Wilson","A Streak Of Phame",null,16.038,null,"2D 2nd",883.8]
[{"$nulls":7},417,"Molli Montgomery","The Woman Loves Fame","O",16.041,{"$f":"IF(OR(K29=5,K29=10, K29=15, K29=\"BP\",K29=\"SCR\"),\"NT\",L29)","v":16.041},"2D 3rd",736.5]
[{"$nulls":7},372,"Molli Montgomery","This Fling Is Famous","O",16.045999999999999,null,"2D 4th",589.19999999999993]
[{"$nulls":7},418,"Hallie Hannsen","Epic Calendar Girl","O",16.052,{"$f":"IF(OR(K31=5,K31=10, K31=15, K31=\"BP\",K31=\"SCR\"),\"NT\",L31)","v":16.052},"2D 5th",441.9]
[{"$nulls":7},395,"Karri McKim","Firen Ta Fame","O",16.056999999999999,null,"2D 6th",343.70000000000005]
[{"$nulls":7},373,"Ashley Schafer","Our Bobby McGee","O",16.061,null,"2D 7th",294.59999999999997]
[null,null,null,"S",null,null,null,262,"Sherri Barnes","Famous Lil Jet",null,16.07,null,"2D 8th",245.5]
[{"$nulls":7},419,"Kylie Bowles","Slick A Lena","O",16.093,{"$f":"IF(OR(K35=5,K35=10, K35=15, K35=\"BP\",K35=\"SCR\"),\"NT\",L35)","v":16.093},"2D 9th/10th",172]
[null,null,null,"S",null,null,null,85,"Tammy Rokus","Mitey Confederate",null,16.093,null,"2D 9th/10th",172]
[{"$nulls":6},"X",300,"Jesse Harris","Running For Honors",null,16.103000000000002]
[{"$nulls":4},"X","X",null,1,"Tristan Bowles","Short Oakie Lena",null,16.106999999999999]
[{"$nulls":7},12,"Molli Montgomery","Star N Blazin Fame",null,16.114999999999998]
[{"$nulls":7},396,"Cassidy Champlin","Wood Bea French Girl","O",16.125]
[{"$nulls":7},341,"Kailey Dement","Jess Plain Fast",null,16.129000000000001]
[null,null,null,"A",null,null,null,268,"Jamie Wilson","Check Your Bet",null,16.135000000000002]
[null,null,"X","A",null,null,null,27,"Jimmie Smith","Lever Action",null,16.135000000000002]
[{"$nulls":7},329,"Kaden Burger","Montanas Blue Drift",null,16.137]
[{"$nulls":7},16,"Kyle Leleux","Unconquered Fame",null,16.137]
[null,null,null,"S",null,null,null,73,"Kathy Rush","JL Twisted Roc",null,16.145]
[{"$nulls":7},61,"Shannon Black","MR Rambo Remedy",null,16.148]
[{"$nulls":7},420,"Sharin Hall","Rocket Fire Ta Fame","O",16.175999999999998,{"$f":"IF(OR(K48=5,K48=10, K48=15, K48=\"BP\",K48=\"SCR\"),\"NT\",L48)","v":16.175999999999998}]
[null,null,"X",{"$nulls":4},29,"Shelby Stansbury","One Tuf Knight",null,16.178000000000001]
[null,null,null,"S",null,null,null,150,"Lisa Wernli","Flashs Fine Effort",null,16.189]
[{"$nulls":7},421,"Sierra Melby","Aflingwithfreckles","O",16.189,{"$f":"IF(OR(K51=5,K51=10, K51=15, K51=\"BP\",K51=\"SCR\"),\"NT\",L51)","v":16.189}]
[null,null,null,"A",null,null,null,176,"Jennifer Cullen","HLC Pretty Lil Sugar",null,16.193999999999999]
[{"$nulls":7},147,"Karlee Kalberer","Turbo Streaker",null,16.202000000000002]
[{"$nulls":7},98,"Kara Kreder","Ketels Fast Gal",null,16.204999999999998]
[{"$nulls":7},397,"Kara Kreder","Dreams Of Fame","O",16.207999999999998]
[{"$nulls":7},121,"Kyle Leleux","Sensational",null,16.209]
[null,null,null,"S",null,null,null,87,"Denny Ralls","SV Southern Comfort",null,16.21]
[{"$nulls":7},422,"Scamper Cole","French Stinson","O",16.216000000000001,{"$f":"IF(OR(K58=5,K58=10, K58=15, K58=\"BP\",K58=\"SCR\"),\"NT\",L58)","v":16.216000000000001}]
[{"$nulls":6},"X",251,"Delaney Siebert","Guys Classy Colours",null,16.222000000000001]
[{"$nulls":6},"X",291,"KK Rule","A Juicy Adventure",null,16.222999999999999]
[{"$nulls":4},"X","X",null,284,"Josie Jartmann","Hes Honor",null,16.224]
[{"$nulls":7},254,"Becki Mask","Daddys Lil Diva",null,16.233000000000001]
[{"$nulls":4},"X","X",null,423,"Skylar Eisinger","All Bugged Up","OY",16.233000000000001,{"$f":"IF(OR(K63=5,K63=10, K63=15, K63=\"BP\",K63=\"SCR\"),\"NT\",L63)","v":16.233000000000001}]
[{"$nulls":7},424,"Lacey Harmon","Rumoure Has It","O",16.234999999999999,{"$f":"IF(OR(K64=5,K64=10, K64=15, K64=\"BP\",K64=\"SCR\"),\"NT\",L64)","v":16.234999999999999}]
[{"$nulls":7},140,"Candie Wolf","Kits Texas Taxi",null,16.239999999999998]
[{"$nulls":7},70,"Jenna Napier","Kings Duke",null,16.245000000000001]
[{"$nulls":7},425,"Tallaney Clark","Perks Hickory Cat","O",16.248999999999999,{"$f":"IF(OR(K67=5,K67=10, K67=15, K67=\"BP\",K67=\"SCR\"),\"NT\",L67)","v":16.248999999999999}]
[{"$nulls":7},398,"Rylee Shields","Furys Princess","O",16.251000000000001]
[null,null,null,"A",null,null,null,43,"Stephanie Fryar","The Red Maserati",null,16.251000000000001]
[null,null,null,"A",null,null,null,399,"Boo Burttschell","The Great Gatsby","OA",16.263000000000002]
[{"$nulls":6},"X",243,"Fallon Forbes","Another Bug Leo",null,16.271000000000001]
[{"$nulls":7},426,"Rylee Shields","Im Ferious 123","O",16.276,{"$f":"IF(OR(K72=5,K72=10, K72=15, K72=\"BP\",K72=\"SCR\"),\"NT\",L72)","v":16.276}]
[{"$nulls":7},279,"Kayli Morris","Fortune In Fuel",null,16.277000000000001]
[{"$nulls":7},374,"Odale Comer","Bullie In LA ","O",16.279]
[{"$nulls":7},427,"Abigail Plants","KN Baileys Sidecar","O",16.291,{"$f":"IF(OR(K75=5,K75=10, K75=15, K75=\"BP\",K75=\"SCR\"),\"NT\",L75)","v":16.291}]
[{"$nulls":7},143,"Jancie Shelburne","XN Dot Bogie",null,16.292999999999999]
[{"$nulls":7},242,"Candie Wolf","Pleasin Pandalita",null,16.298999999999999]
[{"$nulls":7},375,"Ashley Schafer","French Streakin Slew","O",16.303000000000001]
[{"$nulls":7},428,"Hallie Hannsen","UX Swayzi Stinson","O",16.306000000000001,{"$f":"IF(OR(K79=5,K79=10, K79=15, K79=\"BP\",K79=\"SCR\"),\"NT\",L79)","v":16.306000000000001}]
[{"$nulls":7},429,"Molli Montgomery","SV Dudewheresmysocks","O",16.317,{"$f":"IF(OR(K80=5,K80=10, K80=15, K80=\"BP\",K80=\"SCR\"),\"NT\",L80)","v":16.317}]
[{"$nulls":7},376,"Chelsea Bartlett","Whynotmetoo","O",16.318999999999999]
[{"$nulls":7},168,"Kathy Warren","Promise Me Sunshine",null,16.32]
[null,null,null,"S",null,null,null,56,"Trina Murray","Fuel For Dash",null,16.321000000000002]
[{"$nulls":7},430,"Ashley Schafer","KN Harley Quinn","O",16.323,{"$f":"IF(OR(K84=5,K84=10, K84=15, K84=\"BP\",K84=\"SCR\"),\"NT\",L84)","v":16.323}]
[null,null,null,"A",null,null,"X",30,"Savannah Hays","Perkzilla",null,16.327999999999999]
[{"$nulls":7},50,"Kyle Leleux","Ima Famous Scarlett",null,16.34]
[{"$nulls":7},431,"Caroline Boucher","MP Hot Hayday","O",16.343,{"$f":"IF(OR(K87=5,K87=10, K87=15, K87=\"BP\",K87=\"SCR\"),\"NT\",L87)","v":16.343}]
[{"$nulls":7},432,"Kyle Leleux","Dollys Streakin Badger","O",16.344000000000001,{"$f":"IF(OR(K88=5,K88=10, K88=15, K88=\"BP\",K88=\"SCR\"),\"NT\",L88)","v":16.344000000000001}]
[{"$nulls":4},"X","X",null,194,"Trinity Beauvais","Eyes Okey Dokey",null,16.344000000000001]
[{"$nulls":7},324,"Emily Williams","Heza Froster Charm",null,16.353000000000002]
[{"$nulls":7},88,"Kyle Leleux","Guys Shakem Up",null,16.356000000000002]
[null,null,null,"A",null,null,null,68,"Tawnie Vander Lans","TS Return N Hayday",null,16.356999999999999]
[{"$nulls":7},11,"Misty Peek","Amos",null,16.359000000000002]
[{"$nulls":6},"X",280,"Nadia Defelice","Downrite Spectacular",null,16.361999999999998]
[{"$nulls":7},37,"Cassidy Teague","Jess Move You",null,16.367000000000001]
[{"$nulls":4},"X","X",null,6,"Hevenli Scribner","JSHLucky Bottom Roy",null,16.367999999999999]
[{"$nulls":7},26,"Kylie Bowles","Miracle Christmas",null,16.367999999999999]
[{"$nulls":7},433,"Bo Hill","Jakk","O",16.370999999999999,{"$f":"IF(OR(K98=5,K98=10, K98=15, K98=\"BP\",K98=\"SCR\"),\"NT\",L98)","v":16.370999999999999}]
[null,null,"X","A",null,null,null,107,"Ashley Watson","First Down Hooter",null,16.385000000000002]
[{"$nulls":7},434,"Caroline Boucher","Streakin Lil Fling","O",16.385999999999999,{"$f":"IF(OR(K100=5,K100=10, K100=15, K100=\"BP\",K100=\"SCR\"),\"NT\",L100)","v":16.385999999999999}]
[{"$nulls":7},400,"Shelly Shields","Streakers Queen","O",16.393000000000001]
[{"$nulls":7},435,"Shelly Shields","Tres French Kiss","O",16.396999999999998,{"$f":"IF(OR(K102=5,K102=10, K102=15, K102=\"BP\",K102=\"SCR\"),\"NT\",L102)","v":16.396999999999998}]
[{"$nulls":7},102,"Rylee Shields","Cheyennes Fab",null,16.398]
[null,null,null,"S",null,null,null,82,"Jolene Jones","Peppys Streakof Fame",null,16.399999999999999]
[null,null,null,"A",null,null,null,265,"Faith Ross","Kuhl Calvin",null,16.402999999999999]
[{"$nulls":7},97,"Tallaney Clark","Mr Tres A Bug",null,16.402999999999999]
[{"$nulls":7},94,"Courtney Worthington","CM Bubblin Barbie",null,16.404]
[{"$nulls":7},436,"Hallie Hannsen","Seis Wild","O",16.41,{"$f":"IF(OR(K108=5,K108=10, K108=15, K108=\"BP\",K108=\"SCR\"),\"NT\",L108)","v":16.41}]
[{"$nulls":7},377,"Caroline Boucher","Jet To The Sun","O",16.420999999999999]
[{"$nulls":7},181,"Cassidy Thomas","MC Miss Windy",null,16.422999999999998]
[{"$nulls":7},136,"Chelsea Bartlett","Frenchie",null,16.425999999999998]
[{"$nulls":7},378,"Shelby Stansbury","KC Moonshine Over Rocs","O",16.434000000000001]
[{"$nulls":7},99,"Abigail Plants","Playin In Traffic",null,16.437000000000001]
[{"$nulls":7},238,"Marylene Menard","VF Walnut Pie",null,16.440000000000001]
[{"$nulls":7},40,"Tallaney Clark","Fortune",null,16.442]
[{"$nulls":7},47,"Courtney Worthington","CM Bubblin Dynamite",null,16.443000000000001]
[{"$nulls":7},379,"Joao Leao ","Flos Hush Money","O",16.446999999999999]
[{"$nulls":7},204,"Hanna Trimber","Eye Jess Zoomed Bye",null,16.448]
[{"$nulls":7},283,"Jackie Dalchow","Cat Scratchen",null,16.456]
[{"$nulls":6},"X",401,"Jamie Olsen","Miss Famous Beduino","OP",16.456]
[{"$nulls":4},"X","X",null,111,"Kate Neill","NF French Tigger",null,16.46]
[{"$nulls":7},274,"Kaden Burger","Turbos French Zip",null,16.468]
[{"$nulls":6},"X",331,"Shelly Lilley","Winston",null,16.472000000000001]
[{"$nulls":4},"X","X",null,302,"Paige Clayton","Imafrenchcaptain",null,16.484999999999999]
[{"$nulls":7},437,"Fonda Melby","RF Back For The Cash","O",16.489000000000001,{"$f":"IF(OR(K125=5,K125=10, K125=15, K125=\"BP\",K125=\"SCR\"),\"NT\",L125)","v":16.489000000000001}]
[{"$nulls":7},39,"Louis Paradis","Purrfect Choice",null,16.489000000000001]
[{"$nulls":7},438,"Sierra Melby","VF Victoria Stinson","O",16.489999999999998,{"$f":"IF(OR(K127=5,K127=10, K127=15, K127=\"BP\",K127=\"SCR\"),\"NT\",L127)","v":16.489999999999998}]
[{"$nulls":7},339,"Keenan Best","Nick Bar Bullett",null,16.501000000000001]
[{"$nulls":4},"X","X",null,402,"Oceane Veilleux","KN Bam Special","OY",16.512]
[null,null,null,"A",null,null,null,380,"Stephanie Fryar","Special Bid Of Frost","OA",16.521000000000001,null,"3D 1st",824.88]
[{"$nulls":7},439,"Cassidy Teague","RLC Gone Streakin","O",16.526,{"$f":"IF(OR(K131=5,K131=10, K131=15, K131=\"BP\",K131=\"SCR\"),\"NT\",L131)","v":16.526},"3D 2nd/3rd",589.19999999999993]
[{"$nulls":7},269,"Lisa Lucia","Sticks Chic",null,16.526,null,"3D 2nd/3rd",707.04]
[{"$nulls":6},"X",165,"Michelle Tyler","KissesFOrCaris",null,16.527000000000001,null,"3D 4th",471.35999999999996]
[{"$nulls":7},307,"Jaden Fettig","Pistol",null,16.533999999999999,null,"3D 5th",353.52]
[{"$nulls":7},127,"Kyra Boling","Shesa Heaven Sent",null,16.536999999999999,null,"3D 6th",274.96000000000004]
[null,null,null,"A",null,null,null,298,"Jennifer Abbott","Wendall Jackson",null,16.539000000000001,null,"3D 7th",235.67999999999998]
[{"$nulls":5},"X",null,55,"Brinley Howard","Lil Bid Of Flit",null,16.541,null,"3D 8th",196.4]
[null,null,null,"A",null,null,null,403,"Janee' Ornelas","Peter Wabbitt","OA",16.548999999999999,{"$f":"IF(OR(K138=5,K138=10, K138=15, K138=\"BP\",K138=\"SCR\"),\"NT\",L138)","v":16.548999999999999},"3D 9th",157.12]
[null,null,null,"A",null,null,null,241,"Leslie Rickman","Festus Dun It",null,16.553999999999998,null,"3D 10th",117.83999999999999]
[{"$nulls":7},321,"Tori Morris","Oscar",null,16.568999999999999]
[{"$nulls":7},151,"Holly Pritchard","Bogies French Moon",null,16.571999999999999]
[{"$nulls":7},277,"Kendra Feaser","She Run For Cash",null,16.574000000000002]
[{"$nulls":7},381,"Kassie Rieken","SO Ima Famous Guy","O",16.576000000000001]
[{"$nulls":7},440,"Jennifer Burgess","IFIWASUIDWANNABEME 2","O",16.579000000000001,{"$f":"IF(OR(K144=5,K144=10, K144=15, K144=\"BP\",K144=\"SCR\"),\"NT\",L144)","v":16.579000000000001}]
[{"$nulls":7},345,"Janee' Ornelas","BQX TX Streaktorodeo","O",16.579999999999998]
[null,null,null,"S",null,null,null,67,"Tracie Schoenthal","Gunsnfirewater",null,16.579999999999998]
[{"$nulls":7},442,"Keely Perkins","Wahinis In Bikinis","O",16.582999999999998,{"$f":"IF(OR(K147=5,K147=10, K147=15, K147=\"BP\",K147=\"SCR\"),\"NT\",L147)","v":16.582999999999998}]
[null,null,null,"A",null,null,null,309,"Megan Epperson","Kama Woodbridge",null,16.591000000000001]
[null,null,null,"A",null,null,null,145,"Jennifer Cullen","Chasin Annie Fame",null,16.591999999999999]
[null,null,null,"A",null,null,null,404,"Sarah Peters","Rockin My Fame","OA",16.603999999999999,{"$f":"IF(OR(K150=5,K150=10, K150=15, K150=\"BP\",K150=\"SCR\"),\"NT\",L150)","v":16.603999999999999}]
[null,null,null,"S",null,null,null,77,"Simone Elmore","Badger A Conchadrift",null,16.603999999999999]
[null,null,null,"S",null,null,null,294,"Jo Kirby","Heavenly Joak",null,16.614999999999998]
[{"$nulls":7},292,"Irene Feaser","Cant Bye Fame",null,16.619]
[null,null,null,"A",null,null,"X",230,"Lindsey Stevens","JM I Got Faith",null,16.623999999999999]
[{"$nulls":7},208,"Candie Wolf","Buggem Down Kelly",null,16.641999999999999]
[{"$nulls":7},443,"Shelly Shields","Streakingaround NBack","O",16.641999999999999,{"$f":"IF(OR(K156=5,K156=10, K156=15, K156=\"BP\",K156=\"SCR\"),\"NT\",L156)","v":16.641999999999999}]
[null,null,null,"A",null,null,"X",295,"Keley Bissett","Diamond Bar Flit",null,16.645]
[{"$nulls":7},264,"Sara Redden","Pedro",null,16.646999999999998]
[{"$nulls":4},"X","X",null,239,"Stormi Branch","Pretty Theory",null,16.651]
[{"$nulls":7},444,"Fonda Melby","Fiddle Me To Gold","O",16.652000000000001,{"$f":"IF(OR(K160=5,K160=10, K160=15, K160=\"BP\",K160=\"SCR\"),\"NT\",L160)","v":16.652000000000001}]
[{"$nulls":7},445,"Lindsey Sears","SME One Of A Kind","O",16.655999999999999,{"$f":"IF(OR(K161=5,K161=10, K161=15, K161=\"BP\",K161=\"SCR\"),\"NT\",L161)","v":16.655999999999999}]
[{"$nulls":7},382,"Jessica Lear","GL Fly Girl","O",16.661000000000001]
[{"$nulls":7},203,"Bridget Conlee","Tri Zippo Charger",null,16.661999999999999]
[null,null,null,"S",null,null,null,188,"Jana Kurosky","Winnies Red kai",null,16.664000000000001]
[null,null,null,"S",null,null,null,48,"Karen Davis","Funderous Frost",null,16.681000000000001]
[{"$nulls":7},263,"Caitlin Loomis","Gold Mines Quien",null,16.683]
[null,null,null,"A",null,null,null,258,"Traci Ross","Brady",null,16.684000000000001]
[{"$nulls":7},170,"Bridget Conlee","LazyKSthirtypeppers",null,16.687999999999999]
[{"$nulls":7},60,"Rylee Shields","Mutton Bustin",null,16.693000000000001]
[{"$nulls":7},446,"Jennifer Burgess","Streakin Dynamo","O",16.702000000000002,{"$f":"IF(OR(K170=5,K170=10, K170=15, K170=\"BP\",K170=\"SCR\"),\"NT\",L170)","v":16.702000000000002}]
[{"$nulls":7},109,"Jancie Shelburne","Ima Chrome Cowboy",null,16.707000000000001]
[null,null,null,"S",null,null,null,146,"Gretchen Goedeken","Pretty Bay Pony",null,16.71]
[{"$nulls":7},124,"Lee Barron","Xtra Splash N Go",null,16.712]
[null,null,null,"S",null,null,null,35,"Jolene Jones","Capone",null,16.721]
[{"$nulls":7},447,"Cassidy Teague","On The Run With a Gun","O",16.73,{"$f":"IF(OR(K175=5,K175=10, K175=15, K175=\"BP\",K175=\"SCR\"),\"NT\",L175)","v":16.73}]
[null,null,null,"A",null,null,null,305,"Leslie Rickman","Autimns Catty Mate",null,16.73]
[{"$nulls":7},320,"Danica Hoppman","Play It Boon",null,16.734999999999999]
[{"$nulls":7},15,"Maddie Dewberry","Tucker Mint Fancy",null,16.739999999999998]
[null,null,null,"A",null,null,null,252,"Sydney Frey","Sid Frey",null,16.744]
[{"$nulls":4},"X","X",null,323,"Abigail Wicker","Talk To Me Goose",null,16.756]
[{"$nulls":7},448,"Josh Seeger","Wins Famous Lady","O",16.760000000000002,{"$f":"IF(OR(K181=5,K181=10, K181=15, K181=\"BP\",K181=\"SCR\"),\"NT\",L181)","v":16.760000000000002}]
[null,null,null,"A",null,null,null,449,"Whitney Godinez","Chilla On The Rocks","OA",16.763000000000002,{"$f":"IF(OR(K182=5,K182=10, K182=15, K182=\"BP\",K182=\"SCR\"),\"NT\",L182)","v":16.763000000000002}]
[{"$nulls":7},240,"Steely Steiner","Oakies Little Check",null,16.765000000000001]
[{"$nulls":7},405,"Brandi Felder","Graves Leavin Tucson","O ",16.766999999999999,{"$f":"IF(OR(K184=5,K184=10, K184=15, K184=\"BP\",K184=\"SCR\"),\"NT\",L184)","v":16.766999999999999}]
[{"$nulls":7},450,"Wyatt Paul","MJ Condo Cowboy","O",16.768999999999998,{"$f":"IF(OR(K185=5,K185=10, K185=15, K185=\"BP\",K185=\"SCR\"),\"NT\",L185)","v":16.768999999999998}]
[{"$nulls":7},210,"Fallon Forbes","Perksontherocks",null,16.77]
[{"$nulls":4},"X","X",null,227,"Salem Brooks","Sugas Smooth Duke",null,16.792999999999999]
[{"$nulls":7},169,"Connie Randolph","Hot Rod Kitty Catt",null,16.797000000000001]
[{"$nulls":7},134,"Cassidy Thomas","Ladys Moon Fire",null,16.797999999999998]
[{"$nulls":7},306,"Ashlyn Williams","Sweet Day To Fly",null,16.798999999999999]
[{"$nulls":7},226,"Blair Aaron","Smooth Fortune",null,16.806000000000001]
[{"$nulls":7},59,"Casey Hammons","BH Trip Ta Fame",null,16.808]
[{"$nulls":4},"X","X",null,344,"Hadley Durfey","One Smooth Kelly",null,16.818000000000001]
[{"$nulls":4},"x","X",null,273,"Jolie Smith","Bartender Nics",null,16.826000000000001]
[{"$nulls":7},38,"Josh Seeger","Cival War Hero",null,16.832999999999998]
[null,null,null,"A",null,null,null,78,"Savannah Hays","Ultimate Barley",null,16.837]
[{"$nulls":4},"X","X",null,383,"Oceane Veilleux","KN Snap Back","OY",16.838000000000001]
[{"$nulls":7},132,"Lacy Matthews","Shilohs Perky Pistol",null,16.853000000000002]
[null,null,null,"A",null,null,null,106,"Sydney Swatsell","Feature Me Firin",null,16.858000000000001]
[{"$nulls":4},"X","X",null,357,"Abigail Wicker","So Guys Top Stick",null,16.869]
[{"$nulls":7},175,"Abby Fields","Felix",null,16.884]
[null,null,null,"A",null,null,null,49,"Jimmie Smith","Traffic Kat",null,16.885999999999999]
[null,null,null,"S",null,null,null,255,"Kathy Vazquez","Sail On Ta Fame",null,16.887]
[{"$nulls":7},451,"Cassidy Teague","Fabs Little Rose","O",16.89,{"$f":"IF(OR(K204=5,K204=10, K204=15, K204=\"BP\",K204=\"SCR\"),\"NT\",L204)","v":16.89}]
[{"$nulls":4},"X","X",null,206,"Stormi Branch","Demon",null,16.896000000000001]
[null,null,null,"S",null,null,null,452,"Jolene Jones","Mark Me Angels","OS",16.899000000000001,{"$f":"IF(OR(K206=5,K206=10, K206=15, K206=\"BP\",K206=\"SCR\"),\"NT\",L206)","v":16.899000000000001}]
[{"$nulls":7},340,"Terri Ford","Injun Needs Cash",null,16.916]
[{"$nulls":7},312,"Miranda Youngblood","Wright For Gold",null,16.917000000000002]
[{"$nulls":7},237,"Royce Romberg","Chasin Fireflies",null,16.925000000000001]
[{"$nulls":4},"X","X",null,286,"Addison Byars","CinchMeUpTaWin",null,16.931000000000001]
[null,null,null,"S",null,null,null,32,"Renee Osborne","Hurricane",null,16.931999999999999]
[{"$nulls":7},25,"Michaela Robertson","EZ On The Dynamite",null,16.936]
[{"$nulls":4},"X","X",null,7,"Bella Blaylock","Wildfires Golden Drift",null,16.943000000000001]
[{"$nulls":7},45,"Taylor Langle","Traffic Flame",null,16.943999999999999]
[{"$nulls":7},453,"Chelsea Bartlett","EJ Flirty French Girl","O",16.946000000000002,{"$f":"IF(OR(K215=5,K215=10, K215=15, K215=\"BP\",K215=\"SCR\"),\"NT\",L215)","v":16.946000000000002}]
[{"$nulls":7},244,"Pauline Robertson","Flittin With Disaster",null,16.95]
[{"$nulls":4},"X","X",null,229,"Hayva Hawkins","Shotgun",null,16.954999999999998]
[null,null,null,"A",null,null,null,454,"Tiffany Durham","Stolin Rubies","OA",16.957000000000001,{"$f":"IF(OR(K218=5,K218=10, K218=15, K218=\"BP\",K218=\"SCR\"),\"NT\",L218)","v":16.957000000000001}]
[{"$nulls":4},"X","X",null,199,"Haley King","Playboy",null,16.957999999999998]
[{"$nulls":7},293,"Kristin Dorman","Easy",null,16.959]
[{"$nulls":7},93,"Llsa Longerich","Cash N The Bar",null,16.963000000000001]
[null,null,null,"S",null,null,null,191,"Lisa Wernli","Babe on The Run",null,16.966000000000001]
[null,null,null,"A",null,null,null,303,"Nicole Buell","Dirty Money",null,16.97]
[{"$nulls":7},455,"Jordan Moore-Miller","TR Famous Badger","O",16.978999999999999,{"$f":"IF(OR(K224=5,K224=10, K224=15, K224=\"BP\",K224=\"SCR\"),\"NT\",L224)","v":16.978999999999999}]
[{"$nulls":7},384,"Maddie Dewberry","Flights Quick Chick","O",16.992000000000001]
[{"$nulls":7},456,"Taylor Langle","Snakin Thru Traffic","O",16.998999999999999,{"$f":"IF(OR(K226=5,K226=10, K226=15, K226=\"BP\",K226=\"SCR\"),\"NT\",L226)","v":16.998999999999999}]
[{"$nulls":7},22,"Andrea Cline","Louisianna Shakedown",null,17.007000000000001]
[null,null,null,"S",null,null,null,457,"Renee Douglas","Ticket Ta Fame","OS",17.009,{"$f":"IF(OR(K228=5,K228=10, K228=15, K228=\"BP\",K228=\"SCR\"),\"NT\",L228)","v":17.009}]
[{"$nulls":7},328,"Amanda Jermstad","Flit",null,17.012]
[{"$nulls":7},183,"Jamie Jo McLaughlin","Flint",null,17.016999999999999,null,"4D 1st",618.66]
[null,null,null,"A",null,null,"X",406,"Randi Roberts","Boom Slicka Boom","OAP",17.018999999999998,{"$f":"IF(OR(K231=5,K231=10, K231=15, K231=\"BP\",K231=\"SCR\"),\"NT\",L231)","v":17.018999999999998},"4D 2nd",530.28]
[{"$nulls":7},157,"Jessica Beauvais","DL Miss Feintastic",null,17.033999999999999,null,"4D 3rd",441.9]
[{"$nulls":7},148,"Nikki Morrison","Shining For The Boys",null,17.039000000000001,null,"4D 4th",353.52]
[{"$nulls":7},458,"Kara Kreder","ZZI Rojo Magic","O",17.050999999999998,{"$f":"IF(OR(K234=5,K234=10, K234=15, K234=\"BP\",K234=\"SCR\"),\"NT\",L234)","v":17.050999999999998},"4D 5th",265.14]
[{"$nulls":4},"X","X",null,51,"Bella Blaylock","Lucy",null,17.059000000000001,null,"4D 6th",206.22000000000003]
[{"$nulls":4},"X","X",null,221,"Jolie Smith","Ms Hollywood Delight",null,17.07,null,"4D 7th",176.76]
[{"$nulls":7},116,"Patti Reardon","HeCome Dun",null,17.074999999999999,null,"4D 8th",147.30000000000001]
[{"$nulls":7},138,"Hanna Trimber","Eye Jess Winn",null,17.082999999999998,null,"4D 9th",117.84]
[{"$nulls":7},86,"Josh Seeger","Baritas Code Red",null,17.087,null,"4D 10th",88.38]
[{"$nulls":7},245,"Gretchen Goedeken","Fine Whatever",null,17.097000000000001]
[{"$nulls":7},14,"Dale Long","Famous Dash Ta Vegas",null,17.106999999999999]
[{"$nulls":7},459,"Ashley Schafer","Famous Cash Can","O",17.113,{"$f":"IF(OR(K242=5,K242=10, K242=15, K242=\"BP\",K242=\"SCR\"),\"NT\",L242)","v":17.113}]
[{"$nulls":7},217,"Diana Stark","Extreme Meganser",null,17.117999999999999]
[{"$nulls":4},"X","X",null,342,"Hadley Durfey","Delightful Brownies",null,17.117999999999999]
[null,null,null,"S",null,null,null,215,"Julie Wright","Neolas Ned",null,17.126999999999999]
[{"$nulls":7},69,"Nicole Stageman","Ms Texann Firewater",null,17.126999999999999]
[{"$nulls":7},54,"Jade Crago","VB Fire Ta Fame",null,17.134]
[null,null,null,"A",null,null,null,322,"Becky Dockery","Power Of A Faithman",null,17.146000000000001]
[null,null,null,"A",null,null,null,5,"Jesse Budd","Flicker Nic",null,17.151]
[{"$nulls":7},66,"Krista Lucas Wynn","TBR Streak Of Perks",null,17.154]
[{"$nulls":7},336,"Hannah Jermstad","Ruby",null,17.155000000000001]
[null,null,null,"S",null,null,null,163,"Lisa Corey","Beda Dream",null,17.158000000000001]
[{"$nulls":7},80,"Renee Osborne","Reagan",null,17.158000000000001]
[{"$nulls":7},131,"Glenda Barnett","Ready Set GO Girl ",null,17.158999999999999]
[null,null,null,"A",null,null,null,460,"Mary Van Cleve","This Buds For Fame","OA",17.164999999999999,{"$f":"IF(OR(K255=5,K255=10, K255=15, K255=\"BP\",K255=\"SCR\"),\"NT\",L255)","v":17.164999999999999}]
[null,null,null,"A",null,null,null,205,"Kaylyn Smith","Bet She Can Fly",null,17.172999999999998]
[{"$nulls":4},"X","X",null,178,"Chloe Powell","Blessing",null,17.181999999999999]
[{"$nulls":7},34,"Jessica Lear","AO Bye Bye Lola",null,17.187999999999999]
[{"$nulls":5},"X",null,135,"Addison Steed","Commander",null,17.204999999999998]
[{"$nulls":7},137,"Bridget Conlee","Shining Chex Bar",null,17.216999999999999]
[null,null,null,"A",null,null,null,57,"Tiffany Durham","Colones Kerosene",null,17.22]
[{"$nulls":4},"X","X",null,130,"Kyla Morris","Belle",null,17.231999999999999]
[{"$nulls":7},139,"Hollie Sirman","Easter Bunny Special",null,17.242999999999999]
[{"$nulls":5},"X",null,96,"Brinley Howard","Whoneedsfameimfrench",null,17.248000000000001]
[{"$nulls":7},115,"Nikki Morrison","Bodacious Biankus",null,17.25]
[{"$nulls":7},128,"Shelbey Eklund","CSV Draw Seven Cards",null,17.260999999999999]
[{"$nulls":6},"X",319,"Summer Tharp","Barley",null,17.263000000000002]
[null,null,null,"S",null,null,null,216,"Bill Barber","Cruzn OnA Jet",null,17.263999999999999]
[{"$nulls":4},"X","X",null,122,"Trinity Joiner","HighOnBrownWhiskey",null,17.27]
[{"$nulls":7},19,"Carly Peercy","Memphis",null,17.271999999999998]
[null,null,null,"A",null,null,null,275,"Whitney Baton","Flit En Chic",null,17.285]
[{"$nulls":7},23,"Randi Knudson","ShakeNBake By Stoli",null,17.294]
[{"$nulls":7},407,"Fonda Melby","A Fling With A Sting","O",17.295000000000002,{"$f":"IF(OR(K273=5,K273=10, K273=15, K273=\"BP\",K273=\"SCR\"),\"NT\",L273)","v":17.295000000000002}]
[{"$nulls":7},461,"Scamper Cole","Cartels Lil Secert","O",17.306000000000001,{"$f":"IF(OR(K274=5,K274=10, K274=15, K274=\"BP\",K274=\"SCR\"),\"NT\",L274)","v":17.306000000000001}]
[{"$nulls":7},41,"Abigail Plants","KN Stopbuginmebailey",null,17.306999999999999]
[{"$nulls":7},462,"Odale Comer","Trump Train La Fame","O",17.306999999999999,{"$f":"IF(OR(K276=5,K276=10, K276=15, K276=\"BP\",K276=\"SCR\"),\"NT\",L276)","v":17.306999999999999}]
[{"$nulls":7},76,"Becca Felman","Jesses Coronas",null,17.324999999999999]
[{"$nulls":4},"X","X",null,83,"Abby Taylor","Joselina",null,17.327999999999999]
[{"$nulls":7},198,"Gretchen Goedeken","Spots In My Dreams",null,17.344000000000001]
[null,null,null,"S",null,null,null,42,"Leann Wills","Shoot Yeah Shes Sassy",null,17.346]
[{"$nulls":7},285,"Chery Pinkston","Heza Beach Bug",null,17.356999999999999]
[{"$nulls":7},463,"Kylee Scribner","Firewater Rey","O",17.356999999999999,{"$f":"IF(OR(K282=5,K282=10, K282=15, K282=\"BP\",K282=\"SCR\"),\"NT\",L282)","v":17.356999999999999}]
[null,null,null,"S",null,null,null,352,"Carole Lynn Newsome","Pistol",null,17.381]
[{"$nulls":5},"X",null,101,"Collynz Sanders","Liberty",null,17.384]
[{"$nulls":7},158,"Kelsey Howard","Triple Gold Time",null,17.388000000000002]
[{"$nulls":7},464,"Cassidy Champlin","TDZ Toast The Wind","O",17.407,{"$f":"IF(OR(K286=5,K286=10, K286=15, K286=\"BP\",K286=\"SCR\"),\"NT\",L286)","v":17.407}]
[{"$nulls":7},81,"Michaela Robertson","CM Platinum Dondi",null,17.408999999999999]
[{"$nulls":7},330,"Sierra Clanton","Fulla Bull N Cactus",null,17.417000000000002]
[{"$nulls":7},112,"Shambrae Williams","Sakem Frost",null,17.431999999999999]
[{"$nulls":7},52,"Emily Greer","TF Speedy Wood Dyna ",null,17.446000000000002]
[null,null,null,"A",null,null,null,289,"Sydney Frey","Ballarina",null,17.446999999999999]
[null,null,null,"A",null,null,null,84,"Katie Kapanick","Pistol Packin Lark",null,17.451000000000001]
[{"$nulls":7},192,"Kelsey Howard","Mags",null,17.463999999999999]
[{"$nulls":7},310,"KK Rule","HighSpeedsonofafrost",null,17.48]
[{"$nulls":7},173,"Candie Wolf","Nicinizer",null,17.481000000000002]
[{"$nulls":7},465,"Kylee Scribner","Corona and Firewater","O",17.481000000000002,{"$f":"IF(OR(K296=5,K296=10, K296=15, K296=\"BP\",K296=\"SCR\"),\"NT\",L296)","v":17.481000000000002}]
[{"$nulls":4},"X","X",null,20,"Gracie Kachuriak","Chica Please",null,17.481999999999999]
[{"$nulls":7},8,"Kristy Scribner","Beggars Rockette",null,17.486999999999998]
[null,null,null,"S",null,null,null,91,"Jolene Jones","Kate",null,17.497]
[{"$nulls":7},466,"Caroline Boucher","Gotta B Heavenly","O",17.501999999999999,{"$f":"IF(OR(K300=5,K300=10, K300=15, K300=\"BP\",K300=\"SCR\"),\"NT\",L300)","v":17.501999999999999}]
[{"$nulls":4},"X","X",null,184,"Jaidyn Ornelas","Awards First",null,17.503]
[null,null,null,"A",null,null,null,72,"Blake Myers ","Luvondarocks",null,17.504000000000001]
[null,null,null,"S",null,null,null,108,"Dave Keffeler","Convincing Awe",null,17.515999999999998,null,"5D 1st",412.44]
[{"$nulls":7},171,"Hanna Trimber","Ivory Candy",null,17.538,null,"5D 2nd",353.52]
[{"$nulls":7},182,"Hollie Sirman","Quick Boogie",null,17.541,null,"5D 3rd",294.59999999999997]
[{"$nulls":7},125,"Kelsey Howard","Tricks Broken Heart",null,17.561,null,"5D 4th",235.67999999999998]
[{"$nulls":7},142,"Cheyenne Foster","Mack Daddy",null,17.582000000000001,null,"5D 5th",176.76]
[{"$nulls":7},2,"Brenda Bowers","Dutchess",null,17.587,null,"5D 6th",137.48000000000002]
[{"$nulls":7},218,"Alisha Todd","LG El Javlin",null,17.588999999999999,null,"5D 7th",117.83999999999999]
[{"$nulls":7},129,"Taylor Flores","Jets Tiny Romance",null,17.623999999999999,null,"5D 8th",98.2]
[null,null,null,"A",null,null,null,270,"Samantha Hanna","Dashin By You",null,17.64,null,"5D 9th",78.56]
[{"$nulls":7},236,"Anna Johnson",null,null,17.651,null,"5D 10th",58.919999999999995]
[{"$nulls":7},467,"Michaela Robertson","RSR Guys Speed Com","O",17.651,{"$f":"IF(OR(K313=5,K313=10, K313=15, K313=\"BP\",K313=\"SCR\"),\"NT\",L313)","v":17.651}]
[{"$nulls":7},189,"Kristen Brewer","Peponitas Blue Sugar",null,17.672999999999998]
[null,null,null,"A",null,null,null,"2A","Timberly Erickson","Mines Fast",null,17.702999999999999]
[{"$nulls":4},"X","X",null,317,"Jaidyn Ornelas","Churro",null,17.709]
[{"$nulls":7},223,"Kristi Smith","Lectronic Boomernic",null,17.734000000000002]
[null,null,null,"A",null,null,null,202,"Charlie Colella","Sticks Lil Bro",null,17.774999999999999]
[{"$nulls":7},366,"Emily Williams","J Lo",null,17.841999999999999]
[{"$nulls":7},469,"Brittany Baton","Savagely Smooth","O",17.876000000000001,{"$f":"IF(OR(K320=5,K320=10, K320=15, K320=\"BP\",K320=\"SCR\"),\"NT\",L320)","v":17.876000000000001}]
[{"$nulls":7},299,"Colt Tew","Smooth Move Ta Heaven",null,17.927]
[{"$nulls":7},318,"Caroline Boucher","Packin A Halo",null,17.928000000000001]
[null,null,null,"A",null,null,null,195,"Reagan Jackson","Red Hot Temptress",null,17.931999999999999]
[{"$nulls":4},"X","X",null,159,"Taegan Sanders","Whizzer Guy",null,17.948]
[{"$nulls":7},290,"Delaney Siebert","Streakin N Blazin",null,17.97]
[{"$nulls":7},247,"Kasey Barnes","BB Boogying Frenchman",null,17.975999999999999]
[{"$nulls":7},235,"Caiti Leggett","Willow",null,17.997]
[{"$nulls":7},104,"Shelbey Eklund","Frosted Vagabond",null,18.035]
[{"$nulls":5},"X",null,179,"Rylie Auvenshine","Rio",null,18.036999999999999]
[{"$nulls":7},90,"Cierra Melby","Pressured To Streak",null,18.07]
[{"$nulls":7},296,"Jamie Steiner","Shez Fast For Cash",null,18.097999999999999]
[{"$nulls":7},186,"Chelan Pimental","Guys Minnie Jet",null,18.152000000000001]
[{"$nulls":7},153,"Cassidy Thomas","Shiftwell",null,18.158000000000001]
[{"$nulls":4},"X","X",null,17,"Rheese Walker","STIX",null,18.190999999999999]
[{"$nulls":4},"X","X",null,71,"Madelyn Taylor","Specks Boston Velvet",null,18.234999999999999]
[{"$nulls":7},301,"Maddie Thompson","jKL Six Tiny Alibis",null,18.260000000000002]
[{"$nulls":7},224,"Kylena Hager","The Savoy Express",null,18.263000000000002]
[{"$nulls":7},470,"Madi Roelofsen","TVR Sullivan Dancer","O",18.315000000000001,{"$f":"IF(OR(K338=5,K338=10, K338=15, K338=\"BP\",K338=\"SCR\"),\"NT\",L338)","v":18.315000000000001}]
[{"$nulls":7},92,"Kate McDaniel","CB Zans Lady",null,18.335999999999999]
[{"$nulls":4},"X","X",null,155,"Madeleine Moll","Vibrant Stylish Chic",null,18.344000000000001]
[{"$nulls":7},75,"Shambrae Williams","Mels Famous Hayday",null,18.352]
[null,null,null,"S",null,null,null,325,"Carole Lynn Newsome","SA Docs Dual Ruby",null,18.385000000000002]
[null,null,null,"A",null,null,null,231,"Reagan Jackson","CPB Ryker",null,18.416]
[{"$nulls":4},"X","X",null,193,"Madeleine Moll","Gear'em Up Nic",null,18.433]
[null,null,null,"A",null,null,null,471,"Lori Berryman","Separate Luv For M21","OA",18.446000000000002,{"$f":"IF(OR(K345=5,K345=10, K345=15, K345=\"BP\",K345=\"SCR\"),\"NT\",L345)","v":18.446000000000002}]
[{"$nulls":7},472,"Gracie Ayers","Laramie Wild Card","O",18.501999999999999,{"$f":"IF(OR(K346=5,K346=10, K346=15, K346=\"BP\",K346=\"SCR\"),\"NT\",L346)","v":18.501999999999999}]
[{"$nulls":7},113,"Christy Brower","Miss Regal Memories",null,18.655999999999999]
[{"$nulls":4},"X","X",null,260,"Lillian Pool","Tonto",null,18.699000000000002]
[{"$nulls":7},89,"Ann Wyatt","Blanco Flasho",null,18.71]
[{"$nulls":7},209,"Janie Schuette","Dualin Gun Sport",null,18.72]
[null,null,null,"S",null,null,null,31,"Simone Elmore","Mitey Moon Dash",null,18.78]
[{"$nulls":5},"X",null,144,"Kate Neill","El Scotchsome Tin",null,18.785]
[{"$nulls":7},64,"Chelsi McLarty","Rayn",null,18.829000000000001]
[{"$nulls":7},74,"Christy Brower","SH Im A Fighter",null,19.126000000000001]
[{"$nulls":7},21,"Kat Franklin","Frosty Sun Day Guy",null,19.395]
[{"$nulls":4},"X","X",null,46,"Louis-Josef Veilleux","Famous Cartel Legacy",null,19.469000000000001]
[{"$nulls":7},13,"Jade Crago","Nitros Next Topmodel",null,20.050999999999998]
[{"$nulls":7},343,"Amber Wagner","Nordies Dash",null,21.605]
[{"$nulls":7},259,"Ashley Gowens","Judy",null,23.03]
[{"$nulls":7},161,"Ashley Gowens","Hank",null,23.460999999999999]
[{"$nulls":7},105,"Samantha Grimsley","DFS Special Sambo",null,26.093]
[{"$nulls":7},311,"Becki Mask","Superbar Quiz",null,"nt"]
[{"$nulls":7},33,"Brandi Felder","MP Haydays Chickadee",null,"nt"]
[null,null,null,"S",null,null,null,141,"Jamey Odell","THC Dat Frenchman",null,"nt"]
[{"$nulls":7},474,"Joao Leao","Florari","O","nt",{"$f":"IF(OR(K365=5,K365=10, K365=15, K365=\"BP\",K365=\"SCR\"),\"NT\",L365)","v":"nt"}]
[{"$nulls":7},473,"Sharin Hall","Hello Stella","O","nt",{"$f":"IF(OR(K366=5,K366=10, K366=15, K366=\"BP\",K366=\"SCR\"),\"NT\",L366)","v":"nt"}]
[{"$nulls":7},475,"Ashley Schafer","Streakin TilMidnight","O","nt 16.471",{"$f":"IF(OR(K367=5,K367=10, K367=15, K367=\"BP\",K367=\"SCR\"),\"NT\",L367)","v":"nt 16.471"}]
[{"$nulls":7},386,"Kelly Bruner","Tufferenell","O","nt15.675"]
[null,null,"X","A",null,null,null,4,"Jimmie Smith","Marthas Bullion",null,"nt15.728"]
[null,null,null,"A",null,null,null,408,"Stephanie Fryar","Some Streakin French","OA","nt15.909",{"$f":"IF(OR(K370=5,K370=10, K370=15, K370=\"BP\",K370=\"SCR\"),\"NT\",L370)","v":"nt15.909"}]
[{"$nulls":7},387,"Fonda Melby","RF Chrome In Black","O","nt15.917"]
[null,null,"X",{"$nulls":4},282,"Steely Steiner","Hittin Fame",null,"nt15.971"]
[{"$nulls":7},388,"Molli Montgomery","First Famous Chic","O","nt15.993"]
[null,null,null,"A",null,null,null,79,"Cassidy Teague","Woodrow",null,"nt16.024"]
[{"$nulls":7},409,"Hallie Hannsen","Wicked Little Leader","O","nt16.068",{"$f":"IF(OR(K375=5,K375=10, K375=15, K375=\"BP\",K375=\"SCR\"),\"NT\",L375)","v":"nt16.068"}]
[{"$nulls":7},476,"Bo Hill","Thomaz","O","nt16.121",{"$f":"IF(OR(K376=5,K376=10, K376=15, K376=\"BP\",K376=\"SCR\"),\"NT\",L376)","v":"nt16.121"}]
[{"$nulls":7},225,"Wendy Suhn","Hes Just A Fling",null,"nt16.148"]
[{"$nulls":7},477,"Joao Leao","Special For Trez Pz","O","nt16.176",{"$f":"IF(OR(K378=5,K378=10, K378=15, K378=\"BP\",K378=\"SCR\"),\"NT\",L378)","v":"nt16.176"}]
[{"$nulls":6},"X",220,"Brittany Pierson","CF Dash N Dirty",null,"nt16.182"]
[null,null,null,"S",null,null,null,36,"Martha Jordan","JLFourTaFame",null,"nt16.215"]
[{"$nulls":4},"X","X",null,304,"Reagan Laney","FrostyFeelinlucky",null,"nt16.225"]
[{"$nulls":4},"X","X",null,288,"Brianna Woodmansee","AH Mias Cowboy",null,"nt16.239"]
[{"$nulls":7},44,"Kara Kreder","Zumba",null,"nt16.240"]
[{"$nulls":4},"X","X",null,410,"Oceane Veilleux","Heavens Guy","OY","nt16.255",{"$f":"IF(OR(K384=5,K384=10, K384=15, K384=\"BP\",K384=\"SCR\"),\"NT\",L384)","v":"nt16.255"}]
[null,null,null,"A",null,null,null,337,"Keley Bissett","Pepto Stylish",null,"nt16.344"]
[null,null,null,"S",null,null,null,95,"Glenda Barnett","Bogies Royal Opey",null,"nt16.399"]
[{"$nulls":7},207,"Danica Hoppman","Lonaker",null,"nt16.407"]
[{"$nulls":7},332,"Makala Pierce","Melman",null,"nt16.413"]
[null,null,null,"A",null,null,null,187,"Brian Ramirez","Holly",null,"nt16.434"]
[{"$nulls":4},"X","X",null,177,"Reece Cook","Allen Gunsmoke Leo",null,"nt16.443"]
[null,null,null,"A",null,null,null,389,"Jimmie Smith","Guys Ima Bunny Cat","OA","nt16.448"]
[{"$nulls":7},261,"Wendy Suhn","HLH Streakin A Fling",null,"nt16.449"]
[null,null,null,"S",null,null,null,411,"Martha Jordan","MV Fury Of The Fame","OS","nt16.466",{"$f":"IF(OR(K393=5,K393=10, K393=15, K393=\"BP\",K393=\"SCR\"),\"NT\",L393)","v":"nt16.466"}]
[{"$nulls":7},412,"Wyatt Paul","FC Strait Cajun","O","nt16.472",{"$f":"IF(OR(K394=5,K394=10, K394=15, K394=\"BP\",K394=\"SCR\"),\"NT\",L394)","v":"nt16.472"}]
[{"$nulls":7},413,"Wyatt Paul","OE Money In My Socks","O","nt16.493",{"$f":"IF(OR(K395=5,K395=10, K395=15, K395=\"BP\",K395=\"SCR\"),\"NT\",L395)","v":"nt16.493"}]
[null,null,null,"S",null,null,null,28,"Kelly Bruner","LLP Shadrach",null,"nt16.5"]
[null,null,null,"S",null,null,null,222,"Bobbie Kuhn","MeaMakeItAnywhere",null,"nt16.516"]
[{"$nulls":6},"X",313,"Shelby Rowe","Beggars Pobre Flit",null,"nt16.532"]
[{"$nulls":7},62,"Shelly Shields","Blue Blazing Hot Fling",null,"nt16.598"]
[null,null,null,"S",null,null,null,308,"Cindy Shephard","Aspecially Mine",null,"nt16.600"]
[{"$nulls":7},390,"Louis Paradis","French Ta Vegas","O","nt16.602"]
[{"$nulls":4},"X","X",null,24,"Laine Tucker","Streak Laico Dude",null,"nt16.606"]
[{"$nulls":6},"X",338,"Jamie Cramblit","Pipers Magic",null,"nt16.622"]
[null,null,null,"A",null,null,null,63,"Bianca Dos Santos","One Famous Streaker",null,"nt16.660"]
[null,null,null,"A",null,null,null,133,"Dale Long","Stinsons Run N Turn",null,"nt16.677"]
[{"$nulls":7},267,"Lindsey Bullard","First Down Deception",null,"nt16.696"]
[null,null,null,"A",null,null,null,391,"Kelly Allen","Miss Regality","OA","nt16.720"]
[{"$nulls":7},478,"Ben McDonnell","AJ ShakeItLike Elvis","O","nt16.732",{"$f":"IF(OR(K408=5,K408=10, K408=15, K408=\"BP\",K408=\"SCR\"),\"NT\",L408)","v":"nt16.732"}]
[{"$nulls":7},249,"Jackie Dalchow","Fly Back Jess",null,"nt16.762"]
[{"$nulls":7},253,"Brittany Pierson","Guyco",null,"nt16.793"]
[{"$nulls":4},"X","X",null,197,"Kate Neill","Dox Mega Magnolia",null,"nt16.816"]
[{"$nulls":4},"X","X",null,335,"MaKenna Limbaugh","Tucker Tail And Run",null,"nt16.842"]
[null,null,null,"A",null,null,null,118,"Tiffany Durham","Dashin Luke Perry",null,"nt16.902"]
[{"$nulls":7},479,"Joao Leao","Tres Candies Pz","O","nt16.908",{"$f":"IF(OR(K414=5,K414=10, K414=15, K414=\"BP\",K414=\"SCR\"),\"NT\",L414)","v":"nt16.908"}]
[{"$nulls":7},281,"Royce Romberg","2 Face Flyin",null,"nt16.914"]
[{"$nulls":4},"X","X",null,201,"Hailey Beauvais","This Marvs Rockin",null,"nt16.930"]
[{"$nulls":7},480,"Caroline Boucher","Mayfling First Sign","O","nt16.969",{"$f":"IF(OR(K417=5,K417=10, K417=15, K417=\"BP\",K417=\"SCR\"),\"NT\",L417)","v":"nt16.969"}]
[null,null,null,"A",null,null,null,272,"Lindsey Stevens","Miss America Fame",null,"nt16.982"]
[null,null,null,"S",null,null,null,174,"Johnell Ray","Smooth Your Jets",null,"nt16.994"]
[{"$nulls":4},"X","X",null,3,"Brynn Owens","BJ Spoon",null,"nt17.011"]
[null,null,null,"A",null,null,null,156,"Blake Myers ","Shawne Wampum",null,"nt17.018"]
[{"$nulls":7},126,"Lisa Jo Velliquette","Namgis D 44",null,"nt17.054"]
[null,null,null,"A",null,null,null,65,"Sydney Swatsell","Smalls",null,"nt17.075"]
[{"$nulls":7},248,"Brooke Brooks","Assured To Nick",null,"nt17.095"]
[null,null,null,"A",null,null,null,333,"Shyla Real Bird","Paula",null,"nt17.122"]
[{"$nulls":7},58,"Andrea Cline","This Fame Is Serious",null,"nt17.149"]
[{"$nulls":4},"X","X",null,154,"Mikayla Cearley","TF PeppySmokenSavage",null,"nt17.17.749"]
[{"$nulls":5},"X",null,9,"Cooper Peek","Dolly",null,"nt17.276"]
[{"$nulls":7},278,"Brynn Bates","Dry Cayenne",null,"nt17.314"]
[null,null,null,"A",null,null,null,219,"Emily Duello","Turbo",null,"nt17.344"]
[{"$nulls":4},"X","X",null,481,"Genevieve Blanchard","Hot Traffic Pursuit","OY","nt17.364",{"$f":"IF(OR(K431=5,K431=10, K431=15, K431=\"BP\",K431=\"SCR\"),\"NT\",L431)","v":"nt17.364"}]
[{"$nulls":4},"X","X",null,266,"Hayva Hawkins","Bolt",null,"nt17.378"]
[{"$nulls":7},234,"Kendra Feaser","TU Lackanookie",null,"nt17.498"]
[{"$nulls":7},180,"Kyle Etchart","Panfis Corona",null,"nt17.524"]
[{"$nulls":7},315,"Olivier Pelletier","April French",null,"nt17.557"]
[null,null,null,"A",null,null,null,117,"Savannah Hays","JE Aint Smashed Yet",null,"nt17.582"]
[{"$nulls":7},196,"Jessica Beauvais","SPG Sizzling Cartel",null,"nt17.591"]
[{"$nulls":7},415,"Fonda Melby","Traffic Jam","O","nt17.795",{"$f":"IF(OR(K438=5,K438=10, K438=15, K438=\"BP\",K438=\"SCR\"),\"NT\",L438)","v":"nt17.795"}]
[{"$nulls":4},"X","X",null,327,"Dakota Limbaugh","Firewater Flight",null,"nt17.834"]
[{"$nulls":7},166,"Shannon Dean Turci","Disco Remedy",null,"nt17.874"]
[{"$nulls":4},"X","X",null,354,"MaKenna Limbaugh","Paizlee",null,"nt18.025"]
[null,null,null,"S",null,null,null,190,"Bobbie Kuhn","BKStreakNThruTraffic",null,"nt18.147"]
[{"$nulls":7},167,"Ann White","Hank",null,"nt18.581"]
[{"$nulls":7},123,"Judi Veeder","GL Tuff",null,"nt18.586"]
[{"$nulls":7},326,"Maggie Williams","Jewels",null,"nt18.660"]
[{"$nulls":7},276,"Bliss Bates-Wells",null,null,"nt18.716"]
[{"$nulls":7},213,"Sally Fitzpatrick","GBH Zip Jesse",null,"nt18.901"]
[{"$nulls":7},18,"Nancy Ainsley","Lynx Ta Fame",null,"nt19.537"]
[{"$nulls":7},114,"Donna Howard","Foxy",null,"nt20.567"]
[null,null,null,"A",null,null,null,149,"Bianca Dos Santos",null,null,"nt21.119"]
[{"$nulls":5},"X",null,211,"Kathryn William","Jewels",null,"nt22.462"]
[{"$nulls":7},233,"Kristi Cook","Reload",null,"nt23.996"]
[{"$nulls":7},160,"Sarah Cearly","Cool Man",null,"nt25.891"]
[{"$nulls":7},120,"Amber Ott","Shez Texas Royalty",null,"scratch"]
[{"$nulls":7},152,"Amber Ott","Smart Sugar Haidas",null,"scratch"]
[{"$nulls":7},257,"Ashley WAtson","Munster",null,"scratch"]
[{"$nulls":6},"X",214,"Brooke Wilkerson","Diesel",null,"scratch"]
[{"$nulls":7},119,"Crystal Byers","Myers Dun Gone Wild",null,"scratch"]
[null,null,null,"A",null,null,null,212,"Ella Barch","JK Drop Dead Red",null,"scratch"]
[null,null,null,"S",null,null,null,297,"Karen Coskrey","TS Dream Drifter",null,"scratch"]
[null,null,null,"S",null,null,null,334,"Karen Coskrey","CJ PeptoBoonesFarm",null,"scratch"]
[{"$nulls":5},"X",null,100,"Rye Grantham",null,null,"scratch"]
[{"$nulls":5},"X",null,314,"Sadie Wilson","Roany",null,"scratch"]
[{"$nulls":7},185,"Wendy Martin","ImGoodKharma",null,"scratch"]
[{"$nulls":7},346]
[{"$nulls":7},347]
[{"$nulls":7},348]
[{"$nulls":7},349]
[{"$nulls":7},350]
[{"$nulls":7},351]
[{"$nulls":7},353]
[{"$nulls":7},355]
[{"$nulls":7},356]
[{"$nulls":7},358]
[{"$nulls":7},359]
[{"$nulls":7},360]
[{"$nulls":7},361]
[{"$nulls":7},362]
[{"$nulls":7},363]
[{"$nulls":7},364]
[{"$nulls":7},365]
[{"$nulls":7},385]
[{"$nulls":7},414]
[{"$nulls":7},441]
[{"$nulls":7},468]
[{"$nulls":7},482,{"$nulls":4},{"$f":"IF(OR(K486=5,K486=10, K486=15, K486=\"BP\",K486=\"SCR\"),\"NT\",L486)","v":0}]
[{"$nulls":7},483,{"$nulls":4},{"$f":"IF(OR(K487=5,K487=10, K487=15, K487=\"BP\",K487=\"SCR\"),\"NT\",L487)","v":0}]
[{"$nulls":7},484,{"$nulls":4},{"$f":"IF(OR(K488=5,K488=10, K488=15, K488=\"BP\",K488=\"SCR\"),\"NT\",L488)","v":0}]
[{"$nulls":7},485,{"$nulls":4},{"$f":"IF(OR(K489=5,K489=10, K489=15, K489=\"BP\",K489=\"SCR\"),\"NT\",L489)","v":0}]
[{"$nulls":7},486,{"$nulls":4},{"$f":"IF(OR(K490=5,K490=10, K490=15, K490=\"BP\",K490=\"SCR\"),\"NT\",L490)","v":0}]
[{"$nulls":7},487,{"$nulls":4},{"$f":"IF(OR(K491=5,K491=10, K491=15, K491=\"BP\",K491=\"SCR\"),\"NT\",L491)","v":0}]
[{"$nulls":7},488,{"$nulls":4},{"$f":"IF(OR(K492=5,K492=10, K492=15, K492=\"BP\",K492=\"SCR\"),\"NT\",L492)","v":0}]
[{"$nulls":7},489,{"$nulls":4},{"$f":"IF(OR(K493=5,K493=10, K493=15, K493=\"BP\",K493=\"SCR\"),\"NT\",L493)","v":0}]
[{"$nulls":7},490,{"$nulls":4},{"$f":"IF(OR(K494=5,K494=10, K494=15, K494=\"BP\",K494=\"SCR\"),\"NT\",L494)","v":0}]
[{"$nulls":7},491,{"$nulls":4},{"$f":"IF(OR(K495=5,K495=10, K495=15, K495=\"BP\",K495=\"SCR\"),\"NT\",L495)","v":0}]
[{"$nulls":7},492,{"$nulls":4},{"$f":"IF(OR(K496=5,K496=10, K496=15, K496=\"BP\",K496=\"SCR\"),\"NT\",L496)","v":0}]
[{"$nulls":7},493,{"$nulls":4},{"$f":"IF(OR(K497=5,K497=10, K497=15, K497=\"BP\",K497=\"SCR\"),\"NT\",L497)","v":0}]
[{"$nulls":7},494,{"$nulls":4},{"$f":"IF(OR(K498=5,K498=10, K498=15, K498=\"BP\",K498=\"SCR\"),\"NT\",L498)","v":0}]
[{"$nulls":7},495,{"$nulls":4},{"$f":"IF(OR(K499=5,K499=10, K499=15, K499=\"BP\",K499=\"SCR\"),\"NT\",L499)","v":0}]
[{"$nulls":7},496,{"$nulls":4},{"$f":"IF(OR(K500=5,K500=10, K500=15, K500=\"BP\",K500=\"SCR\"),\"NT\",L500)","v":0}]
[{"$nulls":7},497,{"$nulls":4},{"$f":"IF(OR(K501=5,K501=10, K501=15, K501=\"BP\",K501=\"SCR\"),\"NT\",L501)","v":0}]
[{"$nulls":7},498,{"$nulls":4},{"$f":"IF(OR(K502=5,K502=10, K502=15, K502=\"BP\",K502=\"SCR\"),\"NT\",L502)","v":0}]
[{"$nulls":7},499,{"$nulls":4},{"$f":"IF(OR(K503=5,K503=10, K503=15, K503=\"BP\",K503=\"SCR\"),\"NT\",L503)","v":0}]
[{"$nulls":7},500,{"$nulls":4},{"$f":"IF(OR(K504=5,K504=10, K504=15, K504=\"BP\",K504=\"SCR\"),\"NT\",L504)","v":0}]

{"sheet":"Senior","index":3,"n_rows":301,"n_cols":12,"rows_kept":301,"cut":false,"hidden":false,"merged":[]}
["Futurity","Der","Age Inct.","BBR","Draw","Rider Name","Horse Name","Pen","Time","Final Time","Placing","Money Earned"]
[{"$nulls":4},1,"Donna Kay Rule","High Valor",null,15.515000000000001,null,"1D 1st",143.5]
[{"$nulls":4},2,"Jenny Zant","Raise Me Ta Fame",null,15.736000000000001,null,"1D 2nd",86.1]
[{"$nulls":4},3,"Shelly Shields","Toast Ta Val",null,15.869,null,"1D 3rd",57.400000000000006]
[{"$nulls":4},4,"Sherri Barnes","Racing For Perks",null,16.027000000000001,null,"2D 1st",123]
[{"$nulls":4},5,"Sherri Barnes","Famous Lil Jet",null,16.07,null,"2D 2nd",74]
[{"$nulls":4},6,"Tammy Rokus","Mitey Confederate",null,16.093,null,"2D 3rd",49]
[{"$nulls":4},7,"Kathy Rush","JL Twisted Roc",null,16.145]
[{"$nulls":4},8,"Lisa Wernli","Flashs Fine Effort",null,16.189]
[{"$nulls":4},9,"Denny Ralls","SV Southern Comfort",null,16.21]
[{"$nulls":4},10,"Trina Murray","Fuel For Dash",null,16.321000000000002]
[{"$nulls":4},11,"Jolene Jones","Peppys Streakof Fame",null,16.399999999999999]
[{"$nulls":4},12,"Tracie Schoenthal","Gunsnfirewater",null,16.579999999999998,null,"3D 1st",82]
[{"$nulls":4},13,"Simone Elmore","Badger A Conchadrift",null,16.603999999999999,null,"3D 2nd",49.199999999999996]
[{"$nulls":4},32,"Jo Kirby","Heavenly Joak",null,16.614999999999998,null,"3D 3rd",33]
[{"$nulls":4},14,"Jana Kurosky","Winnies Red kai",null,16.664000000000001]
[{"$nulls":4},15,"Karen Davis","Funderous Frost",null,16.681000000000001]
[{"$nulls":4},16,"Gretchen Goedeken","Pretty Bay Pony",null,16.71]
[{"$nulls":4},17,"Jolene Jones","Capone",null,16.721]
[{"$nulls":4},18,"Kathy Vazquez","Sail On Ta Fame",null,16.887]
[{"$nulls":4},19,"Jolene Jones","Mark Me Angels","OS",16.899000000000001]
[{"$nulls":4},20,"Renee Osborne","Hurricane",null,16.931999999999999]
[{"$nulls":4},21,"Lisa Wernli","Babe on The Run",null,16.966000000000001]
[{"$nulls":4},22,"Renee Douglas","Ticket Ta Fame","OS",17.009]
[{"$nulls":4},23,"Julie Wright","Neolas Ned",null,17.126999999999999,null,"4D 1st",61.5]
[{"$nulls":4},24,"Lisa Corey","Beda Dream",null,17.158000000000001,null,"4D 2nd",36.9]
[{"$nulls":4},25,"Bill Barber","Cruzn OnA Jet",null,17.263999999999999,null,"4D 3rd",24.6]
[{"$nulls":4},26,"Leann Wills","Shoot Yeah Shes Sassy",null,17.346]
[{"$nulls":4},27,"Carole Lynn Newsome","Pistol",null,17.381]
[{"$nulls":4},28,"Jolene Jones","Kate",null,17.497]
[{"$nulls":4},29,"Dave Keffeler","Convincing Awe",null,17.515999999999998]
[{"$nulls":4},30,"Carole Lynn Newsome","SA Docs Dual Ruby",null,18.385000000000002]
[{"$nulls":4},31,"Simone Elmore","Mitey Moon Dash",null,18.78]
[{"$nulls":4},33,"Jamey Odell","THC Dat Frenchman",null,"nt"]
[{"$nulls":4},34,"Martha Jordan","JLFourTaFame",null,"nt16.215"]
[{"$nulls":4},35,"Glenda Barnett","Bogies Royal Opey",null,"nt16.399"]
[{"$nulls":4},36,"Martha Jordan","MV Fury Of The Fame","OS","nt16.466"]
[{"$nulls":4},37,"Kelly Bruner","LLP Shadrach",null,"nt16.5"]
[{"$nulls":4},38,"Bobbie Kuhn","MeaMakeItAnywhere",null,"nt16.516"]
[{"$nulls":4},39,"Cindy Shephard","Aspecially Mine",null,"nt16.600"]
[{"$nulls":4},40,"Johnell Ray","Smooth Your Jets",null,"nt16.994"]
[{"$nulls":4},41,"Bobbie Kuhn","BKStreakNThruTraffic",null,"nt18.147"]
[{"$nulls":4},42,"Karen Coskrey","TS Dream Drifter",null,"scratch"]
[{"$nulls":4},43,"Karen Coskrey","CJ PeptoBoonesFarm",null,"scratch"]
[{"$nulls":4},44]
[{"$nulls":4},45]
[{"$nulls":4},46]
[{"$nulls":4},47]
[{"$nulls":4},48]
[{"$nulls":4},49]
[{"$nulls":4},50]
[{"$nulls":4},51]
[{"$nulls":4},52]
[{"$nulls":4},53]
[{"$nulls":4},54]
[{"$nulls":4},55]
[{"$nulls":4},56]
[{"$nulls":4},57]
[{"$nulls":4},58]
[{"$nulls":4},59]
[{"$nulls":4},60]
[{"$nulls":4},61]
[{"$nulls":4},62]
[{"$nulls":4},63]
[{"$nulls":4},64]
[{"$nulls":4},65]
[{"$nulls":4},66,{"$nulls":4},{"$f":"IF(OR(H67=5,H67=10, H67=15, H67=\"BP\",H67=\"SCR\"),\"NT\",I67)","v":0}]
[{"$nulls":4},67,{"$nulls":4},0]
[{"$nulls":4},68,{"$nulls":4},0]
[{"$nulls":4},69,{"$nulls":4},0]
[{"$nulls":4},70,{"$nulls":4},0]
[{"$nulls":4},71,{"$nulls":4},0]
[{"$nulls":4},72,{"$nulls":4},0]
[{"$nulls":4},73,{"$nulls":4},0]
[{"$nulls":4},74,{"$nulls":4},0]
[{"$nulls":4},75,{"$nulls":4},0]
[{"$nulls":4},76,{"$nulls":4},0]
[{"$nulls":4},77,{"$nulls":4},0]
[{"$nulls":4},78,{"$nulls":4},0]
[{"$nulls":4},79,{"$nulls":4},0]
[{"$nulls":4},80,{"$nulls":4},0]
[{"$nulls":4},81,{"$nulls":4},0]
[{"$nulls":4},82,{"$nulls":4},0]
[{"$nulls":4},83,{"$nulls":4},0]
[{"$nulls":4},84,{"$nulls":4},0]
[{"$nulls":4},85,{"$nulls":4},0]
[{"$nulls":4},86,{"$nulls":4},0]
[{"$nulls":4},87,{"$nulls":4},0]
[{"$nulls":4},88,{"$nulls":4},0]
[{"$nulls":4},89,{"$nulls":4},0]
[{"$nulls":4},90,{"$nulls":4},0]
[{"$nulls":4},91,{"$nulls":4},0]
[{"$nulls":4},92,{"$nulls":4},0]
[{"$nulls":4},93,{"$nulls":4},0]
[{"$nulls":4},94,{"$nulls":4},0]
[{"$nulls":4},95,{"$nulls":4},0]
[{"$nulls":4},96,{"$nulls":4},0]
[{"$nulls":4},97,{"$nulls":4},0]
[{"$nulls":4},98,{"$nulls":4},0]
[{"$nulls":4},99,{"$nulls":4},0]
[{"$nulls":4},100,{"$nulls":4},0]
[{"$nulls":4},101,{"$nulls":4},0]
[{"$nulls":4},102,{"$nulls":4},0]
[{"$nulls":4},103,{"$nulls":4},0]
[{"$nulls":4},104,{"$nulls":4},0]
[{"$nulls":4},105,{"$nulls":4},0]
[{"$nulls":4},106,{"$nulls":4},0]
[{"$nulls":4},107,{"$nulls":4},0]
[{"$nulls":4},108,{"$nulls":4},0]
[{"$nulls":4},109,{"$nulls":4},0]
[{"$nulls":4},110,{"$nulls":4},0]
[{"$nulls":4},111,{"$nulls":4},0]
[{"$nulls":4},112,{"$nulls":4},0]
[{"$nulls":4},113,{"$nulls":4},0]
[{"$nulls":4},114,{"$nulls":4},0]
[{"$nulls":4},115,{"$nulls":4},0]
[{"$nulls":4},116,{"$nulls":4},0]
[{"$nulls":4},117,{"$nulls":4},0]
[{"$nulls":4},118,{"$nulls":4},0]
[{"$nulls":4},119,{"$nulls":4},0]
[{"$nulls":4},120,{"$nulls":4},0]
[{"$nulls":4},121,{"$nulls":4},0]
[{"$nulls":4},122,{"$nulls":4},0]
[{"$nulls":4},123,{"$nulls":4},0]
[{"$nulls":4},124,{"$nulls":4},0]
[{"$nulls":4},125,{"$nulls":4},0]
[{"$nulls":4},126,{"$nulls":4},0]
[{"$nulls":4},127,{"$nulls":4},0]
[{"$nulls":4},128,{"$nulls":4},0]
[{"$nulls":4},129,{"$nulls":4},0]
[{"$nulls":4},130,{"$nulls":4},{"$f":"IF(OR(H131=5,H131=10, H131=15, H131=\"BP\",H131=\"SCR\"),\"NT\",I131)","v":0}]
[{"$nulls":4},131,{"$nulls":4},0]
[{"$nulls":4},132,{"$nulls":4},0]
[{"$nulls":4},133,{"$nulls":4},0]
[{"$nulls":4},134,{"$nulls":4},0]
[{"$nulls":4},135,{"$nulls":4},0]
[{"$nulls":4},136,{"$nulls":4},0]
[{"$nulls":4},137,{"$nulls":4},0]
[{"$nulls":4},138,{"$nulls":4},0]
[{"$nulls":4},139,{"$nulls":4},0]
[{"$nulls":4},140,{"$nulls":4},0]
[{"$nulls":4},141,{"$nulls":4},0]
[{"$nulls":4},142,{"$nulls":4},0]
[{"$nulls":4},143,{"$nulls":4},0]
[{"$nulls":4},144,{"$nulls":4},0]
[{"$nulls":4},145,{"$nulls":4},0]
[{"$nulls":4},146,{"$nulls":4},0]
[{"$nulls":4},147,{"$nulls":4},0]
[{"$nulls":4},148,{"$nulls":4},0]
[{"$nulls":4},149,{"$nulls":4},0]
[{"$nulls":4},150,{"$nulls":4},0]
[{"$nulls":4},151,{"$nulls":4},0]
[{"$nulls":4},152,{"$nulls":4},0]
[{"$nulls":4},153,{"$nulls":4},0]
[{"$nulls":4},154,{"$nulls":4},0]
[{"$nulls":4},155,{"$nulls":4},0]
[{"$nulls":4},156,{"$nulls":4},0]
[{"$nulls":4},157,{"$nulls":4},0]
[{"$nulls":4},158,{"$nulls":4},0]
[{"$nulls":4},159,{"$nulls":4},0]
[{"$nulls":4},160,{"$nulls":4},0]
[{"$nulls":4},161,{"$nulls":4},0]
[{"$nulls":4},162,{"$nulls":4},0]
[{"$nulls":4},163,{"$nulls":4},0]
[{"$nulls":4},164,{"$nulls":4},0]
[{"$nulls":4},165,{"$nulls":4},0]
[{"$nulls":4},166,{"$nulls":4},0]
[{"$nulls":4},167,{"$nulls":4},0]
[{"$nulls":4},168,{"$nulls":4},0]
[{"$nulls":4},169,{"$nulls":4},0]
[{"$nulls":4},170,{"$nulls":4},0]
[{"$nulls":4},171,{"$nulls":4},0]
[{"$nulls":4},172,{"$nulls":4},0]
[{"$nulls":4},173,{"$nulls":4},0]
[{"$nulls":4},174,{"$nulls":4},0]
[{"$nulls":4},175,{"$nulls":4},0]
[{"$nulls":4},176,{"$nulls":4},0]
[{"$nulls":4},177,{"$nulls":4},0]
[{"$nulls":4},178,{"$nulls":4},0]
[{"$nulls":4},179,{"$nulls":4},0]
[{"$nulls":4},180,{"$nulls":4},0]
[{"$nulls":4},181,{"$nulls":4},0]
[{"$nulls":4},182,{"$nulls":4},0]
[{"$nulls":4},183,{"$nulls":4},0]
[{"$nulls":4},184,{"$nulls":4},0]
[{"$nulls":4},185,{"$nulls":4},0]
[{"$nulls":4},186,{"$nulls":4},0]
[{"$nulls":4},187,{"$nulls":4},0]
[{"$nulls":4},188,{"$nulls":4},0]
[{"$nulls":4},189,{"$nulls":4},0]
[{"$nulls":4},190,{"$nulls":4},0]
[{"$nulls":4},191,{"$nulls":4},0]
[{"$nulls":4},192,{"$nulls":4},0]
[{"$nulls":4},193,{"$nulls":4},0]
[{"$nulls":4},194,{"$nulls":4},{"$f":"IF(OR(H195=5,H195=10, H195=15, H195=\"BP\",H195=\"SCR\"),\"NT\",I195)","v":0}]
[{"$nulls":4},195,{"$nulls":4},0]
[{"$nulls":4},196,{"$nulls":4},0]
[{"$nulls":4},197,{"$nulls":4},0]
[{"$nulls":4},198,{"$nulls":4},0]
[{"$nulls":4},199,{"$nulls":4},0]
[{"$nulls":4},200,{"$nulls":4},0]
[{"$nulls":4},201,{"$nulls":4},0]
[{"$nulls":4},202,{"$nulls":4},0]
[{"$nulls":4},203,{"$nulls":4},0]
[{"$nulls":4},204,{"$nulls":4},0]
[{"$nulls":4},205,{"$nulls":4},0]
[{"$nulls":4},206,{"$nulls":4},0]
[{"$nulls":4},207,{"$nulls":4},0]
[{"$nulls":4},208,{"$nulls":4},0]
[{"$nulls":4},209,{"$nulls":4},0]
[{"$nulls":4},210,{"$nulls":4},0]
[{"$nulls":4},211,{"$nulls":4},0]
[{"$nulls":4},212,{"$nulls":4},0]
[{"$nulls":4},213,{"$nulls":4},0]
[{"$nulls":4},214,{"$nulls":4},0]
[{"$nulls":4},215,{"$nulls":4},0]
[{"$nulls":4},216,{"$nulls":4},0]
[{"$nulls":4},217,{"$nulls":4},0]
[{"$nulls":4},218,{"$nulls":4},0]
[{"$nulls":4},219,{"$nulls":4},0]
[{"$nulls":4},220,{"$nulls":4},0]
[{"$nulls":4},221,{"$nulls":4},0]
[{"$nulls":4},222,{"$nulls":4},0]
[{"$nulls":4},223,{"$nulls":4},0]
[{"$nulls":4},224,{"$nulls":4},0]
[{"$nulls":4},225,{"$nulls":4},0]
[{"$nulls":4},226,{"$nulls":4},0]
[{"$nulls":4},227,{"$nulls":4},0]
[{"$nulls":4},228,{"$nulls":4},0]
[{"$nulls":4},229,{"$nulls":4},0]
[{"$nulls":4},230,{"$nulls":4},0]
[{"$nulls":4},231,{"$nulls":4},0]
[{"$nulls":4},232,{"$nulls":4},0]
[{"$nulls":4},233,{"$nulls":4},0]
[{"$nulls":4},234,{"$nulls":4},0]
[{"$nulls":4},235,{"$nulls":4},0]
[{"$nulls":4},236,{"$nulls":4},0]
[{"$nulls":4},237,{"$nulls":4},0]
[{"$nulls":4},238,{"$nulls":4},0]
[{"$nulls":4},239,{"$nulls":4},0]
[{"$nulls":4},240,{"$nulls":4},0]
[{"$nulls":4},241,{"$nulls":4},0]
[{"$nulls":4},242,{"$nulls":4},0]
[{"$nulls":4},243,{"$nulls":4},0]
[{"$nulls":4},244,{"$nulls":4},0]
[{"$nulls":4},245,{"$nulls":4},0]
[{"$nulls":4},246,{"$nulls":4},0]
[{"$nulls":4},247,{"$nulls":4},0]
[{"$nulls":4},248,{"$nulls":4},0]
[{"$nulls":4},249,{"$nulls":4},0]
[{"$nulls":4},250,{"$nulls":4},0]
[{"$nulls":4},251,{"$nulls":4},0]
[{"$nulls":4},252,{"$nulls":4},0]
[{"$nulls":4},253,{"$nulls":4},0]
[{"$nulls":4},254,{"$nulls":4},0]
[{"$nulls":4},255,{"$nulls":4},0]
[{"$nulls":4},256,{"$nulls":4},0]
[{"$nulls":4},257,{"$nulls":4},0]
[{"$nulls":4},258,{"$nulls":4},{"$f":"IF(OR(H259=5,H259=10, H259=15, H259=\"BP\",H259=\"SCR\"),\"NT\",I259)","v":0}]
[{"$nulls":4},259,{"$nulls":4},0]
[{"$nulls":4},260,{"$nulls":4},0]
[{"$nulls":4},261,{"$nulls":4},0]
[{"$nulls":4},262,{"$nulls":4},0]
[{"$nulls":4},263,{"$nulls":4},0]
[{"$nulls":4},264,{"$nulls":4},0]
[{"$nulls":4},265,{"$nulls":4},0]
[{"$nulls":4},266,{"$nulls":4},0]
[{"$nulls":4},267,{"$nulls":4},0]
[{"$nulls":4},268,{"$nulls":4},0]
[{"$nulls":4},269,{"$nulls":4},0]
[{"$nulls":4},270,{"$nulls":4},0]
[{"$nulls":4},271,{"$nulls":4},0]
[{"$nulls":4},272,{"$nulls":4},0]
[{"$nulls":4},273,{"$nulls":4},0]
[{"$nulls":4},274,{"$nulls":4},0]
[{"$nulls":4},275,{"$nulls":4},0]
[{"$nulls":4},276,{"$nulls":4},0]
[{"$nulls":4},277,{"$nulls":4},0]
[{"$nulls":4},278,{"$nulls":4},0]
[{"$nulls":4},279,{"$nulls":4},0]
[{"$nulls":4},280,{"$nulls":4},0]
[{"$nulls":4},281,{"$nulls":4},0]
[{"$nulls":4},282,{"$nulls":4},0]
[{"$nulls":4},283,{"$nulls":4},0]
[{"$nulls":4},284,{"$nulls":4},0]
[{"$nulls":4},285,{"$nulls":4},0]
[{"$nulls":4},286,{"$nulls":4},0]
[{"$nulls":4},287,{"$nulls":4},0]
[{"$nulls":4},288,{"$nulls":4},0]
[{"$nulls":4},289,{"$nulls":4},0]
[{"$nulls":4},290,{"$nulls":4},0]
[{"$nulls":4},291,{"$nulls":4},0]
[{"$nulls":4},292,{"$nulls":4},0]
[{"$nulls":4},293,{"$nulls":4},0]
[{"$nulls":4},294,{"$nulls":4},0]
[{"$nulls":4},295,{"$nulls":4},0]
[{"$nulls":4},296,{"$nulls":4},0]
[{"$nulls":4},297,{"$nulls":4},0]
[{"$nulls":4},298,{"$nulls":4},0]
[{"$nulls":4},299,{"$nulls":4},0]
[{"$nulls":4},300,{"$nulls":4},0]

{"sheet":"Adult","index":4,"n_rows":300,"n_cols":12,"rows_kept":300,"cut":false,"hidden":false,"merged":[]}
["Futurity","Der","Age Inct.","BBR","Draw","Rider Name","Horse Name","Pen","Time","Final Time","Placing","Money Earned"]
[{"$nulls":4},1,"Kylee Scribner","Firewater Cartel","OAH",15.760999999999999,null,"1D 1st",224]
[{"$nulls":4},2,"Whitney Godinez","Im Dun Smokin Bugs","OAH",15.903,null,"1D 2nd",134.4]
[{"$nulls":4},3,"Kelly Allen","Miss JB 165","OA",15.943,null,"1D 3rd",89.600000000000009]
[{"$nulls":4},4,"Jamie Wilson","A Streak Of Phame",null,16.038]
[{"$nulls":4},5,"Jimmie Smith","Lever Action",null,16.135000000000002]
[{"$nulls":4},6,"Jamie Wilson","Check Your Bet",null,16.135000000000002]
[{"$nulls":4},7,"Jennifer Cullen","HLC Pretty Lil Sugar",null,16.193999999999999]
[{"$nulls":4},8,"Stephanie Fryar","The Red Maserati",null,16.251000000000001]
[{"$nulls":4},9,"Boo Burttschell","The Great Gatsby","OA",16.263000000000002,null,"2D 1st",192]
[{"$nulls":4},10,"Savannah Hays","Perkzilla",null,16.327999999999999,null,"2D 2nd",115.19999999999999]
[{"$nulls":4},11,"Tawnie Vander Lans","TS Return N Hayday",null,16.356999999999999,null,"2D 3rd",76.800000000000011]
[{"$nulls":4},12,"Ashley Watson","First Down Hooter",null,16.385000000000002]
[{"$nulls":4},13,"Faith Ross","Kuhl Calvin",null,16.402999999999999]
[{"$nulls":4},14,"Stephanie Fryar","Special Bid Of Frost","OA ",16.521000000000001]
[{"$nulls":4},15,"Jennifer Abbott","Wendall Jackson",null,16.539000000000001]
[{"$nulls":4},16,"Janee' Ornelas","Peter Wabbitt","OA",16.548999999999999]
[{"$nulls":4},17,"Leslie Rickman","Festus Dun It",null,16.553999999999998]
[{"$nulls":4},18,"Megan Epperson","Kama Woodbridge",null,16.591000000000001]
[{"$nulls":4},19,"Jennifer Cullen","Chasin Annie Fame",null,16.591999999999999]
[{"$nulls":4},20,"Sarah Peters","Rockin My Fame","OA",16.603999999999999]
[{"$nulls":4},21,"Lindsey Stevens","JM I Got Faith",null,16.623999999999999]
[{"$nulls":4},22,"Keley Bissett","Diamond Bar Flit",null,16.645]
[{"$nulls":4},23,"Traci Ross","Brady",null,16.684000000000001]
[{"$nulls":4},24,"Leslie Rickman","Autimns Catty Mate",null,16.73]
[{"$nulls":4},25,"Sydney Frey","Sid Frey",null,16.744]
[{"$nulls":4},26,"Whitney Godinez","Chilla On The Rocks","OA",16.763000000000002,null,"3D 1st",128]
[{"$nulls":4},27,"Savannah Hays","Ultimate Barley",null,16.837,null,"3D 2nd",76.8]
[{"$nulls":4},28,"Sydney Swatsell","Feature Me Firin",null,16.858000000000001,null,"3D 3rd",51.2]
[{"$nulls":4},29,"Jimmie Smith","Traffic Kat",null,16.885999999999999]
[{"$nulls":4},30,"Tiffany Durham","Stolin Rubies","OA",16.957000000000001]
[{"$nulls":4},31,"Nicole Buell","Dirty Money",null,16.97]
[{"$nulls":4},32,"Randi Roberts","Boom Slicka Boom","OAP",17.018999999999998]
[{"$nulls":4},33,"Becky Dockery","Power Of A Faithman",null,17.146000000000001]
[{"$nulls":4},34,"Jesse Budd","Flicker Nic",null,17.151]
[{"$nulls":4},35,"Mary Van Cleve","This Buds For Fame","OA",17.164999999999999]
[{"$nulls":4},36,"Kaylyn Smith","Bet She Can Fly",null,17.172999999999998]
[{"$nulls":4},37,"Tiffany Durham","Colones Kerosene",null,17.22]
[{"$nulls":4},38,"Whitney Baton","Flit En Chic",null,17.285,null,"4D 1st",96]
[{"$nulls":4},39,"Sydney Frey","Ballarina",null,17.446999999999999,null,"4D 2nd",57.599999999999994]
[{"$nulls":4},40,"Katie Kapanick","Pistol Packin Lark",null,17.451000000000001,null,"4D 3rd",38.400000000000006]
[{"$nulls":4},41,"Blake Myers ","Luvondarocks",null,17.504000000000001]
[{"$nulls":4},42,"Samantha Hanna","Dashin By You",null,17.64]
[{"$nulls":4},43,"Timberly Erickson","Mines Fast",null,17.702999999999999]
[{"$nulls":4},44,"Charlie Colella","Sticks Lil Bro",null,17.774999999999999]
[{"$nulls":4},45,"Reagan Jackson","Red Hot Temptress",null,17.931999999999999]
[{"$nulls":4},46,"Reagan Jackson","CPB Ryker",null,18.416]
[{"$nulls":4},47,"Lori Berryman","Separate Luv For M21","OA",18.446000000000002]
[{"$nulls":4},48,"Jimmie Smith","Marthas Bullion",null,"nt15.728"]
[{"$nulls":4},49,"Stephanie Fryar","Some Streakin French","OA","nt15.909"]
[{"$nulls":4},50,"Cassidy Teague","Woodrow",null,"nt16.024",{"$f":"IF(OR(H51=5,H51=10, H51=15, H51=\"BP\",H51=\"SCR\"),\"NT\",I51)","v":"nt16.024"}]
[{"$nulls":4},51,"Keley Bissett","Pepto Stylish",null,"nt16.344","nt16.344"]
[{"$nulls":4},52,"Brian Ramirez","Holly",null,"nt16.434","nt16.434"]
[{"$nulls":4},53,"Jimmie Smith","Guys Ima Bunny Cat","OA","nt16.448","nt16.448"]
[{"$nulls":4},54,"Bianca Dos Santos","One Famous Streaker",null,"nt16.660","nt16.660"]
[{"$nulls":4},55,"Dale Long","Stinsons Run N Turn",null,"nt16.677","nt16.677"]
[{"$nulls":4},56,"Kelly Allen","Miss Regality","OA","nt16.720","nt16.720"]
[{"$nulls":4},57,"Tiffany Durham","Dashin Luke Perry",null,"nt16.902","nt16.902"]
[{"$nulls":4},58,"Lindsey Stevens","Miss America Fame",null,"nt16.982","nt16.982"]
[{"$nulls":4},59,"Blake Myers ","Shawne Wampum",null,"nt17.018","nt17.018"]
[{"$nulls":4},60,"Sydney Swatsell","Smalls",null,"nt17.075","nt17.075"]
[{"$nulls":4},61,"Shyla Real Bird","Paula",null,"nt17.122","nt17.122"]
[{"$nulls":4},62,"Emily Duello","Turbo",null,"nt17.344","nt17.344"]
[{"$nulls":4},63,"Savannah Hays","JE Aint Smashed Yet",null,"nt17.582","nt17.582"]
[{"$nulls":4},64,"Bianca Dos Santos",null,null,"nt21.119","nt21.119"]
[{"$nulls":4},65,"Ella Barch","JK Drop Dead Red",null,"scratch",{"$f":"IF(OR(H66=5,H66=10, H66=15, H66=\"BP\",H66=\"SCR\"),\"NT\",I66)","v":"scratch"}]
[{"$nulls":4},66,{"$nulls":4},0]
[{"$nulls":4},67,{"$nulls":4},0]
[{"$nulls":4},68,{"$nulls":4},0]
[{"$nulls":4},69,{"$nulls":4},0]
[{"$nulls":4},70,{"$nulls":4},0]
[{"$nulls":4},72,{"$nulls":4},0]
[{"$nulls":4},73,{"$nulls":4},0]
[{"$nulls":4},74,{"$nulls":4},0]
[{"$nulls":4},75,{"$nulls":4},0]
[{"$nulls":4},76,{"$nulls":4},0]
[{"$nulls":4},77,{"$nulls":4},0]
[{"$nulls":4},78,{"$nulls":4},0]
[{"$nulls":4},79,{"$nulls":4},0]
[{"$nulls":4},80,{"$nulls":4},0]
[{"$nulls":4},81,{"$nulls":4},0]
[{"$nulls":4},82,{"$nulls":4},0]
[{"$nulls":4},83,{"$nulls":4},0]
[{"$nulls":4},84,{"$nulls":4},0]
[{"$nulls":4},85,{"$nulls":4},0]
[{"$nulls":4},86,{"$nulls":4},0]
[{"$nulls":4},87,{"$nulls":4},0]
[{"$nulls":4},88,{"$nulls":4},0]
[{"$nulls":4},89,{"$nulls":4},0]
[{"$nulls":4},90,{"$nulls":4},0]
[{"$nulls":4},91,{"$nulls":4},0]
[{"$nulls":4},92,{"$nulls":4},0]
[{"$nulls":4},93,{"$nulls":4},0]
[{"$nulls":4},94,{"$nulls":4},0]
[{"$nulls":4},95,{"$nulls":4},0]
[{"$nulls":4},96,{"$nulls":4},0]
[{"$nulls":4},97,{"$nulls":4},0]
[{"$nulls":4},98,{"$nulls":4},0]
[{"$nulls":4},99,{"$nulls":4},0]
[{"$nulls":4},100,{"$nulls":4},0]
[{"$nulls":4},101,{"$nulls":4},0]
[{"$nulls":4},102,{"$nulls":4},0]
[{"$nulls":4},103,{"$nulls":4},0]
[{"$nulls":4},104,{"$nulls":4},0]
[{"$nulls":4},105,{"$nulls":4},0]
[{"$nulls":4},106,{"$nulls":4},0]
[{"$nulls":4},107,{"$nulls":4},0]
[{"$nulls":4},108,{"$nulls":4},0]
[{"$nulls":4},109,{"$nulls":4},0]
[{"$nulls":4},110,{"$nulls":4},0]
[{"$nulls":4},111,{"$nulls":4},0]
[{"$nulls":4},112,{"$nulls":4},0]
[{"$nulls":4},113,{"$nulls":4},0]
[{"$nulls":4},114,{"$nulls":4},0]
[{"$nulls":4},115,{"$nulls":4},0]
[{"$nulls":4},116,{"$nulls":4},0]
[{"$nulls":4},117,{"$nulls":4},0]
[{"$nulls":4},118,{"$nulls":4},0]
[{"$nulls":4},119,{"$nulls":4},0]
[{"$nulls":4},120,{"$nulls":4},0]
[{"$nulls":4},121,{"$nulls":4},0]
[{"$nulls":4},122,{"$nulls":4},0]
[{"$nulls":4},123,{"$nulls":4},0]
[{"$nulls":4},124,{"$nulls":4},0]
[{"$nulls":4},125,{"$nulls":4},0]
[{"$nulls":4},126,{"$nulls":4},0]
[{"$nulls":4},127,{"$nulls":4},0]
[{"$nulls":4},128,{"$nulls":4},0]
[{"$nulls":4},129,{"$nulls":4},0]
[{"$nulls":4},130,{"$nulls":4},{"$f":"IF(OR(H130=5,H130=10, H130=15, H130=\"BP\",H130=\"SCR\"),\"NT\",I130)","v":0}]
[{"$nulls":4},131,{"$nulls":4},0]
[{"$nulls":4},132,{"$nulls":4},0]
[{"$nulls":4},133,{"$nulls":4},0]
[{"$nulls":4},134,{"$nulls":4},0]
[{"$nulls":4},135,{"$nulls":4},0]
[{"$nulls":4},136,{"$nulls":4},0]
[{"$nulls":4},137,{"$nulls":4},0]
[{"$nulls":4},138,{"$nulls":4},0]
[{"$nulls":4},139,{"$nulls":4},0]
[{"$nulls":4},140,{"$nulls":4},0]
[{"$nulls":4},141,{"$nulls":4},0]
[{"$nulls":4},142,{"$nulls":4},0]
[{"$nulls":4},143,{"$nulls":4},0]
[{"$nulls":4},144,{"$nulls":4},0]
[{"$nulls":4},145,{"$nulls":4},0]
[{"$nulls":4},146,{"$nulls":4},0]
[{"$nulls":4},147,{"$nulls":4},0]
[{"$nulls":4},148,{"$nulls":4},0]
[{"$nulls":4},149,{"$nulls":4},0]
[{"$nulls":4},150,{"$nulls":4},0]
[{"$nulls":4},151,{"$nulls":4},0]
[{"$nulls":4},152,{"$nulls":4},0]
[{"$nulls":4},153,{"$nulls":4},0]
[{"$nulls":4},154,{"$nulls":4},0]
[{"$nulls":4},155,{"$nulls":4},0]
[{"$nulls":4},156,{"$nulls":4},0]
[{"$nulls":4},157,{"$nulls":4},0]
[{"$nulls":4},158,{"$nulls":4},0]
[{"$nulls":4},159,{"$nulls":4},0]
[{"$nulls":4},160,{"$nulls":4},0]
[{"$nulls":4},161,{"$nulls":4},0]
[{"$nulls":4},162,{"$nulls":4},0]
[{"$nulls":4},163,{"$nulls":4},0]
[{"$nulls":4},164,{"$nulls":4},0]
[{"$nulls":4},165,{"$nulls":4},0]
[{"$nulls":4},166,{"$nulls":4},0]
[{"$nulls":4},167,{"$nulls":4},0]
[{"$nulls":4},168,{"$nulls":4},0]
[{"$nulls":4},169,{"$nulls":4},0]
[{"$nulls":4},170,{"$nulls":4},0]
[{"$nulls":4},171,{"$nulls":4},0]
[{"$nulls":4},172,{"$nulls":4},0]
[{"$nulls":4},173,{"$nulls":4},0]
[{"$nulls":4},174,{"$nulls":4},0]
[{"$nulls":4},175,{"$nulls":4},0]
[{"$nulls":4},176,{"$nulls":4},0]
[{"$nulls":4},177,{"$nulls":4},0]
[{"$nulls":4},178,{"$nulls":4},0]
[{"$nulls":4},179,{"$nulls":4},0]
[{"$nulls":4},180,{"$nulls":4},0]
[{"$nulls":4},181,{"$nulls":4},0]
[{"$nulls":4},182,{"$nulls":4},0]
[{"$nulls":4},183,{"$nulls":4},0]
[{"$nulls":4},184,{"$nulls":4},0]
[{"$nulls":4},185,{"$nulls":4},0]
[{"$nulls":4},186,{"$nulls":4},0]
[{"$nulls":4},187,{"$nulls":4},0]
[{"$nulls":4},188,{"$nulls":4},0]
[{"$nulls":4},189,{"$nulls":4},0]
[{"$nulls":4},190,{"$nulls":4},0]
[{"$nulls":4},191,{"$nulls":4},0]
[{"$nulls":4},192,{"$nulls":4},0]
[{"$nulls":4},193,{"$nulls":4},0]
[{"$nulls":4},194,{"$nulls":4},{"$f":"IF(OR(H194=5,H194=10, H194=15, H194=\"BP\",H194=\"SCR\"),\"NT\",I194)","v":0}]
[{"$nulls":4},195,{"$nulls":4},0]
[{"$nulls":4},196,{"$nulls":4},0]
[{"$nulls":4},197,{"$nulls":4},0]
[{"$nulls":4},198,{"$nulls":4},0]
[{"$nulls":4},199,{"$nulls":4},0]
[{"$nulls":4},200,{"$nulls":4},0]
[{"$nulls":4},201,{"$nulls":4},0]
[{"$nulls":4},202,{"$nulls":4},0]
[{"$nulls":4},203,{"$nulls":4},0]
[{"$nulls":4},204,{"$nulls":4},0]
[{"$nulls":4},205,{"$nulls":4},0]
[{"$nulls":4},206,{"$nulls":4},0]
[{"$nulls":4},207,{"$nulls":4},0]
[{"$nulls":4},208,{"$nulls":4},0]
[{"$nulls":4},209,{"$nulls":4},0]
[{"$nulls":4},210,{"$nulls":4},0]
[{"$nulls":4},211,{"$nulls":4},0]
[{"$nulls":4},212,{"$nulls":4},0]
[{"$nulls":4},213,{"$nulls":4},0]
[{"$nulls":4},214,{"$nulls":4},0]
[{"$nulls":4},215,{"$nulls":4},0]
[{"$nulls":4},216,{"$nulls":4},0]
[{"$nulls":4},217,{"$nulls":4},0]
[{"$nulls":4},218,{"$nulls":4},0]
[{"$nulls":4},219,{"$nulls":4},0]
[{"$nulls":4},220,{"$nulls":4},0]
[{"$nulls":4},221,{"$nulls":4},0]
[{"$nulls":4},222,{"$nulls":4},0]
[{"$nulls":4},223,{"$nulls":4},0]
[{"$nulls":4},224,{"$nulls":4},0]
[{"$nulls":4},225,{"$nulls":4},0]
[{"$nulls":4},226,{"$nulls":4},0]
[{"$nulls":4},227,{"$nulls":4},0]
[{"$nulls":4},228,{"$nulls":4},0]
[{"$nulls":4},229,{"$nulls":4},0]
[{"$nulls":4},230,{"$nulls":4},0]
[{"$nulls":4},231,{"$nulls":4},0]
[{"$nulls":4},232,{"$nulls":4},0]
[{"$nulls":4},233,{"$nulls":4},0]
[{"$nulls":4},234,{"$nulls":4},0]
[{"$nulls":4},235,{"$nulls":4},0]
[{"$nulls":4},236,{"$nulls":4},0]
[{"$nulls":4},237,{"$nulls":4},0]
[{"$nulls":4},238,{"$nulls":4},0]
[{"$nulls":4},239,{"$nulls":4},0]
[{"$nulls":4},240,{"$nulls":4},0]
[{"$nulls":4},241,{"$nulls":4},0]
[{"$nulls":4},242,{"$nulls":4},0]
[{"$nulls":4},243,{"$nulls":4},0]
[{"$nulls":4},244,{"$nulls":4},0]
[{"$nulls":4},245,{"$nulls":4},0]
[{"$nulls":4},246,{"$nulls":4},0]
[{"$nulls":4},247,{"$nulls":4},0]
[{"$nulls":4},248,{"$nulls":4},0]
[{"$nulls":4},249,{"$nulls":4},0]
[{"$nulls":4},250,{"$nulls":4},0]
[{"$nulls":4},251,{"$nulls":4},0]
[{"$nulls":4},252,{"$nulls":4},0]
[{"$nulls":4},253,{"$nulls":4},0]
[{"$nulls":4},254,{"$nulls":4},0]
[{"$nulls":4},255,{"$nulls":4},0]
[{"$nulls":4},256,{"$nulls":4},0]
[{"$nulls":4},257,{"$nulls":4},0]
[{"$nulls":4},258,{"$nulls":4},{"$f":"IF(OR(H258=5,H258=10, H258=15, H258=\"BP\",H258=\"SCR\"),\"NT\",I258)","v":0}]
[{"$nulls":4},259,{"$nulls":4},0]
[{"$nulls":4},260,{"$nulls":4},0]
[{"$nulls":4},261,{"$nulls":4},0]
[{"$nulls":4},262,{"$nulls":4},0]
[{"$nulls":4},263,{"$nulls":4},0]
[{"$nulls":4},264,{"$nulls":4},0]
[{"$nulls":4},265,{"$nulls":4},0]
[{"$nulls":4},266,{"$nulls":4},0]
[{"$nulls":4},267,{"$nulls":4},0]
[{"$nulls":4},268,{"$nulls":4},0]
[{"$nulls":4},269,{"$nulls":4},0]
[{"$nulls":4},270,{"$nulls":4},0]
[{"$nulls":4},271,{"$nulls":4},0]
[{"$nulls":4},272,{"$nulls":4},0]
[{"$nulls":4},273,{"$nulls":4},0]
[{"$nulls":4},274,{"$nulls":4},0]
[{"$nulls":4},275,{"$nulls":4},0]
[{"$nulls":4},276,{"$nulls":4},0]
[{"$nulls":4},277,{"$nulls":4},0]
[{"$nulls":4},278,{"$nulls":4},0]
[{"$nulls":4},279,{"$nulls":4},0]
[{"$nulls":4},280,{"$nulls":4},0]
[{"$nulls":4},281,{"$nulls":4},0]
[{"$nulls":4},282,{"$nulls":4},0]
[{"$nulls":4},283,{"$nulls":4},0]
[{"$nulls":4},284,{"$nulls":4},0]
[{"$nulls":4},285,{"$nulls":4},0]
[{"$nulls":4},286,{"$nulls":4},0]
[{"$nulls":4},287,{"$nulls":4},0]
[{"$nulls":4},288,{"$nulls":4},0]
[{"$nulls":4},289,{"$nulls":4},0]
[{"$nulls":4},290,{"$nulls":4},0]
[{"$nulls":4},291,{"$nulls":4},0]
[{"$nulls":4},292,{"$nulls":4},0]
[{"$nulls":4},293,{"$nulls":4},0]
[{"$nulls":4},294,{"$nulls":4},0]
[{"$nulls":4},295,{"$nulls":4},0]
[{"$nulls":4},296,{"$nulls":4},0]
[{"$nulls":4},297,{"$nulls":4},0]
[{"$nulls":4},298,{"$nulls":4},0]
[{"$nulls":4},299,{"$nulls":4},0]
[{"$nulls":4},300,{"$nulls":4},0]

{"sheet":"Youth","index":5,"n_rows":301,"n_cols":11,"rows_kept":301,"cut":false,"hidden":false,"merged":[]}
["Futurity","Der","Age Inct.","BBR","Draw","Rider Name","Horse Name","Pen","Time","Placing","Money Earned"]
[{"$nulls":4},1,"Brianna Woodmansee","CC Fancy Lil Cowgirl",null,15.747999999999999,"1D 1st",393.03999999999996]
[{"$nulls":4},2,"Oceane Veilleux","DR Rise N Shine",null,15.973000000000001,"1D 2nd",294.77999999999997]
[{"$nulls":4},3,"Kate Neill","SHS Short Go Ike",null,15.993,"1D 3rd",196.51999999999998]
[{"$nulls":4},4,"Tristan Bowles","Short Oakie Lena",null,16.106999999999999,"1D 4th",98.259999999999991]
[{"$nulls":4},5,"Josie Jartmann","Hes Honor",null,16.224]
[{"$nulls":4},6,"Skylar Eisinger","All Bugged Up","OY",16.233000000000001]
[{"$nulls":4},7,"Trinity Beauvais","Eyes Okey Dokey",null,16.344000000000001,"2D 1st",358]
[{"$nulls":4},8,"Hevenli Scribner","JSHLucky Bottom Roy",null,16.367999999999999,"2D 2nd",269]
[{"$nulls":4},9,"Kate Neill","NF French Tigger",null,16.46,"2D 3rd",179]
[{"$nulls":4},10,"Paige Clayton","Imafrenchcaptain",null,16.484999999999999,"2D 4th",90]
[{"$nulls":4},11,"Oceane Veilleux","KN Bam Special","OY",16.512]
[{"$nulls":4},12,"Brinley Howard","Lil Bid Of Flit",null,16.541]
[{"$nulls":4},13,"Stormi Branch","Pretty Theory",null,16.651]
[{"$nulls":4},14,"Abigail Wicker","Talk To Me Goose",null,16.756,"3D 1st",289]
[{"$nulls":4},15,"Salem Brooks","Sugas Smooth Duke",null,16.792999999999999,"3D 2nd",217]
[{"$nulls":4},16,"Hadley Durfey","One Smooth Kelly",null,16.818000000000001,"3D 3rd",144]
[{"$nulls":4},17,"Jolie Smith","Bartender Nics",null,16.826000000000001,"3D 4th",72]
[{"$nulls":4},18,"Oceane Veilleux","KN Snap Back","OY",16.838000000000001]
[{"$nulls":4},19,"Abigail Wicker","So Guys Top Stick",null,16.869]
[{"$nulls":4},20,"Stormi Branch","Demon",null,16.896000000000001]
[{"$nulls":4},21,"Addison Byars","CinchMeUpTaWin",null,16.931000000000001]
[{"$nulls":4},22,"Bella Blaylock","Wildfires Golden Drift",null,16.943000000000001]
[{"$nulls":4},23,"Hayva Hawkins","Shotgun",null,16.954999999999998]
[{"$nulls":4},24,"Haley King","Playboy",null,16.957999999999998]
[{"$nulls":4},25,"Bella Blaylock","Lucy",null,17.059000000000001]
[{"$nulls":4},26,"Jolie Smith","Ms Hollywood Delight",null,17.07]
[{"$nulls":4},27,"Hadley Durfey","Delightful Brownies",null,17.117999999999999]
[{"$nulls":4},28,"Chloe Powell","Blessing",null,17.181999999999999]
[{"$nulls":4},29,"Addison Steed","Commander",null,17.204999999999998]
[{"$nulls":4},30,"Kyla Morris","Belle",null,17.231999999999999]
[{"$nulls":4},31,"Brinley Howard","Whoneedsfameimfrench",null,17.248000000000001,"4D 1st",254]
[{"$nulls":4},32,"Trinity Joiner","HighOnBrownWhiskey",null,17.27,"4D 2nd",191]
[{"$nulls":4},33,"Abby Taylor","Joselina",null,17.327999999999999,"4D 3rd",127]
[{"$nulls":4},34,"Collynz Sanders","Liberty",null,17.384,"4D 4th",64]
[{"$nulls":4},35,"Gracie Kachuriak","Chica Please",null,17.481999999999999]
[{"$nulls":4},36,"Jaidyn Ornelas","Awards First",null,17.503]
[{"$nulls":4},37,"Jaidyn Ornelas","Churro",null,17.709]
[{"$nulls":4},38,"Taegan Sanders","Whizzer Guy",null,17.948]
[{"$nulls":4},39,"Rylie Auvenshine","Rio",null,18.036999999999999]
[{"$nulls":4},40,"Rheese Walker","STIX",null,18.190999999999999]
[{"$nulls":4},41,"Madelyn Taylor","Specks Boston Velvet",null,18.234999999999999]
[{"$nulls":4},42,"Madeleine Moll","Vibrant Stylish Chic",null,18.344000000000001]
[{"$nulls":4},43,"Madeleine Moll","Gear'em Up Nic",null,18.433]
[{"$nulls":4},44,"Lillian Pool","Tonto",null,18.699000000000002]
[{"$nulls":4},45,"Kate Neill","El Scotchsome Tin",null,18.785]
[{"$nulls":4},46,"Louis-Josef Veilleux","Famous Cartel Legacy",null,19.469000000000001]
[{"$nulls":4},47,"Reagan Laney","FrostyFeelinlucky",null,"nt16.225"]
[{"$nulls":4},48,"Brianna Woodmansee","AH Mias Cowboy",null,"nt16.239"]
[{"$nulls":4},49,"Oceane Veilleux","Heavens Guy","OY","nt16.255"]
[{"$nulls":4},50,"Reece Cook","Allen Gunsmoke Leo",null,"nt16.443"]
[{"$nulls":4},51,"Laine Tucker","Streak Laico Dude",null,"nt16.606"]
[{"$nulls":4},52,"Kate Neill","Dox Mega Magnolia",null,"nt16.816"]
[{"$nulls":4},53,"MaKenna Limbaugh","Tucker Tail And Run",null,"nt16.842"]
[{"$nulls":4},54,"Hailey Beauvais","This Marvs Rockin",null,"nt16.930"]
[{"$nulls":4},55,"Brynn Owens","BJ Spoon",null,"nt17.011"]
[{"$nulls":4},56,"Mikayla Cearley","TF PeppySmokenSavage",null,"nt17.17.749"]
[{"$nulls":4},57,"Cooper Peek","Dolly",null,"nt17.276"]
[{"$nulls":4},58,"Genevieve Blanchard","Hot Traffic Pursuit","OY","nt17.364"]
[{"$nulls":4},59,"Hayva Hawkins","Bolt",null,"nt17.378"]
[{"$nulls":4},60,"Dakota Limbaugh","Firewater Flight",null,"nt17.834"]
[{"$nulls":4},61,"MaKenna Limbaugh","Paizlee",null,"nt18.025"]
[{"$nulls":4},62,"Kathryn William","Jewels",null,"nt22.462"]
[{"$nulls":4},63,"Rye Grantham",null,null,"scratch"]
[{"$nulls":4},64,"Sadie Wilson","Roany",null,"scratch"]
[{"$nulls":4},65]
[{"$nulls":4},66]
[{"$nulls":4},67]
[{"$nulls":4},68]
[{"$nulls":4},69]
[{"$nulls":4},70]
[{"$nulls":4},71]
[{"$nulls":4},72]
[{"$nulls":4},73]
[{"$nulls":4},74]
[{"$nulls":4},75]
[{"$nulls":4},76]
[{"$nulls":4},77]
[{"$nulls":4},78]
[{"$nulls":4},79]
[{"$nulls":4},80]
[{"$nulls":4},81]
[{"$nulls":4},82]
[{"$nulls":4},83]
[{"$nulls":4},84]
[{"$nulls":4},85]
[{"$nulls":4},86]
[{"$nulls":4},87]
[{"$nulls":4},88]
[{"$nulls":4},89]
[{"$nulls":4},90]
[{"$nulls":4},91]
[{"$nulls":4},92]
[{"$nulls":4},93]
[{"$nulls":4},94]
[{"$nulls":4},95]
[{"$nulls":4},96]
[{"$nulls":4},97]
[{"$nulls":4},98]
[{"$nulls":4},99]
[{"$nulls":4},100]
[{"$nulls":4},101]
[{"$nulls":4},102]
[{"$nulls":4},103]
[{"$nulls":4},104]
[{"$nulls":4},105]
[{"$nulls":4},106]
[{"$nulls":4},107]
[{"$nulls":4},108]
[{"$nulls":4},109]
[{"$nulls":4},110]
[{"$nulls":4},111]
[{"$nulls":4},112]
[{"$nulls":4},113]
[{"$nulls":4},114]
[{"$nulls":4},115]
[{"$nulls":4},116]
[{"$nulls":4},117]
[{"$nulls":4},118]
[{"$nulls":4},119]
[{"$nulls":4},120]
[{"$nulls":4},121]
[{"$nulls":4},122]
[{"$nulls":4},123]
[{"$nulls":4},124]
[{"$nulls":4},125]
[{"$nulls":4},126]
[{"$nulls":4},127]
[{"$nulls":4},128]
[{"$nulls":4},129]
[{"$nulls":4},130]
[{"$nulls":4},131]
[{"$nulls":4},132]
[{"$nulls":4},133]
[{"$nulls":4},134]
[{"$nulls":4},135]
[{"$nulls":4},136]
[{"$nulls":4},137]
[{"$nulls":4},138]
[{"$nulls":4},139]
[{"$nulls":4},140]
[{"$nulls":4},141]
[{"$nulls":4},142]
[{"$nulls":4},143]
[{"$nulls":4},144]
[{"$nulls":4},145]
[{"$nulls":4},146]
[{"$nulls":4},147]
[{"$nulls":4},148]
[{"$nulls":4},149]
[{"$nulls":4},150]
[{"$nulls":4},151]
[{"$nulls":4},152]
[{"$nulls":4},153]
[{"$nulls":4},154]
[{"$nulls":4},155]
[{"$nulls":4},156]
[{"$nulls":4},157]
[{"$nulls":4},158]
[{"$nulls":4},159]
[{"$nulls":4},160]
[{"$nulls":4},161]
[{"$nulls":4},162]
[{"$nulls":4},163]
[{"$nulls":4},164]
[{"$nulls":4},165]
[{"$nulls":4},166]
[{"$nulls":4},167]
[{"$nulls":4},168]
[{"$nulls":4},169]
[{"$nulls":4},170]
[{"$nulls":4},171]
[{"$nulls":4},172]
[{"$nulls":4},173]
[{"$nulls":4},174]
[{"$nulls":4},175]
[{"$nulls":4},176]
[{"$nulls":4},177]
[{"$nulls":4},178]
[{"$nulls":4},179]
[{"$nulls":4},180]
[{"$nulls":4},181]
[{"$nulls":4},182]
[{"$nulls":4},183]
[{"$nulls":4},184]
[{"$nulls":4},185]
[{"$nulls":4},186]
[{"$nulls":4},187]
[{"$nulls":4},188]
[{"$nulls":4},189]
[{"$nulls":4},190]
[{"$nulls":4},191]
[{"$nulls":4},192]
[{"$nulls":4},193]
[{"$nulls":4},194]
[{"$nulls":4},195]
[{"$nulls":4},196]
[{"$nulls":4},197]
[{"$nulls":4},198]
[{"$nulls":4},199]
[{"$nulls":4},200]
[{"$nulls":4},201]
[{"$nulls":4},202]
[{"$nulls":4},203]
[{"$nulls":4},204]
[{"$nulls":4},205]
[{"$nulls":4},206]
[{"$nulls":4},207]
[{"$nulls":4},208]
[{"$nulls":4},209]
[{"$nulls":4},210]
[{"$nulls":4},211]
[{"$nulls":4},212]
[{"$nulls":4},213]
[{"$nulls":4},214]
[{"$nulls":4},215]
[{"$nulls":4},216]
[{"$nulls":4},217]
[{"$nulls":4},218]
[{"$nulls":4},219]
[{"$nulls":4},220]
[{"$nulls":4},221]
[{"$nulls":4},222]
[{"$nulls":4},223]
[{"$nulls":4},224]
[{"$nulls":4},225]
[{"$nulls":4},226]
[{"$nulls":4},227]
[{"$nulls":4},228]
[{"$nulls":4},229]
[{"$nulls":4},230]
[{"$nulls":4},231]
[{"$nulls":4},232]
[{"$nulls":4},233]
[{"$nulls":4},234]
[{"$nulls":4},235]
[{"$nulls":4},236]
[{"$nulls":4},237]
[{"$nulls":4},238]
[{"$nulls":4},239]
[{"$nulls":4},240]
[{"$nulls":4},241]
[{"$nulls":4},242]
[{"$nulls":4},243]
[{"$nulls":4},244]
[{"$nulls":4},245]
[{"$nulls":4},246]
[{"$nulls":4},247]
[{"$nulls":4},248]
[{"$nulls":4},249]
[{"$nulls":4},250]
[{"$nulls":4},251]
[{"$nulls":4},252]
[{"$nulls":4},253]
[{"$nulls":4},254]
[{"$nulls":4},255]
[{"$nulls":4},256]
[{"$nulls":4},257]
[{"$nulls":4},258]
[{"$nulls":4},259]
[{"$nulls":4},260]
[{"$nulls":4},261]
[{"$nulls":4},262]
[{"$nulls":4},263]
[{"$nulls":4},264]
[{"$nulls":4},265]
[{"$nulls":4},266]
[{"$nulls":4},267]
[{"$nulls":4},268]
[{"$nulls":4},269]
[{"$nulls":4},270]
[{"$nulls":4},271]
[{"$nulls":4},272]
[{"$nulls":4},273]
[{"$nulls":4},274]
[{"$nulls":4},275]
[{"$nulls":4},276]
[{"$nulls":4},277]
[{"$nulls":4},278]
[{"$nulls":4},279]
[{"$nulls":4},280]
[{"$nulls":4},281]
[{"$nulls":4},282]
[{"$nulls":4},283]
[{"$nulls":4},284]
[{"$nulls":4},285]
[{"$nulls":4},286]
[{"$nulls":4},287]
[{"$nulls":4},288]
[{"$nulls":4},289]
[{"$nulls":4},290]
[{"$nulls":4},291]
[{"$nulls":4},292]
[{"$nulls":4},293]
[{"$nulls":4},294]
[{"$nulls":4},295]
[{"$nulls":4},296]
[{"$nulls":4},297]
[{"$nulls":4},298]
[{"$nulls":4},299]
[{"$nulls":4},300]

{"sheet":"Derby","index":6,"n_rows":299,"n_cols":12,"rows_kept":299,"cut":false,"hidden":false,"merged":[]}
["Futurity","Der","Age Inct.","BBR","Draw","Rider Name","Horse Name","c/o","Time","Final Time","Placing","Money Earned"]
[{"$nulls":4},2,"Cassidy Champlin","DG Excuse My French","O",15.731999999999999,null,"1st",1650]
[{"$nulls":4},6,"Lacey Harmon","Mended Heart","O",15.855,{"$f":"IF(OR(H3=5,H3=10, H3=15, H3=\"BP\",H3=\"SCR\"),\"NT\",I3)","v":15.855},"2nd",1376]
[{"$nulls":4},11,"Sharin Hall","Rare Packin Six","O",15.97,null,"3rd",1100]
[{"$nulls":4},16,"Karri McKim","Firen Ta Fame","O",16.056999999999999,null,"4th",826]
[{"$nulls":4},21,"Cassidy Champlin","Wood Bea French Girl","O",16.125,null,"5th",550]
[{"$nulls":4},15,"Kara Kreder","Dreams Of Fame","O",16.207999999999998]
[{"$nulls":4},5,"Rylee Shields","Furys Princess","O",16.251000000000001,{"$f":"IF(OR(H8=5,H8=10, H8=15, H8=\"BP\",H8=\"SCR\"),\"NT\",I8)","v":16.251000000000001}]
[{"$nulls":4},7,"Boo Burttschell","The Great Gatsby","OA",16.263000000000002,{"$f":"IF(OR(H9=5,H9=10, H9=15, H9=\"BP\",H9=\"SCR\"),\"NT\",I9)","v":16.263000000000002}]
[{"$nulls":4},24,"Shelly Shields","Streakers Queen","O",16.393000000000001,{"$f":"IF(OR(H10=5,H10=10, H10=15, H10=\"BP\",H10=\"SCR\"),\"NT\",I10)","v":16.393000000000001}]
[{"$nulls":4},13,"Jamie Olsen","Miss Famous Beduino","OP",16.456]
[{"$nulls":4},22,"Oceane Veilleux","KN Bam Special","OY",16.512,{"$f":"IF(OR(H12=5,H12=10, H12=15, H12=\"BP\",H12=\"SCR\"),\"NT\",I12)","v":16.512}]
[{"$nulls":4},8,"Janee' Ornelas","Peter Wabbitt","OA",16.548999999999999,{"$f":"IF(OR(H13=5,H13=10, H13=15, H13=\"BP\",H13=\"SCR\"),\"NT\",I13)","v":16.548999999999999}]
[{"$nulls":4},25,"Sarah Peters","Rockin My Fame","OA",16.603999999999999,{"$f":"IF(OR(H14=5,H14=10, H14=15, H14=\"BP\",H14=\"SCR\"),\"NT\",I14)","v":16.603999999999999}]
[{"$nulls":4},19,"Brandi Felder","Graves Leavin Tucson","O ",16.766999999999999]
[{"$nulls":4},14,"Randi Roberts","Boom Slicka Boom","OAP",17.018999999999998]
[{"$nulls":4},4,"Fonda Melby","A Fling With A Sting","O",17.295000000000002]
[{"$nulls":4},18,"Stephanie Fryar","Some Streakin French","OA","nt15.909"]
[{"$nulls":4},9,"Hallie Hannsen","Wicked Little Leader","O","nt16.068"]
[{"$nulls":4},3,"Oceane Veilleux","Heavens Guy","OY","nt16.255",{"$f":"IF(OR(H20=5,H20=10, H20=15, H20=\"BP\",H20=\"SCR\"),\"NT\",I20)","v":"nt16.255"}]
[{"$nulls":4},12,"Martha Jordan","MV Fury Of The Fame","OS","nt16.466"]
[{"$nulls":4},1,"Wyatt Paul","FC Strait Cajun","O","nt16.472"]
[{"$nulls":4},20,"Wyatt Paul","OE Money In My Socks","O","nt16.493",{"$f":"IF(OR(H23=5,H23=10, H23=15, H23=\"BP\",H23=\"SCR\"),\"NT\",I23)","v":"nt16.493"}]
[{"$nulls":4},10,"Cindy Shepherd","Aspeically Mine",null,"nt16.949"]
[{"$nulls":4},17,"Fonda Melby","Traffic Jam","O","nt17.795"]
[{"$nulls":4},26,{"$nulls":4},{"$f":"IF(OR(H26=5,H26=10, H26=15, H26=\"BP\",H26=\"SCR\"),\"NT\",I26)","v":0}]
[{"$nulls":4},27,{"$nulls":4},0]
[{"$nulls":4},28,{"$nulls":4},0]
[{"$nulls":4},29,{"$nulls":4},0]
[{"$nulls":4},30,{"$nulls":4},0]
[{"$nulls":4},32,{"$nulls":4},0]
[{"$nulls":4},33,{"$nulls":4},0]
[{"$nulls":4},34,{"$nulls":4},0]
[{"$nulls":4},35,{"$nulls":4},0]
[{"$nulls":4},36,{"$nulls":4},0]
[{"$nulls":4},37,{"$nulls":4},0]
[{"$nulls":4},38,{"$nulls":4},0]
[{"$nulls":4},39,{"$nulls":4},0]
[{"$nulls":4},40,{"$nulls":4},0]
[{"$nulls":4},41,{"$nulls":4},0]
[{"$nulls":4},42,{"$nulls":4},0]
[{"$nulls":4},43,{"$nulls":4},0]
[{"$nulls":4},44,{"$nulls":4},0]
[{"$nulls":4},45,{"$nulls":4},0]
[{"$nulls":4},46,{"$nulls":4},0]
[{"$nulls":4},47,{"$nulls":4},0]
[{"$nulls":4},48,{"$nulls":4},0]
[{"$nulls":4},49,{"$nulls":4},0]
[{"$nulls":4},50,{"$nulls":4},0]
[{"$nulls":4},51,{"$nulls":4},0]
[{"$nulls":4},52,{"$nulls":4},0]
[{"$nulls":4},53,{"$nulls":4},0]
[{"$nulls":4},54,{"$nulls":4},0]
[{"$nulls":4},55,{"$nulls":4},0]
[{"$nulls":4},56,{"$nulls":4},0]
[{"$nulls":4},57,{"$nulls":4},0]
[{"$nulls":4},58,{"$nulls":4},0]
[{"$nulls":4},59,{"$nulls":4},0]
[{"$nulls":4},60,{"$nulls":4},0]
[{"$nulls":4},61,{"$nulls":4},0]
[{"$nulls":4},62,{"$nulls":4},0]
[{"$nulls":4},63,{"$nulls":4},0]
[{"$nulls":4},64,{"$nulls":4},0]
[{"$nulls":4},65,{"$nulls":4},0]
[{"$nulls":4},66,{"$nulls":4},0]
[{"$nulls":4},67,{"$nulls":4},0]
[{"$nulls":4},68,{"$nulls":4},0]
[{"$nulls":4},69,{"$nulls":4},0]
[{"$nulls":4},70,{"$nulls":4},0]
[{"$nulls":4},71,{"$nulls":4},0]
[{"$nulls":4},72,{"$nulls":4},0]
[{"$nulls":4},73,{"$nulls":4},0]
[{"$nulls":4},74,{"$nulls":4},0]
[{"$nulls":4},75,{"$nulls":4},0]
[{"$nulls":4},76,{"$nulls":4},0]
[{"$nulls":4},77,{"$nulls":4},0]
[{"$nulls":4},78,{"$nulls":4},0]
[{"$nulls":4},79,{"$nulls":4},0]
[{"$nulls":4},80,{"$nulls":4},0]
[{"$nulls":4},81,{"$nulls":4},0]
[{"$nulls":4},82,{"$nulls":4},0]
[{"$nulls":4},83,{"$nulls":4},0]
[{"$nulls":4},84,{"$nulls":4},0]
[{"$nulls":4},85,{"$nulls":4},0]
[{"$nulls":4},86,{"$nulls":4},0]
[{"$nulls":4},87,{"$nulls":4},0]
[{"$nulls":4},88,{"$nulls":4},0]
[{"$nulls":4},89,{"$nulls":4},0]
[{"$nulls":4},90,{"$nulls":4},0]
[{"$nulls":4},91,{"$nulls":4},{"$f":"IF(OR(H90=5,H90=10, H90=15, H90=\"BP\",H90=\"SCR\"),\"NT\",I90)","v":0}]
[{"$nulls":4},92,{"$nulls":4},0]
[{"$nulls":4},93,{"$nulls":4},0]
[{"$nulls":4},94,{"$nulls":4},0]
[{"$nulls":4},95,{"$nulls":4},0]
[{"$nulls":4},96,{"$nulls":4},0]
[{"$nulls":4},97,{"$nulls":4},0]
[{"$nulls":4},98,{"$nulls":4},0]
[{"$nulls":4},99,{"$nulls":4},0]
[{"$nulls":4},100,{"$nulls":4},0]
[{"$nulls":4},101,{"$nulls":4},0]
[{"$nulls":4},102,{"$nulls":4},0]
[{"$nulls":4},103,{"$nulls":4},0]
[{"$nulls":4},104,{"$nulls":4},0]
[{"$nulls":4},105,{"$nulls":4},0]
[{"$nulls":4},106,{"$nulls":4},0]
[{"$nulls":4},107,{"$nulls":4},0]
[{"$nulls":4},108,{"$nulls":4},0]
[{"$nulls":4},109,{"$nulls":4},0]
[{"$nulls":4},110,{"$nulls":4},0]
[{"$nulls":4},111,{"$nulls":4},0]
[{"$nulls":4},112,{"$nulls":4},0]
[{"$nulls":4},113,{"$nulls":4},0]
[{"$nulls":4},114,{"$nulls":4},0]
[{"$nulls":4},115,{"$nulls":4},0]
[{"$nulls":4},116,{"$nulls":4},0]
[{"$nulls":4},117,{"$nulls":4},0]
[{"$nulls":4},118,{"$nulls":4},0]
[{"$nulls":4},119,{"$nulls":4},0]
[{"$nulls":4},120,{"$nulls":4},0]
[{"$nulls":4},121,{"$nulls":4},0]
[{"$nulls":4},122,{"$nulls":4},0]
[{"$nulls":4},123,{"$nulls":4},0]
[{"$nulls":4},124,{"$nulls":4},0]
[{"$nulls":4},125,{"$nulls":4},0]
[{"$nulls":4},126,{"$nulls":4},0]
[{"$nulls":4},127,{"$nulls":4},0]
[{"$nulls":4},128,{"$nulls":4},0]
[{"$nulls":4},129,{"$nulls":4},0]
[{"$nulls":4},130,{"$nulls":4},0]
[{"$nulls":4},131,{"$nulls":4},0]
[{"$nulls":4},132,{"$nulls":4},0]
[{"$nulls":4},133,{"$nulls":4},0]
[{"$nulls":4},134,{"$nulls":4},0]
[{"$nulls":4},135,{"$nulls":4},0]
[{"$nulls":4},136,{"$nulls":4},0]
[{"$nulls":4},137,{"$nulls":4},0]
[{"$nulls":4},138,{"$nulls":4},0]
[{"$nulls":4},139,{"$nulls":4},0]
[{"$nulls":4},140,{"$nulls":4},0]
[{"$nulls":4},141,{"$nulls":4},0]
[{"$nulls":4},142,{"$nulls":4},0]
[{"$nulls":4},143,{"$nulls":4},0]
[{"$nulls":4},144,{"$nulls":4},0]
[{"$nulls":4},145,{"$nulls":4},0]
[{"$nulls":4},146,{"$nulls":4},0]
[{"$nulls":4},147,{"$nulls":4},0]
[{"$nulls":4},148,{"$nulls":4},0]
[{"$nulls":4},149,{"$nulls":4},0]
[{"$nulls":4},150,{"$nulls":4},0]
[{"$nulls":4},151,{"$nulls":4},0]
[{"$nulls":4},152,{"$nulls":4},0]
[{"$nulls":4},153,{"$nulls":4},0]
[{"$nulls":4},154,{"$nulls":4},0]
[{"$nulls":4},155,{"$nulls":4},{"$f":"IF(OR(H154=5,H154=10, H154=15, H154=\"BP\",H154=\"SCR\"),\"NT\",I154)","v":0}]
[{"$nulls":4},156,{"$nulls":4},0]
[{"$nulls":4},157,{"$nulls":4},0]
[{"$nulls":4},158,{"$nulls":4},0]
[{"$nulls":4},159,{"$nulls":4},0]
[{"$nulls":4},160,{"$nulls":4},0]
[{"$nulls":4},161,{"$nulls":4},0]
[{"$nulls":4},162,{"$nulls":4},0]
[{"$nulls":4},163,{"$nulls":4},0]
[{"$nulls":4},164,{"$nulls":4},0]
[{"$nulls":4},165,{"$nulls":4},0]
[{"$nulls":4},166,{"$nulls":4},0]
[{"$nulls":4},167,{"$nulls":4},0]
[{"$nulls":4},168,{"$nulls":4},0]
[{"$nulls":4},169,{"$nulls":4},0]
[{"$nulls":4},170,{"$nulls":4},0]
[{"$nulls":4},171,{"$nulls":4},0]
[{"$nulls":4},172,{"$nulls":4},0]
[{"$nulls":4},173,{"$nulls":4},0]
[{"$nulls":4},174,{"$nulls":4},0]
[{"$nulls":4},175,{"$nulls":4},0]
[{"$nulls":4},176,{"$nulls":4},0]
[{"$nulls":4},177,{"$nulls":4},0]
[{"$nulls":4},178,{"$nulls":4},0]
[{"$nulls":4},179,{"$nulls":4},0]
[{"$nulls":4},180,{"$nulls":4},0]
[{"$nulls":4},181,{"$nulls":4},0]
[{"$nulls":4},182,{"$nulls":4},0]
[{"$nulls":4},183,{"$nulls":4},0]
[{"$nulls":4},184,{"$nulls":4},0]
[{"$nulls":4},185,{"$nulls":4},0]
[{"$nulls":4},186,{"$nulls":4},0]
[{"$nulls":4},187,{"$nulls":4},0]
[{"$nulls":4},188,{"$nulls":4},0]
[{"$nulls":4},189,{"$nulls":4},0]
[{"$nulls":4},190,{"$nulls":4},0]
[{"$nulls":4},191,{"$nulls":4},0]
[{"$nulls":4},192,{"$nulls":4},0]
[{"$nulls":4},193,{"$nulls":4},0]
[{"$nulls":4},194,{"$nulls":4},0]
[{"$nulls":4},195,{"$nulls":4},0]
[{"$nulls":4},196,{"$nulls":4},0]
[{"$nulls":4},197,{"$nulls":4},0]
[{"$nulls":4},198,{"$nulls":4},0]
[{"$nulls":4},199,{"$nulls":4},0]
[{"$nulls":4},200,{"$nulls":4},0]
[{"$nulls":4},201,{"$nulls":4},0]
[{"$nulls":4},202,{"$nulls":4},0]
[{"$nulls":4},203,{"$nulls":4},0]
[{"$nulls":4},204,{"$nulls":4},0]
[{"$nulls":4},205,{"$nulls":4},0]
[{"$nulls":4},206,{"$nulls":4},0]
[{"$nulls":4},207,{"$nulls":4},0]
[{"$nulls":4},208,{"$nulls":4},0]
[{"$nulls":4},209,{"$nulls":4},0]
[{"$nulls":4},210,{"$nulls":4},0]
[{"$nulls":4},211,{"$nulls":4},0]
[{"$nulls":4},212,{"$nulls":4},0]
[{"$nulls":4},213,{"$nulls":4},0]
[{"$nulls":4},214,{"$nulls":4},0]
[{"$nulls":4},215,{"$nulls":4},0]
[{"$nulls":4},216,{"$nulls":4},0]
[{"$nulls":4},217,{"$nulls":4},0]
[{"$nulls":4},218,{"$nulls":4},0]
[{"$nulls":4},219,{"$nulls":4},{"$f":"IF(OR(H218=5,H218=10, H218=15, H218=\"BP\",H218=\"SCR\"),\"NT\",I218)","v":0}]
[{"$nulls":4},220,{"$nulls":4},0]
[{"$nulls":4},221,{"$nulls":4},0]
[{"$nulls":4},222,{"$nulls":4},0]
[{"$nulls":4},223,{"$nulls":4},0]
[{"$nulls":4},224,{"$nulls":4},0]
[{"$nulls":4},225,{"$nulls":4},0]
[{"$nulls":4},226,{"$nulls":4},0]
[{"$nulls":4},227,{"$nulls":4},0]
[{"$nulls":4},228,{"$nulls":4},0]
[{"$nulls":4},229,{"$nulls":4},0]
[{"$nulls":4},230,{"$nulls":4},0]
[{"$nulls":4},231,{"$nulls":4},0]
[{"$nulls":4},232,{"$nulls":4},0]
[{"$nulls":4},233,{"$nulls":4},0]
[{"$nulls":4},234,{"$nulls":4},0]
[{"$nulls":4},235,{"$nulls":4},0]
[{"$nulls":4},236,{"$nulls":4},0]
[{"$nulls":4},237,{"$nulls":4},0]
[{"$nulls":4},238,{"$nulls":4},0]
[{"$nulls":4},239,{"$nulls":4},0]
[{"$nulls":4},240,{"$nulls":4},0]
[{"$nulls":4},241,{"$nulls":4},0]
[{"$nulls":4},242,{"$nulls":4},0]
[{"$nulls":4},243,{"$nulls":4},0]
[{"$nulls":4},244,{"$nulls":4},0]
[{"$nulls":4},245,{"$nulls":4},0]
[{"$nulls":4},246,{"$nulls":4},0]
[{"$nulls":4},247,{"$nulls":4},0]
[{"$nulls":4},248,{"$nulls":4},0]
[{"$nulls":4},249,{"$nulls":4},0]
[{"$nulls":4},250,{"$nulls":4},0]
[{"$nulls":4},251,{"$nulls":4},0]
[{"$nulls":4},252,{"$nulls":4},0]
[{"$nulls":4},253,{"$nulls":4},0]
[{"$nulls":4},254,{"$nulls":4},0]
[{"$nulls":4},255,{"$nulls":4},0]
[{"$nulls":4},256,{"$nulls":4},0]
[{"$nulls":4},257,{"$nulls":4},0]
[{"$nulls":4},258,{"$nulls":4},0]
[{"$nulls":4},259,{"$nulls":4},0]
[{"$nulls":4},260,{"$nulls":4},0]
[{"$nulls":4},261,{"$nulls":4},0]
[{"$nulls":4},262,{"$nulls":4},0]
[{"$nulls":4},263,{"$nulls":4},0]
[{"$nulls":4},264,{"$nulls":4},0]
[{"$nulls":4},265,{"$nulls":4},0]
[{"$nulls":4},266,{"$nulls":4},0]
[{"$nulls":4},267,{"$nulls":4},0]
[{"$nulls":4},268,{"$nulls":4},0]
[{"$nulls":4},269,{"$nulls":4},0]
[{"$nulls":4},270,{"$nulls":4},0]
[{"$nulls":4},271,{"$nulls":4},0]
[{"$nulls":4},272,{"$nulls":4},0]
[{"$nulls":4},273,{"$nulls":4},0]
[{"$nulls":4},274,{"$nulls":4},0]
[{"$nulls":4},275,{"$nulls":4},0]
[{"$nulls":4},276,{"$nulls":4},0]
[{"$nulls":4},277,{"$nulls":4},0]
[{"$nulls":4},278,{"$nulls":4},0]
[{"$nulls":4},279,{"$nulls":4},0]
[{"$nulls":4},280,{"$nulls":4},0]
[{"$nulls":4},281,{"$nulls":4},0]
[{"$nulls":4},282,{"$nulls":4},0]
[{"$nulls":4},283,{"$nulls":4},{"$f":"IF(OR(H282=5,H282=10, H282=15, H282=\"BP\",H282=\"SCR\"),\"NT\",I282)","v":0}]
[{"$nulls":4},284,{"$nulls":4},0]
[{"$nulls":4},285,{"$nulls":4},0]
[{"$nulls":4},286,{"$nulls":4},0]
[{"$nulls":4},287,{"$nulls":4},0]
[{"$nulls":4},288,{"$nulls":4},0]
[{"$nulls":4},289,{"$nulls":4},0]
[{"$nulls":4},290,{"$nulls":4},0]
[{"$nulls":4},291,{"$nulls":4},0]
[{"$nulls":4},292,{"$nulls":4},0]
[{"$nulls":4},293,{"$nulls":4},0]
[{"$nulls":4},294,{"$nulls":4},0]
[{"$nulls":4},295,{"$nulls":4},0]
[{"$nulls":4},296,{"$nulls":4},0]
[{"$nulls":4},297,{"$nulls":4},0]
[{"$nulls":4},298,{"$nulls":4},0]
[{"$nulls":4},299,{"$nulls":4},0]
[{"$nulls":4},300,{"$nulls":4},0]

{"sheet":"Highstakes","index":7,"n_rows":301,"n_cols":12,"rows_kept":301,"cut":false,"hidden":false,"merged":[]}
["Futurity","Der","Age Inct.","BBR","Draw","Rider Name","Horse Name","c/o","Time","Final Time","Placing","Money Earned"]
[{"$nulls":4},1,"Kylee Scribner","Firewater Cartel","OAH",15.760999999999999,null,"1st",384]
[{"$nulls":4},2,"Whitney Godinez","Im Dun Smokin Bugs","OAH",15.903,null,"2nd",256]
[{"$nulls":4},3,"Hallie Hannsen","Jesswatchmestreak","OH",15.916]
[{"$nulls":4},4,"Jimmie Smith","Lever Action",null,16.135000000000002]
[{"$nulls":4},5,"Shelby Stansbury","One Tuf Knight",null,16.178000000000001]
[{"$nulls":4},6,"Ashley Watson","First Down Hooter",null,16.385000000000002]
[{"$nulls":4},7,"Jimmie Smith","Marthas Bullion",null,"nt15.728"]
[{"$nulls":4},8,"Steely Steiner","Hittin Fame",null,"nt15.971"]
[{"$nulls":4},9]
[{"$nulls":4},10]
[{"$nulls":4},11]
[{"$nulls":4},12]
[{"$nulls":4},13]
[{"$nulls":4},14]
[{"$nulls":4},15]
[{"$nulls":4},16]
[{"$nulls":4},17]
[{"$nulls":4},18]
[{"$nulls":4},19]
[{"$nulls":4},20]
[{"$nulls":4},21]
[{"$nulls":4},22]
[{"$nulls":4},23]
[{"$nulls":4},24]
[{"$nulls":4},25]
[{"$nulls":4},26]
[{"$nulls":4},27]
[{"$nulls":4},28]
[{"$nulls":4},29]
[{"$nulls":4},30]
[{"$nulls":4},31]
[{"$nulls":4},32]
[{"$nulls":4},33]
[{"$nulls":4},34]
[{"$nulls":4},35]
[{"$nulls":4},36]
[{"$nulls":4},37]
[{"$nulls":4},38]
[{"$nulls":4},39,{"$nulls":4},{"$f":"IF(OR(H40=5,H40=10, H40=15, H40=\"BP\",H40=\"SCR\"),\"NT\",I40)","v":0}]
[{"$nulls":4},40,{"$nulls":4},0]
[{"$nulls":4},41,{"$nulls":4},0]
[{"$nulls":4},42,{"$nulls":4},0]
[{"$nulls":4},43,{"$nulls":4},0]
[{"$nulls":4},44,{"$nulls":4},0]
[{"$nulls":4},45,{"$nulls":4},0]
[{"$nulls":4},46,{"$nulls":4},0]
[{"$nulls":4},47,{"$nulls":4},0]
[{"$nulls":4},48,{"$nulls":4},0]
[{"$nulls":4},49,{"$nulls":4},0]
[{"$nulls":4},50,{"$nulls":4},0]
[{"$nulls":4},51,{"$nulls":4},0]
[{"$nulls":4},52,{"$nulls":4},0]
[{"$nulls":4},53,{"$nulls":4},0]
[{"$nulls":4},54,{"$nulls":4},0]
[{"$nulls":4},55,{"$nulls":4},0]
[{"$nulls":4},56,{"$nulls":4},0]
[{"$nulls":4},57,{"$nulls":4},0]
[{"$nulls":4},58,{"$nulls":4},0]
[{"$nulls":4},59,{"$nulls":4},0]
[{"$nulls":4},60,{"$nulls":4},0]
[{"$nulls":4},61,{"$nulls":4},0]
[{"$nulls":4},62,{"$nulls":4},0]
[{"$nulls":4},63,{"$nulls":4},0]
[{"$nulls":4},64,{"$nulls":4},0]
[{"$nulls":4},65,{"$nulls":4},0]
[{"$nulls":4},66,{"$nulls":4},0]
[{"$nulls":4},67,{"$nulls":4},0]
[{"$nulls":4},68,{"$nulls":4},0]
[{"$nulls":4},69,{"$nulls":4},0]
[{"$nulls":4},70,{"$nulls":4},0]
[{"$nulls":4},71,{"$nulls":4},0]
[{"$nulls":4},72,{"$nulls":4},0]
[{"$nulls":4},73,{"$nulls":4},0]
[{"$nulls":4},74,{"$nulls":4},0]
[{"$nulls":4},75,{"$nulls":4},0]
[{"$nulls":4},76,{"$nulls":4},0]
[{"$nulls":4},77,{"$nulls":4},0]
[{"$nulls":4},78,{"$nulls":4},0]
[{"$nulls":4},79,{"$nulls":4},0]
[{"$nulls":4},80,{"$nulls":4},0]
[{"$nulls":4},81,{"$nulls":4},0]
[{"$nulls":4},82,{"$nulls":4},0]
[{"$nulls":4},83,{"$nulls":4},0]
[{"$nulls":4},84,{"$nulls":4},0]
[{"$nulls":4},85,{"$nulls":4},0]
[{"$nulls":4},86,{"$nulls":4},0]
[{"$nulls":4},87,{"$nulls":4},0]
[{"$nulls":4},88,{"$nulls":4},0]
[{"$nulls":4},89,{"$nulls":4},0]
[{"$nulls":4},90,{"$nulls":4},0]
[{"$nulls":4},91,{"$nulls":4},0]
[{"$nulls":4},92,{"$nulls":4},0]
[{"$nulls":4},93,{"$nulls":4},0]
[{"$nulls":4},94,{"$nulls":4},0]
[{"$nulls":4},95,{"$nulls":4},0]
[{"$nulls":4},96,{"$nulls":4},0]
[{"$nulls":4},97,{"$nulls":4},0]
[{"$nulls":4},98,{"$nulls":4},0]
[{"$nulls":4},99,{"$nulls":4},0]
[{"$nulls":4},100,{"$nulls":4},0]
[{"$nulls":4},101,{"$nulls":4},0]
[{"$nulls":4},102,{"$nulls":4},0]
[{"$nulls":4},103,{"$nulls":4},{"$f":"IF(OR(H104=5,H104=10, H104=15, H104=\"BP\",H104=\"SCR\"),\"NT\",I104)","v":0}]
[{"$nulls":4},104,{"$nulls":4},0]
[{"$nulls":4},105,{"$nulls":4},0]
[{"$nulls":4},106,{"$nulls":4},0]
[{"$nulls":4},107,{"$nulls":4},0]
[{"$nulls":4},108,{"$nulls":4},0]
[{"$nulls":4},109,{"$nulls":4},0]
[{"$nulls":4},110,{"$nulls":4},0]
[{"$nulls":4},111,{"$nulls":4},0]
[{"$nulls":4},112,{"$nulls":4},0]
[{"$nulls":4},113,{"$nulls":4},0]
[{"$nulls":4},114,{"$nulls":4},0]
[{"$nulls":4},115,{"$nulls":4},0]
[{"$nulls":4},116,{"$nulls":4},0]
[{"$nulls":4},117,{"$nulls":4},0]
[{"$nulls":4},118,{"$nulls":4},0]
[{"$nulls":4},119,{"$nulls":4},0]
[{"$nulls":4},120,{"$nulls":4},0]
[{"$nulls":4},121,{"$nulls":4},0]
[{"$nulls":4},122,{"$nulls":4},0]
[{"$nulls":4},123,{"$nulls":4},0]
[{"$nulls":4},124,{"$nulls":4},0]
[{"$nulls":4},125,{"$nulls":4},0]
[{"$nulls":4},126,{"$nulls":4},0]
[{"$nulls":4},127,{"$nulls":4},0]
[{"$nulls":4},128,{"$nulls":4},0]
[{"$nulls":4},129,{"$nulls":4},0]
[{"$nulls":4},130,{"$nulls":4},0]
[{"$nulls":4},131,{"$nulls":4},0]
[{"$nulls":4},132,{"$nulls":4},0]
[{"$nulls":4},133,{"$nulls":4},0]
[{"$nulls":4},134,{"$nulls":4},0]
[{"$nulls":4},135,{"$nulls":4},0]
[{"$nulls":4},136,{"$nulls":4},0]
[{"$nulls":4},137,{"$nulls":4},0]
[{"$nulls":4},138,{"$nulls":4},0]
[{"$nulls":4},139,{"$nulls":4},0]
[{"$nulls":4},140,{"$nulls":4},0]
[{"$nulls":4},141,{"$nulls":4},0]
[{"$nulls":4},142,{"$nulls":4},0]
[{"$nulls":4},143,{"$nulls":4},0]
[{"$nulls":4},144,{"$nulls":4},0]
[{"$nulls":4},145,{"$nulls":4},0]
[{"$nulls":4},146,{"$nulls":4},0]
[{"$nulls":4},147,{"$nulls":4},0]
[{"$nulls":4},148,{"$nulls":4},0]
[{"$nulls":4},149,{"$nulls":4},0]
[{"$nulls":4},150,{"$nulls":4},0]
[{"$nulls":4},151,{"$nulls":4},0]
[{"$nulls":4},152,{"$nulls":4},0]
[{"$nulls":4},153,{"$nulls":4},0]
[{"$nulls":4},154,{"$nulls":4},0]
[{"$nulls":4},155,{"$nulls":4},0]
[{"$nulls":4},156,{"$nulls":4},0]
[{"$nulls":4},157,{"$nulls":4},0]
[{"$nulls":4},158,{"$nulls":4},0]
[{"$nulls":4},159,{"$nulls":4},0]
[{"$nulls":4},160,{"$nulls":4},0]
[{"$nulls":4},161,{"$nulls":4},0]
[{"$nulls":4},162,{"$nulls":4},0]
[{"$nulls":4},163,{"$nulls":4},0]
[{"$nulls":4},164,{"$nulls":4},0]
[{"$nulls":4},165,{"$nulls":4},0]
[{"$nulls":4},166,{"$nulls":4},0]
[{"$nulls":4},167,{"$nulls":4},{"$f":"IF(OR(H168=5,H168=10, H168=15, H168=\"BP\",H168=\"SCR\"),\"NT\",I168)","v":0}]
[{"$nulls":4},168,{"$nulls":4},0]
[{"$nulls":4},169,{"$nulls":4},0]
[{"$nulls":4},170,{"$nulls":4},0]
[{"$nulls":4},171,{"$nulls":4},0]
[{"$nulls":4},172,{"$nulls":4},0]
[{"$nulls":4},173,{"$nulls":4},0]
[{"$nulls":4},174,{"$nulls":4},0]
[{"$nulls":4},175,{"$nulls":4},0]
[{"$nulls":4},176,{"$nulls":4},0]
[{"$nulls":4},177,{"$nulls":4},0]
[{"$nulls":4},178,{"$nulls":4},0]
[{"$nulls":4},179,{"$nulls":4},0]
[{"$nulls":4},180,{"$nulls":4},0]
[{"$nulls":4},181,{"$nulls":4},0]
[{"$nulls":4},182,{"$nulls":4},0]
[{"$nulls":4},183,{"$nulls":4},0]
[{"$nulls":4},184,{"$nulls":4},0]
[{"$nulls":4},185,{"$nulls":4},0]
[{"$nulls":4},186,{"$nulls":4},0]
[{"$nulls":4},187,{"$nulls":4},0]
[{"$nulls":4},188,{"$nulls":4},0]
[{"$nulls":4},189,{"$nulls":4},0]
[{"$nulls":4},190,{"$nulls":4},0]
[{"$nulls":4},191,{"$nulls":4},0]
[{"$nulls":4},192,{"$nulls":4},0]
[{"$nulls":4},193,{"$nulls":4},0]
[{"$nulls":4},194,{"$nulls":4},0]
[{"$nulls":4},195,{"$nulls":4},0]
[{"$nulls":4},196,{"$nulls":4},0]
[{"$nulls":4},197,{"$nulls":4},0]
[{"$nulls":4},198,{"$nulls":4},0]
[{"$nulls":4},199,{"$nulls":4},0]
[{"$nulls":4},200,{"$nulls":4},0]
[{"$nulls":4},201,{"$nulls":4},0]
[{"$nulls":4},202,{"$nulls":4},0]
[{"$nulls":4},203,{"$nulls":4},0]
[{"$nulls":4},204,{"$nulls":4},0]
[{"$nulls":4},205,{"$nulls":4},0]
[{"$nulls":4},206,{"$nulls":4},0]
[{"$nulls":4},207,{"$nulls":4},0]
[{"$nulls":4},208,{"$nulls":4},0]
[{"$nulls":4},209,{"$nulls":4},0]
[{"$nulls":4},210,{"$nulls":4},0]
[{"$nulls":4},211,{"$nulls":4},0]
[{"$nulls":4},212,{"$nulls":4},0]
[{"$nulls":4},213,{"$nulls":4},0]
[{"$nulls":4},214,{"$nulls":4},0]
[{"$nulls":4},215,{"$nulls":4},0]
[{"$nulls":4},216,{"$nulls":4},0]
[{"$nulls":4},217,{"$nulls":4},0]
[{"$nulls":4},218,{"$nulls":4},0]
[{"$nulls":4},219,{"$nulls":4},0]
[{"$nulls":4},220,{"$nulls":4},0]
[{"$nulls":4},221,{"$nulls":4},0]
[{"$nulls":4},222,{"$nulls":4},0]
[{"$nulls":4},223,{"$nulls":4},0]
[{"$nulls":4},224,{"$nulls":4},0]
[{"$nulls":4},225,{"$nulls":4},0]
[{"$nulls":4},226,{"$nulls":4},0]
[{"$nulls":4},227,{"$nulls":4},0]
[{"$nulls":4},228,{"$nulls":4},0]
[{"$nulls":4},229,{"$nulls":4},0]
[{"$nulls":4},230,{"$nulls":4},0]
[{"$nulls":4},231,{"$nulls":4},{"$f":"IF(OR(H232=5,H232=10, H232=15, H232=\"BP\",H232=\"SCR\"),\"NT\",I232)","v":0}]
[{"$nulls":4},232,{"$nulls":4},0]
[{"$nulls":4},233,{"$nulls":4},0]
[{"$nulls":4},234,{"$nulls":4},0]
[{"$nulls":4},235,{"$nulls":4},0]
[{"$nulls":4},236,{"$nulls":4},0]
[{"$nulls":4},237,{"$nulls":4},0]
[{"$nulls":4},238,{"$nulls":4},0]
[{"$nulls":4},239,{"$nulls":4},0]
[{"$nulls":4},240,{"$nulls":4},0]
[{"$nulls":4},241,{"$nulls":4},0]
[{"$nulls":4},242,{"$nulls":4},0]
[{"$nulls":4},243,{"$nulls":4},0]
[{"$nulls":4},244,{"$nulls":4},0]
[{"$nulls":4},245,{"$nulls":4},0]
[{"$nulls":4},246,{"$nulls":4},0]
[{"$nulls":4},247,{"$nulls":4},0]
[{"$nulls":4},248,{"$nulls":4},0]
[{"$nulls":4},249,{"$nulls":4},0]
[{"$nulls":4},250,{"$nulls":4},0]
[{"$nulls":4},251,{"$nulls":4},0]
[{"$nulls":4},252,{"$nulls":4},0]
[{"$nulls":4},253,{"$nulls":4},0]
[{"$nulls":4},254,{"$nulls":4},0]
[{"$nulls":4},255,{"$nulls":4},0]
[{"$nulls":4},256,{"$nulls":4},0]
[{"$nulls":4},257,{"$nulls":4},0]
[{"$nulls":4},258,{"$nulls":4},0]
[{"$nulls":4},259,{"$nulls":4},0]
[{"$nulls":4},260,{"$nulls":4},0]
[{"$nulls":4},261,{"$nulls":4},0]
[{"$nulls":4},262,{"$nulls":4},0]
[{"$nulls":4},263,{"$nulls":4},0]
[{"$nulls":4},264,{"$nulls":4},0]
[{"$nulls":4},265,{"$nulls":4},0]
[{"$nulls":4},266,{"$nulls":4},0]
[{"$nulls":4},267,{"$nulls":4},0]
[{"$nulls":4},268,{"$nulls":4},0]
[{"$nulls":4},269,{"$nulls":4},0]
[{"$nulls":4},270,{"$nulls":4},0]
[{"$nulls":4},271,{"$nulls":4},0]
[{"$nulls":4},272,{"$nulls":4},0]
[{"$nulls":4},273,{"$nulls":4},0]
[{"$nulls":4},274,{"$nulls":4},0]
[{"$nulls":4},275,{"$nulls":4},0]
[{"$nulls":4},276,{"$nulls":4},0]
[{"$nulls":4},277,{"$nulls":4},0]
[{"$nulls":4},278,{"$nulls":4},0]
[{"$nulls":4},279,{"$nulls":4},0]
[{"$nulls":4},280,{"$nulls":4},0]
[{"$nulls":4},281,{"$nulls":4},0]
[{"$nulls":4},282,{"$nulls":4},0]
[{"$nulls":4},283,{"$nulls":4},0]
[{"$nulls":4},284,{"$nulls":4},0]
[{"$nulls":4},285,{"$nulls":4},0]
[{"$nulls":4},286,{"$nulls":4},0]
[{"$nulls":4},287,{"$nulls":4},0]
[{"$nulls":4},288,{"$nulls":4},0]
[{"$nulls":4},289,{"$nulls":4},0]
[{"$nulls":4},290,{"$nulls":4},0]
[{"$nulls":4},291,{"$nulls":4},0]
[{"$nulls":4},292,{"$nulls":4},0]
[{"$nulls":4},293,{"$nulls":4},0]
[{"$nulls":4},294,{"$nulls":4},0]
[{"$nulls":4},295,{"$nulls":4},{"$f":"IF(OR(H296=5,H296=10, H296=15, H296=\"BP\",H296=\"SCR\"),\"NT\",I296)","v":0}]
[{"$nulls":4},296,{"$nulls":4},0]
[{"$nulls":4},297,{"$nulls":4},0]
[{"$nulls":4},298,{"$nulls":4},0]
[{"$nulls":4},299,{"$nulls":4},0]
[{"$nulls":4},300,{"$nulls":4},0]

{"sheet":"2020 Fut","index":8,"n_rows":302,"n_cols":12,"rows_kept":302,"cut":false,"hidden":false,"merged":[]}
["Futurity","Der","Age Inct.","BBR","Draw","Rider Name","Horse Name","c/o","Time","Final Time","Placing","Money Earned"]
[{"$nulls":4},6,"Kylee Scribner","Firewater Cartel","OAH",15.760999999999999,null,"1D 1st",2100]
[{"$nulls":4},14,"Lacy Billingsley","PV Watchmeneighneigh","OP",15.842000000000001,null,"1D 2nd",1750]
[{"$nulls":4},13,"Whitney Godinez","Im Dun Smokin Bugs","OAH",15.903,null,"1D 3rd",1400]
[{"$nulls":4},8,"Hallie Hannsen","Jesswatchmestreak","OH",15.916,null,"1D 4th",1050]
[{"$nulls":4},21,"Kelly Allen","Miss JB 165","OA",15.943,null,"1D 5th",700]
[{"$nulls":4},1,"Molli Montgomery","This Fling Is Famous","O",16.045999999999999]
[{"$nulls":4},22,"Ashley Schafer","Our Bobby McGee","O",16.061]
[{"$nulls":4},5,"Odale Comer","Bullie In LA ","O",16.279]
[{"$nulls":4},2,"Ashley Schafer","French Streakin Slew","O",16.303000000000001]
[{"$nulls":4},25,"Chelsea Bartlett","Whynotmetoo","O",16.318999999999999]
[{"$nulls":4},10,"Caroline Boucher","Jet To The Sun","O",16.420999999999999]
[{"$nulls":4},17,"Shelby Stansbury","KC Moonshine Over Rocs","O",16.434000000000001]
[{"$nulls":4},4,"Joao Leao ","Flos Hush Money","O",16.446999999999999]
[{"$nulls":4},12,"Stephanie Fryar","Special Bid Of Frost","OA ",16.521000000000001,null,"2D 1st",900]
[{"$nulls":4},19,"Kassie Rieken","SO Ima Famous Guy","O",16.576000000000001,null,"2D 2nd",750]
[{"$nulls":4},15,"Jessica Lear","GL Fly Girl","O",16.661000000000001,null,"2D 3rd",600]
[{"$nulls":4},7,"Oceane Veilleux","KN Snap Back","OY",16.838000000000001,null,"2D 4th",450]
[{"$nulls":4},20,"Maddie Dewberry","Flights Quick Chick","O",16.992000000000001,null,"2D 5th",300]
[{"$nulls":4},24,"Sarah Pauels","VF Eddie Flashed Me",null,17.997]
[{"$nulls":4},11,"Kelly Bruner","Tufferenell","O","nt15.675"]
[{"$nulls":4},9,"Fonda Melby","RF Chrome In Black","O","nt15.917"]
[{"$nulls":4},23,"Molli Montgomery","First Famous Chic","O","nt15.993"]
[{"$nulls":4},18,"Jimmie Smith","Guys Ima Bunny Cat","OA","nt16.448"]
[{"$nulls":4},16,"Louis Paradis","French Ta Vegas","O","nt16.602"]
[{"$nulls":4},3,"Kelly Allen","Miss Regality","OA","nt16.720"]
[{"$nulls":4},25]
[{"$nulls":4},26]
[{"$nulls":4},27]
[{"$nulls":4},28]
[{"$nulls":4},29]
[{"$nulls":4},30]
[{"$nulls":4},31,{"$nulls":4},{"$f":"IF(OR(H33=5,H33=10, H33=15, H33=\"BP\",H33=\"SCR\"),\"NT\",I33)","v":0}]
[{"$nulls":4},32,{"$nulls":4},0]
[{"$nulls":4},33,{"$nulls":4},0]
[{"$nulls":4},34,{"$nulls":4},0]
[{"$nulls":4},35,{"$nulls":4},0]
[{"$nulls":4},36,{"$nulls":4},0]
[{"$nulls":4},37,{"$nulls":4},0]
[{"$nulls":4},38,{"$nulls":4},0]
[{"$nulls":4},39,{"$nulls":4},0]
[{"$nulls":4},40,{"$nulls":4},0]
[{"$nulls":4},41,{"$nulls":4},0]
[{"$nulls":4},42,{"$nulls":4},0]
[{"$nulls":4},43,{"$nulls":4},0]
[{"$nulls":4},44,{"$nulls":4},0]
[{"$nulls":4},45,{"$nulls":4},0]
[{"$nulls":4},46,{"$nulls":4},0]
[{"$nulls":4},47,{"$nulls":4},0]
[{"$nulls":4},48,{"$nulls":4},0]
[{"$nulls":4},49,{"$nulls":4},0]
[{"$nulls":4},50,{"$nulls":4},0]
[{"$nulls":4},51,{"$nulls":4},0]
[{"$nulls":4},52,{"$nulls":4},0]
[{"$nulls":4},53,{"$nulls":4},0]
[{"$nulls":4},54,{"$nulls":4},0]
[{"$nulls":4},55,{"$nulls":4},0]
[{"$nulls":4},56,{"$nulls":4},0]
[{"$nulls":4},57,{"$nulls":4},0]
[{"$nulls":4},58,{"$nulls":4},0]
[{"$nulls":4},59,{"$nulls":4},0]
[{"$nulls":4},60,{"$nulls":4},0]
[{"$nulls":4},61,{"$nulls":4},0]
[{"$nulls":4},62,{"$nulls":4},0]
[{"$nulls":4},63,{"$nulls":4},0]
[{"$nulls":4},64,{"$nulls":4},0]
[{"$nulls":4},65,{"$nulls":4},0]
[{"$nulls":4},66,{"$nulls":4},0]
[{"$nulls":4},67,{"$nulls":4},0]
[{"$nulls":4},68,{"$nulls":4},0]
[{"$nulls":4},69,{"$nulls":4},0]
[{"$nulls":4},70,{"$nulls":4},0]
[{"$nulls":4},71,{"$nulls":4},0]
[{"$nulls":4},72,{"$nulls":4},0]
[{"$nulls":4},73,{"$nulls":4},0]
[{"$nulls":4},74,{"$nulls":4},0]
[{"$nulls":4},75,{"$nulls":4},0]
[{"$nulls":4},76,{"$nulls":4},0]
[{"$nulls":4},77,{"$nulls":4},0]
[{"$nulls":4},78,{"$nulls":4},0]
[{"$nulls":4},79,{"$nulls":4},0]
[{"$nulls":4},80,{"$nulls":4},0]
[{"$nulls":4},81,{"$nulls":4},0]
[{"$nulls":4},82,{"$nulls":4},0]
[{"$nulls":4},83,{"$nulls":4},0]
[{"$nulls":4},84,{"$nulls":4},0]
[{"$nulls":4},85,{"$nulls":4},0]
[{"$nulls":4},86,{"$nulls":4},0]
[{"$nulls":4},87,{"$nulls":4},0]
[{"$nulls":4},88,{"$nulls":4},0]
[{"$nulls":4},89,{"$nulls":4},0]
[{"$nulls":4},90,{"$nulls":4},0]
[{"$nulls":4},91,{"$nulls":4},0]
[{"$nulls":4},92,{"$nulls":4},0]
[{"$nulls":4},93,{"$nulls":4},0]
[{"$nulls":4},94,{"$nulls":4},0]
[{"$nulls":4},95,{"$nulls":4},{"$f":"IF(OR(H97=5,H97=10, H97=15, H97=\"BP\",H97=\"SCR\"),\"NT\",I97)","v":0}]
[{"$nulls":4},96,{"$nulls":4},0]
[{"$nulls":4},97,{"$nulls":4},0]
[{"$nulls":4},98,{"$nulls":4},0]
[{"$nulls":4},99,{"$nulls":4},0]
[{"$nulls":4},100,{"$nulls":4},0]
[{"$nulls":4},101,{"$nulls":4},0]
[{"$nulls":4},102,{"$nulls":4},0]
[{"$nulls":4},103,{"$nulls":4},0]
[{"$nulls":4},104,{"$nulls":4},0]
[{"$nulls":4},105,{"$nulls":4},0]
[{"$nulls":4},106,{"$nulls":4},0]
[{"$nulls":4},107,{"$nulls":4},0]
[{"$nulls":4},108,{"$nulls":4},0]
[{"$nulls":4},109,{"$nulls":4},0]
[{"$nulls":4},110,{"$nulls":4},0]
[{"$nulls":4},111,{"$nulls":4},0]
[{"$nulls":4},112,{"$nulls":4},0]
[{"$nulls":4},113,{"$nulls":4},0]
[{"$nulls":4},114,{"$nulls":4},0]
[{"$nulls":4},115,{"$nulls":4},0]
[{"$nulls":4},116,{"$nulls":4},0]
[{"$nulls":4},117,{"$nulls":4},0]
[{"$nulls":4},118,{"$nulls":4},0]
[{"$nulls":4},119,{"$nulls":4},0]
[{"$nulls":4},120,{"$nulls":4},0]
[{"$nulls":4},121,{"$nulls":4},0]
[{"$nulls":4},122,{"$nulls":4},0]
[{"$nulls":4},123,{"$nulls":4},0]
[{"$nulls":4},124,{"$nulls":4},0]
[{"$nulls":4},125,{"$nulls":4},0]
[{"$nulls":4},126,{"$nulls":4},0]
[{"$nulls":4},127,{"$nulls":4},0]
[{"$nulls":4},128,{"$nulls":4},0]
[{"$nulls":4},129,{"$nulls":4},0]
[{"$nulls":4},130,{"$nulls":4},0]
[{"$nulls":4},131,{"$nulls":4},0]
[{"$nulls":4},132,{"$nulls":4},0]
[{"$nulls":4},133,{"$nulls":4},0]
[{"$nulls":4},134,{"$nulls":4},0]
[{"$nulls":4},135,{"$nulls":4},0]
[{"$nulls":4},136,{"$nulls":4},0]
[{"$nulls":4},137,{"$nulls":4},0]
[{"$nulls":4},138,{"$nulls":4},0]
[{"$nulls":4},139,{"$nulls":4},0]
[{"$nulls":4},140,{"$nulls":4},0]
[{"$nulls":4},141,{"$nulls":4},0]
[{"$nulls":4},142,{"$nulls":4},0]
[{"$nulls":4},143,{"$nulls":4},0]
[{"$nulls":4},144,{"$nulls":4},0]
[{"$nulls":4},145,{"$nulls":4},0]
[{"$nulls":4},146,{"$nulls":4},0]
[{"$nulls":4},147,{"$nulls":4},0]
[{"$nulls":4},148,{"$nulls":4},0]
[{"$nulls":4},149,{"$nulls":4},0]
[{"$nulls":4},150,{"$nulls":4},0]
[{"$nulls":4},151,{"$nulls":4},0]
[{"$nulls":4},152,{"$nulls":4},0]
[{"$nulls":4},153,{"$nulls":4},0]
[{"$nulls":4},154,{"$nulls":4},0]
[{"$nulls":4},155,{"$nulls":4},0]
[{"$nulls":4},156,{"$nulls":4},0]
[{"$nulls":4},157,{"$nulls":4},0]
[{"$nulls":4},158,{"$nulls":4},0]
[{"$nulls":4},159,{"$nulls":4},{"$f":"IF(OR(H161=5,H161=10, H161=15, H161=\"BP\",H161=\"SCR\"),\"NT\",I161)","v":0}]
[{"$nulls":4},160,{"$nulls":4},0]
[{"$nulls":4},161,{"$nulls":4},0]
[{"$nulls":4},162,{"$nulls":4},0]
[{"$nulls":4},163,{"$nulls":4},0]
[{"$nulls":4},164,{"$nulls":4},0]
[{"$nulls":4},165,{"$nulls":4},0]
[{"$nulls":4},166,{"$nulls":4},0]
[{"$nulls":4},167,{"$nulls":4},0]
[{"$nulls":4},168,{"$nulls":4},0]
[{"$nulls":4},169,{"$nulls":4},0]
[{"$nulls":4},170,{"$nulls":4},0]
[{"$nulls":4},171,{"$nulls":4},0]
[{"$nulls":4},172,{"$nulls":4},0]
[{"$nulls":4},173,{"$nulls":4},0]
[{"$nulls":4},174,{"$nulls":4},0]
[{"$nulls":4},175,{"$nulls":4},0]
[{"$nulls":4},176,{"$nulls":4},0]
[{"$nulls":4},177,{"$nulls":4},0]
[{"$nulls":4},178,{"$nulls":4},0]
[{"$nulls":4},179,{"$nulls":4},0]
[{"$nulls":4},180,{"$nulls":4},0]
[{"$nulls":4},181,{"$nulls":4},0]
[{"$nulls":4},182,{"$nulls":4},0]
[{"$nulls":4},183,{"$nulls":4},0]
[{"$nulls":4},184,{"$nulls":4},0]
[{"$nulls":4},185,{"$nulls":4},0]
[{"$nulls":4},186,{"$nulls":4},0]
[{"$nulls":4},187,{"$nulls":4},0]
[{"$nulls":4},188,{"$nulls":4},0]
[{"$nulls":4},189,{"$nulls":4},0]
[{"$nulls":4},190,{"$nulls":4},0]
[{"$nulls":4},191,{"$nulls":4},0]
[{"$nulls":4},192,{"$nulls":4},0]
[{"$nulls":4},193,{"$nulls":4},0]
[{"$nulls":4},194,{"$nulls":4},0]
[{"$nulls":4},195,{"$nulls":4},0]
[{"$nulls":4},196,{"$nulls":4},0]
[{"$nulls":4},197,{"$nulls":4},0]
[{"$nulls":4},198,{"$nulls":4},0]
[{"$nulls":4},199,{"$nulls":4},0]
[{"$nulls":4},200,{"$nulls":4},0]
[{"$nulls":4},201,{"$nulls":4},0]
[{"$nulls":4},202,{"$nulls":4},0]
[{"$nulls":4},203,{"$nulls":4},0]
[{"$nulls":4},204,{"$nulls":4},0]
[{"$nulls":4},205,{"$nulls":4},0]
[{"$nulls":4},206,{"$nulls":4},0]
[{"$nulls":4},207,{"$nulls":4},0]
[{"$nulls":4},208,{"$nulls":4},0]
[{"$nulls":4},209,{"$nulls":4},0]
[{"$nulls":4},210,{"$nulls":4},0]
[{"$nulls":4},211,{"$nulls":4},0]
[{"$nulls":4},212,{"$nulls":4},0]
[{"$nulls":4},213,{"$nulls":4},0]
[{"$nulls":4},214,{"$nulls":4},0]
[{"$nulls":4},215,{"$nulls":4},0]
[{"$nulls":4},216,{"$nulls":4},0]
[{"$nulls":4},217,{"$nulls":4},0]
[{"$nulls":4},218,{"$nulls":4},0]
[{"$nulls":4},219,{"$nulls":4},0]
[{"$nulls":4},220,{"$nulls":4},0]
[{"$nulls":4},221,{"$nulls":4},0]
[{"$nulls":4},222,{"$nulls":4},0]
[{"$nulls":4},223,{"$nulls":4},{"$f":"IF(OR(H225=5,H225=10, H225=15, H225=\"BP\",H225=\"SCR\"),\"NT\",I225)","v":0}]
[{"$nulls":4},224,{"$nulls":4},0]
[{"$nulls":4},225,{"$nulls":4},0]
[{"$nulls":4},226,{"$nulls":4},0]
[{"$nulls":4},227,{"$nulls":4},0]
[{"$nulls":4},228,{"$nulls":4},0]
[{"$nulls":4},229,{"$nulls":4},0]
[{"$nulls":4},230,{"$nulls":4},0]
[{"$nulls":4},231,{"$nulls":4},0]
[{"$nulls":4},232,{"$nulls":4},0]
[{"$nulls":4},233,{"$nulls":4},0]
[{"$nulls":4},234,{"$nulls":4},0]
[{"$nulls":4},235,{"$nulls":4},0]
[{"$nulls":4},236,{"$nulls":4},0]
[{"$nulls":4},237,{"$nulls":4},0]
[{"$nulls":4},238,{"$nulls":4},0]
[{"$nulls":4},239,{"$nulls":4},0]
[{"$nulls":4},240,{"$nulls":4},0]
[{"$nulls":4},241,{"$nulls":4},0]
[{"$nulls":4},242,{"$nulls":4},0]
[{"$nulls":4},243,{"$nulls":4},0]
[{"$nulls":4},244,{"$nulls":4},0]
[{"$nulls":4},245,{"$nulls":4},0]
[{"$nulls":4},246,{"$nulls":4},0]
[{"$nulls":4},247,{"$nulls":4},0]
[{"$nulls":4},248,{"$nulls":4},0]
[{"$nulls":4},249,{"$nulls":4},0]
[{"$nulls":4},250,{"$nulls":4},0]
[{"$nulls":4},251,{"$nulls":4},0]
[{"$nulls":4},252,{"$nulls":4},0]
[{"$nulls":4},253,{"$nulls":4},0]
[{"$nulls":4},254,{"$nulls":4},0]
[{"$nulls":4},255,{"$nulls":4},0]
[{"$nulls":4},256,{"$nulls":4},0]
[{"$nulls":4},257,{"$nulls":4},0]
[{"$nulls":4},258,{"$nulls":4},0]
[{"$nulls":4},259,{"$nulls":4},0]
[{"$nulls":4},260,{"$nulls":4},0]
[{"$nulls":4},261,{"$nulls":4},0]
[{"$nulls":4},262,{"$nulls":4},0]
[{"$nulls":4},263,{"$nulls":4},0]
[{"$nulls":4},264,{"$nulls":4},0]
[{"$nulls":4},265,{"$nulls":4},0]
[{"$nulls":4},266,{"$nulls":4},0]
[{"$nulls":4},267,{"$nulls":4},0]
[{"$nulls":4},268,{"$nulls":4},0]
[{"$nulls":4},269,{"$nulls":4},0]
[{"$nulls":4},270,{"$nulls":4},0]
[{"$nulls":4},271,{"$nulls":4},0]
[{"$nulls":4},272,{"$nulls":4},0]
[{"$nulls":4},273,{"$nulls":4},0]
[{"$nulls":4},274,{"$nulls":4},0]
[{"$nulls":4},275,{"$nulls":4},0]
[{"$nulls":4},276,{"$nulls":4},0]
[{"$nulls":4},277,{"$nulls":4},0]
[{"$nulls":4},278,{"$nulls":4},0]
[{"$nulls":4},279,{"$nulls":4},0]
[{"$nulls":4},280,{"$nulls":4},0]
[{"$nulls":4},281,{"$nulls":4},0]
[{"$nulls":4},282,{"$nulls":4},0]
[{"$nulls":4},283,{"$nulls":4},0]
[{"$nulls":4},284,{"$nulls":4},0]
[{"$nulls":4},285,{"$nulls":4},0]
[{"$nulls":4},286,{"$nulls":4},0]
[{"$nulls":4},287,{"$nulls":4},{"$f":"IF(OR(H289=5,H289=10, H289=15, H289=\"BP\",H289=\"SCR\"),\"NT\",I289)","v":0}]
[{"$nulls":4},288,{"$nulls":4},0]
[{"$nulls":4},289,{"$nulls":4},0]
[{"$nulls":4},290,{"$nulls":4},0]
[{"$nulls":4},291,{"$nulls":4},0]
[{"$nulls":4},292,{"$nulls":4},0]
[{"$nulls":4},293,{"$nulls":4},0]
[{"$nulls":4},294,{"$nulls":4},0]
[{"$nulls":4},295,{"$nulls":4},0]
[{"$nulls":4},296,{"$nulls":4},0]
[{"$nulls":4},297,{"$nulls":4},0]
[{"$nulls":4},298,{"$nulls":4},0]
[{"$nulls":4},299,{"$nulls":4},0]
[{"$nulls":4},300,{"$nulls":4},0]

{"sheet":"12 & Under","index":9,"n_rows":301,"n_cols":11,"rows_kept":301,"cut":false,"hidden":true,"merged":[]}
["Futurity","Der","Age Inct.","R/O","Draw","Rider Name","Horse Name","Time","Final Time","Placing","Money Earned"]
{"$rows_empty":31}
[{"$nulls":4},32]
[{"$nulls":4},33]
[{"$nulls":4},34]
[{"$nulls":4},35]
[{"$nulls":4},36]
[{"$nulls":4},37]
[{"$nulls":4},38]
[{"$nulls":4},39]
[{"$nulls":4},40]
[{"$nulls":4},41]
[{"$nulls":4},42]
[{"$nulls":4},43]
[{"$nulls":4},44]
[{"$nulls":4},45]
[{"$nulls":4},46]
[{"$nulls":4},47]
[{"$nulls":4},48]
[{"$nulls":4},49]
[{"$nulls":4},50]
[{"$nulls":4},51]
[{"$nulls":4},52]
[{"$nulls":4},53]
[{"$nulls":4},54]
[{"$nulls":4},55]
[{"$nulls":4},56]
[{"$nulls":4},57]
[{"$nulls":4},58]
[{"$nulls":4},59]
[{"$nulls":4},60]
[{"$nulls":4},61]
[{"$nulls":4},62]
[{"$nulls":4},63]
[{"$nulls":4},64]
[{"$nulls":4},65]
[{"$nulls":4},66]
[{"$nulls":4},67]
[{"$nulls":4},68]
[{"$nulls":4},69]
[{"$nulls":4},70]
[{"$nulls":4},71]
[{"$nulls":4},72]
[{"$nulls":4},73]
[{"$nulls":4},74]
[{"$nulls":4},75]
[{"$nulls":4},76]
[{"$nulls":4},77]
[{"$nulls":4},78]
[{"$nulls":4},79]
[{"$nulls":4},80]
[{"$nulls":4},81]
[{"$nulls":4},82]
[{"$nulls":4},83]
[{"$nulls":4},84]
[{"$nulls":4},85]
[{"$nulls":4},86]
[{"$nulls":4},87]
[{"$nulls":4},88]
[{"$nulls":4},89]
[{"$nulls":4},90]
[{"$nulls":4},91]
[{"$nulls":4},92]
[{"$nulls":4},93]
[{"$nulls":4},94]
[{"$nulls":4},95]
[{"$nulls":4},96]
[{"$nulls":4},97]
[{"$nulls":4},98]
[{"$nulls":4},99]
[{"$nulls":4},100]
[{"$nulls":4},101]
[{"$nulls":4},102]
[{"$nulls":4},103]
[{"$nulls":4},104]
[{"$nulls":4},105]
[{"$nulls":4},106]
[{"$nulls":4},107]
[{"$nulls":4},108]
[{"$nulls":4},109]
[{"$nulls":4},110]
[{"$nulls":4},111]
[{"$nulls":4},112]
[{"$nulls":4},113]
[{"$nulls":4},114]
[{"$nulls":4},115]
[{"$nulls":4},116]
[{"$nulls":4},117]
[{"$nulls":4},118]
[{"$nulls":4},119]
[{"$nulls":4},120]
[{"$nulls":4},121]
[{"$nulls":4},122]
[{"$nulls":4},123]
[{"$nulls":4},124]
[{"$nulls":4},125]
[{"$nulls":4},126]
[{"$nulls":4},127]
[{"$nulls":4},128]
[{"$nulls":4},129]
[{"$nulls":4},130]
[{"$nulls":4},131]
[{"$nulls":4},132]
[{"$nulls":4},133]
[{"$nulls":4},134]
[{"$nulls":4},135]
[{"$nulls":4},136]
[{"$nulls":4},137]
[{"$nulls":4},138]
[{"$nulls":4},139]
[{"$nulls":4},140]
[{"$nulls":4},141]
[{"$nulls":4},142]
[{"$nulls":4},143]
[{"$nulls":4},144]
[{"$nulls":4},145]
[{"$nulls":4},146]
[{"$nulls":4},147]
[{"$nulls":4},148]
[{"$nulls":4},149]
[{"$nulls":4},150]
[{"$nulls":4},151]
[{"$nulls":4},152]
[{"$nulls":4},153]
[{"$nulls":4},154]
[{"$nulls":4},155]
[{"$nulls":4},156]
[{"$nulls":4},157]
[{"$nulls":4},158]
[{"$nulls":4},159]
[{"$nulls":4},160]
[{"$nulls":4},161]
[{"$nulls":4},162]
[{"$nulls":4},163]
[{"$nulls":4},164]
[{"$nulls":4},165]
[{"$nulls":4},166]
[{"$nulls":4},167]
[{"$nulls":4},168]
[{"$nulls":4},169]
[{"$nulls":4},170]
[{"$nulls":4},171]
[{"$nulls":4},172]
[{"$nulls":4},173]
[{"$nulls":4},174]
[{"$nulls":4},175]
[{"$nulls":4},176]
[{"$nulls":4},177]
[{"$nulls":4},178]
[{"$nulls":4},179]
[{"$nulls":4},180]
[{"$nulls":4},181]
[{"$nulls":4},182]
[{"$nulls":4},183]
[{"$nulls":4},184]
[{"$nulls":4},185]
[{"$nulls":4},186]
[{"$nulls":4},187]
[{"$nulls":4},188]
[{"$nulls":4},189]
[{"$nulls":4},190]
[{"$nulls":4},191]
[{"$nulls":4},192]
[{"$nulls":4},193]
[{"$nulls":4},194]
[{"$nulls":4},195]
[{"$nulls":4},196]
[{"$nulls":4},197]
[{"$nulls":4},198]
[{"$nulls":4},199]
[{"$nulls":4},200]
[{"$nulls":4},201]
[{"$nulls":4},202]
[{"$nulls":4},203]
[{"$nulls":4},204]
[{"$nulls":4},205]
[{"$nulls":4},206]
[{"$nulls":4},207]
[{"$nulls":4},208]
[{"$nulls":4},209]
[{"$nulls":4},210]
[{"$nulls":4},211]
[{"$nulls":4},212]
[{"$nulls":4},213]
[{"$nulls":4},214]
[{"$nulls":4},215]
[{"$nulls":4},216]
[{"$nulls":4},217]
[{"$nulls":4},218]
[{"$nulls":4},219]
[{"$nulls":4},220]
[{"$nulls":4},221]
[{"$nulls":4},222]
[{"$nulls":4},223]
[{"$nulls":4},224]
[{"$nulls":4},225]
[{"$nulls":4},226]
[{"$nulls":4},227]
[{"$nulls":4},228]
[{"$nulls":4},229]
[{"$nulls":4},230]
[{"$nulls":4},231]
[{"$nulls":4},232]
[{"$nulls":4},233]
[{"$nulls":4},234]
[{"$nulls":4},235]
[{"$nulls":4},236]
[{"$nulls":4},237]
[{"$nulls":4},238]
[{"$nulls":4},239]
[{"$nulls":4},240]
[{"$nulls":4},241]
[{"$nulls":4},242]
[{"$nulls":4},243]
[{"$nulls":4},244]
[{"$nulls":4},245]
[{"$nulls":4},246]
[{"$nulls":4},247]
[{"$nulls":4},248]
[{"$nulls":4},249]
[{"$nulls":4},250]
[{"$nulls":4},251]
[{"$nulls":4},252]
[{"$nulls":4},253]
[{"$nulls":4},254]
[{"$nulls":4},255]
[{"$nulls":4},256]
[{"$nulls":4},257]
[{"$nulls":4},258]
[{"$nulls":4},259]
[{"$nulls":4},260]
[{"$nulls":4},261]
[{"$nulls":4},262]
[{"$nulls":4},263]
[{"$nulls":4},264]
[{"$nulls":4},265]
[{"$nulls":4},266]
[{"$nulls":4},267]
[{"$nulls":4},268]
[{"$nulls":4},269]
[{"$nulls":4},270]
[{"$nulls":4},271]
[{"$nulls":4},272]
[{"$nulls":4},273]
[{"$nulls":4},274]
[{"$nulls":4},275]
[{"$nulls":4},276]
[{"$nulls":4},277]
[{"$nulls":4},278]
[{"$nulls":4},279]
[{"$nulls":4},280]
[{"$nulls":4},281]
[{"$nulls":4},282]
[{"$nulls":4},283]
[{"$nulls":4},284]
[{"$nulls":4},285]
[{"$nulls":4},286]
[{"$nulls":4},287]
[{"$nulls":4},288]
[{"$nulls":4},289]
[{"$nulls":4},290]
[{"$nulls":4},291]
[{"$nulls":4},292]
[{"$nulls":4},293]
[{"$nulls":4},294]
[{"$nulls":4},295]
[{"$nulls":4},296]
[{"$nulls":4},297]
[{"$nulls":4},298]
[{"$nulls":4},299]
[{"$nulls":4},300]

{"sheet":"Future champs","index":10,"n_rows":21,"n_cols":8,"rows_kept":21,"cut":false,"hidden":false,"merged":[]}
["Draw","Rider Name","Horse Name","Pen","Time","Final Time","Placing","Money Earned"]
[17,"Kimber Steffen","Katie",null,16.850999999999999,{"$f":"IF(OR(D2=5,D2=10, D2=15, D2=\"BP\",D2=\"SCR\"),\"NT\",E2)","v":16.850999999999999},null,128]
[4,"Josey Teague","MeMe",null,17.488,null,null,106]
[1,"MacLaine Degroot","Monkey",null,18.128,null,null,85]
[5,"RuthAnn Hutchison","Daffy",null,18.189,null,null,64]
[18,"RuthAnn Hutchison","Winnie",null,18.86,{"$f":"IF(OR(D6=5,D6=10, D6=15, D6=\"BP\",D6=\"SCR\"),\"NT\",E6)","v":18.86},null,43]
[6,"Bryson Rawson",null,null,19.015999999999998]
[8,"CoraLee Williams",null,null,20.728999999999999]
[9,"Reata Worthington","Stella",null,22.524999999999999]
[2,"Kyah Pillans","Scarlett",null,24.420999999999999]
[16,"Kaley Steffen","Cookie",null,28.747,{"$f":"IF(OR(D11=5,D11=10, D11=15, D11=\"BP\",D11=\"SCR\"),\"NT\",E11)","v":28.747}]
[10,"Breelyn Black","Poptart",null,30.507000000000001]
[11,"Quincy Tucker","Sophie",null,32.32]
[12,"Wheyzbrie Nilson","He Can Chant",null,39]
[7,"Wyatt Williams",null,null,39.997]
[13,"Blaze Ornelas","Soldier",null,49.15]
[14,"Sophie ROberts ","Rainbowdash",null,70.759]
[15,"Kase Ferguson","Bay",null,77.494]
[3,"Annabelle Alexander","A Master Blueprint",null,"nt"]
[19,"Annabelle Alexander",null,null,"nt",{"$f":"IF(OR(D20=5,D20=10, D20=15, D20=\"BP\",D20=\"SCR\"),\"NT\",E20)","v":"nt"}]
[20,{"$nulls":4},{"$f":"IF(OR(D21=5,D21=10, D21=15, D21=\"BP\",D21=\"SCR\"),\"NT\",E21)","v":0}]

{"sheet":"Average","index":11,"n_rows":503,"n_cols":31,"rows_kept":503,"cut":false,"hidden":false,"merged":[[0,0,0,26],[1,0,1,26],[2,28,2,29],[9,28,9,29],[10,28,10,29]]}
["Parker County Arena "]
["Open"]
["4 Yr Fut","5 Yr Fut","Der","Age Inct.","Am","Carry","T/C","F/F","Mem","Nom","Av","BBR","WPRA","Draw","Owner Name","Rider Name","Horse Name","Pen","Time 1","Final Time 1","Pen","Time 2","Final Time 2","Total Time","Average Time","Placing","Money Earned",null,"D Placing",null,"Split"]
[{"$nulls":13},1,{"$nulls":5},{"$f":"IF(OR(R4=5,R4=10, R4=15, R4=\"BP\",R4=\"SCR\"),\"NT\",S4)","v":0},null,null,{"$f":"IF(OR(U4=5,U4=10, U4=15, U4=\"BP\",U4=\"SCR\"),\"NT\",V4)","v":0},{"$f":"(T4+W4)","v":0},{"$f":"(T4+W4)/2","v":0},null,null,null,"1D"]
[{"$nulls":13},2,{"$nulls":5},0,null,null,0,0,0,null,null,null,"2D",{"$f":"$AD$4+$AE$5","v":0.5},0.5]
[{"$nulls":13},3,{"$nulls":5},0,null,null,0,0,0,null,null,null,"3D",{"$f":"$AD$5+$AE$6","v":1},0.5]
[{"$nulls":13},4,{"$nulls":5},0,null,null,0,0,0,null,null,null,"4D",{"$f":"$AD$6+$AE$7","v":1.5},0.5]
[{"$nulls":13},5,{"$nulls":5},0,null,null,0,0,0,null,null,null,"5D",{"$f":"$AD$7+$AE$8","v":2},0.5]
[{"$nulls":13},6,{"$nulls":5},0,null,null,0,0,0]
[{"$nulls":13},7,{"$nulls":5},0,null,null,0,0,0,null,null,null,"# Entered"]
[{"$nulls":13},8,{"$nulls":5},0,null,null,0,0,0,null,null,null,{"$f":"COUNTA(P4:P503)","v":0}]
[{"$nulls":13},9,{"$nulls":5},0,null,null,0,0,0]
[{"$nulls":13},10,{"$nulls":5},0,null,null,0,0,0]
[{"$nulls":13},11,{"$nulls":5},0,null,null,0,0,0]
[{"$nulls":13},12,{"$nulls":5},0,null,null,0,0,0]
[{"$nulls":13},13,{"$nulls":5},0,null,null,0,0,0]
[{"$nulls":13},14,{"$nulls":5},{"$f":"IF(OR(R17=5,R17=10, R17=15, R17=\"BP\",R17=\"SCR\"),\"NT\",S17)","v":0},null,null,{"$f":"IF(OR(U17=5,U17=10, U17=15, U17=\"BP\",U17=\"SCR\"),\"NT\",V17)","v":0},{"$f":"(T17+W17)","v":0},{"$f":"(T17+W17)/2","v":0}]
[{"$nulls":13},15,{"$nulls":5},0,null,null,0,0,0]
[{"$nulls":13},16,{"$nulls":5},0,null,null,0,0,0]
[{"$nulls":13},17,{"$nulls":5},0,null,null,0,0,0]
[{"$nulls":13},18,{"$nulls":5},0,null,null,0,0,0]
[{"$nulls":13},19,{"$nulls":5},0,null,null,0,0,0]
[{"$nulls":13},20,{"$nulls":5},0,null,null,0,0,0]
[{"$nulls":13},21,{"$nulls":5},0,null,null,0,0,0]
[{"$nulls":13},22,{"$nulls":5},0,null,null,0,0,0]
[{"$nulls":13},23,{"$nulls":5},0,null,null,0,0,0]
[{"$nulls":13},24,{"$nulls":5},0,null,null,0,0,0]
[{"$nulls":13},25,{"$nulls":5},0,null,null,0,0,0]
[{"$nulls":13},26,{"$nulls":5},0,null,null,0,0,0]
[{"$nulls":13},27,{"$nulls":5},0,null,null,0,0,0]
[{"$nulls":13},28,{"$nulls":5},0,null,null,0,0,0]
[{"$nulls":13},29,{"$nulls":5},0,null,null,0,0,0]
[{"$nulls":13},30,{"$nulls":5},0,null,null,0,0,0]
[{"$nulls":13},31,{"$nulls":5},0,null,null,0,0,0]
[{"$nulls":13},32,{"$nulls":5},0,null,null,0,0,0]
[{"$nulls":13},33,{"$nulls":5},0,null,null,0,0,0]
[{"$nulls":13},34,{"$nulls":5},0,null,null,0,0,0]
[{"$nulls":13},35,{"$nulls":5},0,null,null,0,0,0]
[{"$nulls":13},36,{"$nulls":5},0,null,null,0,0,0]
[{"$nulls":13},37,{"$nulls":5},0,null,null,0,0,0]
[{"$nulls":13},38,{"$nulls":5},0,null,null,0,0,0]
[{"$nulls":13},39,{"$nulls":5},0,null,null,0,0,0]
[{"$nulls":13},40,{"$nulls":5},0,null,null,0,0,0]
[{"$nulls":13},41,{"$nulls":5},0,null,null,0,0,0]
[{"$nulls":13},42,{"$nulls":5},0,null,null,0,0,0]
[{"$nulls":13},43,{"$nulls":5},0,null,null,0,0,0]
[{"$nulls":13},44,{"$nulls":5},0,null,null,0,0,0]
[{"$nulls":13},45,{"$nulls":5},0,null,null,0,0,0]
[{"$nulls":13},46,{"$nulls":5},0,null,null,0,0,0]
[{"$nulls":13},47,{"$nulls":5},0,null,null,0,0,0]
[{"$nulls":13},48,{"$nulls":5},0,null,null,0,0,0]
[{"$nulls":13},49,{"$nulls":5},0,null,null,0,0,0]
[{"$nulls":13},50,{"$nulls":5},0,null,null,0,0,0]
[{"$nulls":13},51,{"$nulls":5},0,null,null,0,0,0]
[{"$nulls":13},52,{"$nulls":5},0,null,null,0,0,0]
[{"$nulls":13},53,{"$nulls":5},0,null,null,0,0,0]
[{"$nulls":13},54,{"$nulls":5},0,null,null,0,0,0]
[{"$nulls":13},55,{"$nulls":5},0,null,null,0,0,0]
[{"$nulls":13},56,{"$nulls":5},0,null,null,0,0,0]
[{"$nulls":13},57,{"$nulls":5},0,null,null,0,0,0]
[{"$nulls":13},58,{"$nulls":5},0,null,null,0,0,0]
[{"$nulls":13},59,{"$nulls":5},0,null,null,0,0,0]
[{"$nulls":13},60,{"$nulls":5},0,null,null,0,0,0]
[{"$nulls":13},61,{"$nulls":5},0,null,null,0,0,0]
[{"$nulls":13},62,{"$nulls":5},0,null,null,0,0,0]
[{"$nulls":13},63,{"$nulls":5},0,null,null,0,0,0]
[{"$nulls":13},64,{"$nulls":5},0,null,null,0,0,0]
[{"$nulls":13},65,{"$nulls":5},0,null,null,0,0,0]
[{"$nulls":13},66,{"$nulls":5},{"$f":"IF(OR(R69=5,R69=10, R69=15, R69=\"BP\",R69=\"SCR\"),\"NT\",S69)","v":0},null,null,{"$f":"IF(OR(U69=5,U69=10, U69=15, U69=\"BP\",U69=\"SCR\"),\"NT\",V69)","v":0},{"$f":"(T69+W69)","v":0},{"$f":"(T69+W69)/2","v":0}]
[{"$nulls":13},67,{"$nulls":5},0,null,null,0,0,0]
[{"$nulls":13},68,{"$nulls":5},0,null,null,0,0,0]
[{"$nulls":13},69,{"$nulls":5},0,null,null,0,0,0]
[{"$nulls":13},70,{"$nulls":5},0,null,null,0,0,0]
[{"$nulls":13},71,{"$nulls":5},0,null,null,0,0,0]
[{"$nulls":13},72,{"$nulls":5},0,null,null,0,0,0]
[{"$nulls":13},73,{"$nulls":5},0,null,null,0,0,0]
[{"$nulls":13},74,{"$nulls":5},0,null,null,0,0,0]
[{"$nulls":13},75,{"$nulls":5},0,null,null,0,0,0]
[{"$nulls":13},76,{"$nulls":5},0,null,null,0,0,0]
[{"$nulls":13},77,{"$nulls":5},0,null,null,0,0,0]
[{"$nulls":13},78,{"$nulls":5},0,null,null,0,0,0]
[{"$nulls":13},79,{"$nulls":5},0,null,null,0,0,0]
[{"$nulls":13},80,{"$nulls":5},0,null,null,0,0,0]
[{"$nulls":13},81,{"$nulls":5},0,null,null,0,0,0]
[{"$nulls":13},82,{"$nulls":5},0,null,null,0,0,0]
[{"$nulls":13},83,{"$nulls":5},0,null,null,0,0,0]
[{"$nulls":13},84,{"$nulls":5},0,null,null,0,0,0]
[{"$nulls":13},85,{"$nulls":5},0,null,null,0,0,0]
[{"$nulls":13},86,{"$nulls":5},0,null,null,0,0,0]
[{"$nulls":13},87,{"$nulls":5},0,null,null,0,0,0]
[{"$nulls":13},88,{"$nulls":5},0,null,null,0,0,0]
[{"$nulls":13},89,{"$nulls":5},0,null,null,0,0,0]
[{"$nulls":13},90,{"$nulls":5},0,null,null,0,0,0]
[{"$nulls":13},91,{"$nulls":5},0,null,null,0,0,0]
[{"$nulls":13},92,{"$nulls":5},0,null,null,0,0,0]
[{"$nulls":13},93,{"$nulls":5},0,null,null,0,0,0]
[{"$nulls":13},94,{"$nulls":5},0,null,null,0,0,0]
[{"$nulls":13},95,{"$nulls":5},0,null,null,0,0,0]
[{"$nulls":13},96,{"$nulls":5},0,null,null,0,0,0]
[{"$nulls":13},97,{"$nulls":5},0,null,null,0,0,0]
[{"$nulls":13},98,{"$nulls":5},0,null,null,0,0,0]
[{"$nulls":13},99,{"$nulls":5},0,null,null,0,0,0]
[{"$nulls":13},100,{"$nulls":5},0,null,null,0,0,0]
[{"$nulls":13},101,{"$nulls":5},0,null,null,0,0,0]
[{"$nulls":13},102,{"$nulls":5},0,null,null,0,0,0]
[{"$nulls":13},103,{"$nulls":5},0,null,null,0,0,0]
[{"$nulls":13},104,{"$nulls":5},0,null,null,0,0,0]
[{"$nulls":13},105,{"$nulls":5},0,null,null,0,0,0]
[{"$nulls":13},106,{"$nulls":5},0,null,null,0,0,0]
[{"$nulls":13},107,{"$nulls":5},0,null,null,0,0,0]
[{"$nulls":13},108,{"$nulls":5},0,null,null,0,0,0]
[{"$nulls":13},109,{"$nulls":5},0,null,null,0,0,0]
[{"$nulls":13},110,{"$nulls":5},0,null,null,0,0,0]
[{"$nulls":13},111,{"$nulls":5},0,null,null,0,0,0]
[{"$nulls":13},112,{"$nulls":5},0,null,null,0,0,0]
[{"$nulls":13},113,{"$nulls":5},0,null,null,0,0,0]
[{"$nulls":13},114,{"$nulls":5},0,null,null,0,0,0]
[{"$nulls":13},115,{"$nulls":5},0,null,null,0,0,0]
[{"$nulls":13},116,{"$nulls":5},0,null,null,0,0,0]
[{"$nulls":13},117,{"$nulls":5},0,null,null,0,0,0]
[{"$nulls":13},118,{"$nulls":5},0,null,null,0,0,0]
[{"$nulls":13},119,{"$nulls":5},0,null,null,0,0,0]
[{"$nulls":13},120,{"$nulls":5},0,null,null,0,0,0]
[{"$nulls":13},121,{"$nulls":5},0,null,null,0,0,0]
[{"$nulls":13},122,{"$nulls":5},0,null,null,0,0,0]
[{"$nulls":13},123,{"$nulls":5},0,null,null,0,0,0]
[{"$nulls":13},124,{"$nulls":5},0,null,null,0,0,0]
[{"$nulls":13},125,{"$nulls":5},0,null,null,0,0,0]
[{"$nulls":13},126,{"$nulls":5},0,null,null,0,0,0]
[{"$nulls":13},127,{"$nulls":5},0,null,null,0,0,0]
[{"$nulls":13},128,{"$nulls":5},0,null,null,0,0,0]
[{"$nulls":13},129,{"$nulls":5},0,null,null,0,0,0]
[{"$nulls":13},130,{"$nulls":5},{"$f":"IF(OR(R133=5,R133=10, R133=15, R133=\"BP\",R133=\"SCR\"),\"NT\",S133)","v":0},null,null,{"$f":"IF(OR(U133=5,U133=10, U133=15, U133=\"BP\",U133=\"SCR\"),\"NT\",V133)","v":0},{"$f":"(T133+W133)","v":0},{"$f":"(T133+W133)/2","v":0}]
[{"$nulls":13},131,{"$nulls":5},0,null,null,0,0,0]
[{"$nulls":13},132,{"$nulls":5},0,null,null,0,0,0]
[{"$nulls":13},133,{"$nulls":5},0,null,null,0,0,0]
[{"$nulls":13},134,{"$nulls":5},0,null,null,0,0,0]
[{"$nulls":13},135,{"$nulls":5},0,null,null,0,0,0]
[{"$nulls":13},136,{"$nulls":5},0,null,null,0,0,0]
[{"$nulls":13},137,{"$nulls":5},0,null,null,0,0,0]
[{"$nulls":13},138,{"$nulls":5},0,null,null,0,0,0]
[{"$nulls":13},139,{"$nulls":5},0,null,null,0,0,0]
[{"$nulls":13},140,{"$nulls":5},0,null,null,0,0,0]
[{"$nulls":13},141,{"$nulls":5},0,null,null,0,0,0]
[{"$nulls":13},142,{"$nulls":5},0,null,null,0,0,0]
[{"$nulls":13},143,{"$nulls":5},0,null,null,0,0,0]
[{"$nulls":13},144,{"$nulls":5},0,null,null,0,0,0]
[{"$nulls":13},145,{"$nulls":5},0,null,null,0,0,0]
[{"$nulls":13},146,{"$nulls":5},0,null,null,0,0,0]
[{"$nulls":13},147,{"$nulls":5},0,null,null,0,0,0]
[{"$nulls":13},148,{"$nulls":5},0,null,null,0,0,0]
[{"$nulls":13},149,{"$nulls":5},0,null,null,0,0,0]
[{"$nulls":13},150,{"$nulls":5},0,null,null,0,0,0]
[{"$nulls":13},151,{"$nulls":5},0,null,null,0,0,0]
[{"$nulls":13},152,{"$nulls":5},0,null,null,0,0,0]
[{"$nulls":13},153,{"$nulls":5},0,null,null,0,0,0]
[{"$nulls":13},154,{"$nulls":5},0,null,null,0,0,0]
[{"$nulls":13},155,{"$nulls":5},0,null,null,0,0,0]
[{"$nulls":13},156,{"$nulls":5},0,null,null,0,0,0]
[{"$nulls":13},157,{"$nulls":5},0,null,null,0,0,0]
[{"$nulls":13},158,{"$nulls":5},0,null,null,0,0,0]
[{"$nulls":13},159,{"$nulls":5},0,null,null,0,0,0]
[{"$nulls":13},160,{"$nulls":5},0,null,null,0,0,0]
[{"$nulls":13},161,{"$nulls":5},0,null,null,0,0,0]
[{"$nulls":13},162,{"$nulls":5},0,null,null,0,0,0]
[{"$nulls":13},163,{"$nulls":5},0,null,null,0,0,0]
[{"$nulls":13},164,{"$nulls":5},0,null,null,0,0,0]
[{"$nulls":13},165,{"$nulls":5},0,null,null,0,0,0]
[{"$nulls":13},166,{"$nulls":5},0,null,null,0,0,0]
[{"$nulls":13},167,{"$nulls":5},0,null,null,0,0,0]
[{"$nulls":13},168,{"$nulls":5},0,null,null,0,0,0]
[{"$nulls":13},169,{"$nulls":5},0,null,null,0,0,0]
[{"$nulls":13},170,{"$nulls":5},0,null,null,0,0,0]
[{"$nulls":13},171,{"$nulls":5},0,null,null,0,0,0]
[{"$nulls":13},172,{"$nulls":5},0,null,null,0,0,0]
[{"$nulls":13},173,{"$nulls":5},0,null,null,0,0,0]
[{"$nulls":13},174,{"$nulls":5},0,null,null,0,0,0]
[{"$nulls":13},175,{"$nulls":5},0,null,null,0,0,0]
[{"$nulls":13},176,{"$nulls":5},0,null,null,0,0,0]
[{"$nulls":13},177,{"$nulls":5},0,null,null,0,0,0]
[{"$nulls":13},178,{"$nulls":5},0,null,null,0,0,0]
[{"$nulls":13},179,{"$nulls":5},0,null,null,0,0,0]
[{"$nulls":13},180,{"$nulls":5},0,null,null,0,0,0]
[{"$nulls":13},181,{"$nulls":5},0,null,null,0,0,0]
[{"$nulls":13},182,{"$nulls":5},0,null,null,0,0,0]
[{"$nulls":13},183,{"$nulls":5},0,null,null,0,0,0]
[{"$nulls":13},184,{"$nulls":5},0,null,null,0,0,0]
[{"$nulls":13},185,{"$nulls":5},0,null,null,0,0,0]
[{"$nulls":13},186,{"$nulls":5},0,null,null,0,0,0]
[{"$nulls":13},187,{"$nulls":5},0,null,null,0,0,0]
[{"$nulls":13},188,{"$nulls":5},0,null,null,0,0,0]
[{"$nulls":13},189,{"$nulls":5},0,null,null,0,0,0]
[{"$nulls":13},190,{"$nulls":5},0,null,null,0,0,0]
[{"$nulls":13},191,{"$nulls":5},0,null,null,0,0,0]
[{"$nulls":13},192,{"$nulls":5},0,null,null,0,0,0]
[{"$nulls":13},193,{"$nulls":5},0,null,null,0,0,0]
[{"$nulls":13},194,{"$nulls":5},{"$f":"IF(OR(R197=5,R197=10, R197=15, R197=\"BP\",R197=\"SCR\"),\"NT\",S197)","v":0},null,null,{"$f":"IF(OR(U197=5,U197=10, U197=15, U197=\"BP\",U197=\"SCR\"),\"NT\",V197)","v":0},{"$f":"(T197+W197)","v":0},{"$f":"(T197+W197)/2","v":0}]
[{"$nulls":13},195,{"$nulls":5},0,null,null,0,0,0]
[{"$nulls":13},196,{"$nulls":5},0,null,null,0,0,0]
[{"$nulls":13},197,{"$nulls":5},0,null,null,0,0,0]
[{"$nulls":13},198,{"$nulls":5},0,null,null,0,0,0]
[{"$nulls":13},199,{"$nulls":5},0,null,null,0,0,0]
[{"$nulls":13},200,{"$nulls":5},0,null,null,0,0,0]
[{"$nulls":13},201,{"$nulls":5},0,null,null,0,0,0]
[{"$nulls":13},202,{"$nulls":5},0,null,null,0,0,0]
[{"$nulls":13},203,{"$nulls":5},0,null,null,0,0,0]
[{"$nulls":13},204,{"$nulls":5},0,null,null,0,0,0]
[{"$nulls":13},205,{"$nulls":5},0,null,null,0,0,0]
[{"$nulls":13},206,{"$nulls":5},0,null,null,0,0,0]
[{"$nulls":13},207,{"$nulls":5},0,null,null,0,0,0]
[{"$nulls":13},208,{"$nulls":5},0,null,null,0,0,0]
[{"$nulls":13},209,{"$nulls":5},0,null,null,0,0,0]
[{"$nulls":13},210,{"$nulls":5},0,null,null,0,0,0]
[{"$nulls":13},211,{"$nulls":5},0,null,null,0,0,0]
[{"$nulls":13},212,{"$nulls":5},0,null,null,0,0,0]
[{"$nulls":13},213,{"$nulls":5},0,null,null,0,0,0]
[{"$nulls":13},214,{"$nulls":5},0,null,null,0,0,0]
[{"$nulls":13},215,{"$nulls":5},0,null,null,0,0,0]
[{"$nulls":13},216,{"$nulls":5},0,null,null,0,0,0]
[{"$nulls":13},217,{"$nulls":5},0,null,null,0,0,0]
[{"$nulls":13},218,{"$nulls":5},0,null,null,0,0,0]
[{"$nulls":13},219,{"$nulls":5},0,null,null,0,0,0]
[{"$nulls":13},220,{"$nulls":5},0,null,null,0,0,0]
[{"$nulls":13},221,{"$nulls":5},0,null,null,0,0,0]
[{"$nulls":13},222,{"$nulls":5},0,null,null,0,0,0]
[{"$nulls":13},223,{"$nulls":5},0,null,null,0,0,0]
[{"$nulls":13},224,{"$nulls":5},0,null,null,0,0,0]
[{"$nulls":13},225,{"$nulls":5},0,null,null,0,0,0]
[{"$nulls":13},226,{"$nulls":5},0,null,null,0,0,0]
[{"$nulls":13},227,{"$nulls":5},0,null,null,0,0,0]
[{"$nulls":13},228,{"$nulls":5},0,null,null,0,0,0]
[{"$nulls":13},229,{"$nulls":5},0,null,null,0,0,0]
[{"$nulls":13},230,{"$nulls":5},0,null,null,0,0,0]
[{"$nulls":13},231,{"$nulls":5},0,null,null,0,0,0]
[{"$nulls":13},232,{"$nulls":5},0,null,null,0,0,0]
[{"$nulls":13},233,{"$nulls":5},0,null,null,0,0,0]
[{"$nulls":13},234,{"$nulls":5},0,null,null,0,0,0]
[{"$nulls":13},235,{"$nulls":5},0,null,null,0,0,0]
[{"$nulls":13},236,{"$nulls":5},0,null,null,0,0,0]
[{"$nulls":13},237,{"$nulls":5},0,null,null,0,0,0]
[{"$nulls":13},238,{"$nulls":5},0,null,null,0,0,0]
[{"$nulls":13},239,{"$nulls":5},0,null,null,0,0,0]
[{"$nulls":13},240,{"$nulls":5},0,null,null,0,0,0]
[{"$nulls":13},241,{"$nulls":5},0,null,null,0,0,0]
[{"$nulls":13},242,{"$nulls":5},0,null,null,0,0,0]
[{"$nulls":13},243,{"$nulls":5},0,null,null,0,0,0]
[{"$nulls":13},244,{"$nulls":5},0,null,null,0,0,0]
[{"$nulls":13},245,{"$nulls":5},0,null,null,0,0,0]
[{"$nulls":13},246,{"$nulls":5},0,null,null,0,0,0]
[{"$nulls":13},247,{"$nulls":5},0,null,null,0,0,0]
[{"$nulls":13},248,{"$nulls":5},0,null,null,0,0,0]
[{"$nulls":13},249,{"$nulls":5},0,null,null,0,0,0]
[{"$nulls":13},250,{"$nulls":5},0,null,null,0,0,0]
[{"$nulls":13},251,{"$nulls":5},0,null,null,0,0,0]
[{"$nulls":13},252,{"$nulls":5},0,null,null,0,0,0]
[{"$nulls":13},253,{"$nulls":5},0,null,null,0,0,0]
[{"$nulls":13},254,{"$nulls":5},0,null,null,0,0,0]
[{"$nulls":13},255,{"$nulls":5},0,null,null,0,0,0]
[{"$nulls":13},256,{"$nulls":5},0,null,null,0,0,0]
[{"$nulls":13},257,{"$nulls":5},0,null,null,0,0,0]
[{"$nulls":13},258,{"$nulls":5},{"$f":"IF(OR(R261=5,R261=10, R261=15, R261=\"BP\",R261=\"SCR\"),\"NT\",S261)","v":0},null,null,{"$f":"IF(OR(U261=5,U261=10, U261=15, U261=\"BP\",U261=\"SCR\"),\"NT\",V261)","v":0},{"$f":"(T261+W261)","v":0},{"$f":"(T261+W261)/2","v":0}]
[{"$nulls":13},259,{"$nulls":5},0,null,null,0,0,0]
[{"$nulls":13},260,{"$nulls":5},0,null,null,0,0,0]
[{"$nulls":13},261,{"$nulls":5},0,null,null,0,0,0]
[{"$nulls":13},262,{"$nulls":5},0,null,null,0,0,0]
[{"$nulls":13},263,{"$nulls":5},0,null,null,0,0,0]
[{"$nulls":13},264,{"$nulls":5},0,null,null,0,0,0]
[{"$nulls":13},265,{"$nulls":5},0,null,null,0,0,0]
[{"$nulls":13},266,{"$nulls":5},0,null,null,0,0,0]
[{"$nulls":13},267,{"$nulls":5},0,null,null,0,0,0]
[{"$nulls":13},268,{"$nulls":5},0,null,null,0,0,0]
[{"$nulls":13},269,{"$nulls":5},0,null,null,0,0,0]
[{"$nulls":13},270,{"$nulls":5},0,null,null,0,0,0]
[{"$nulls":13},271,{"$nulls":5},0,null,null,0,0,0]
[{"$nulls":13},272,{"$nulls":5},0,null,null,0,0,0]
[{"$nulls":13},273,{"$nulls":5},0,null,null,0,0,0]
[{"$nulls":13},274,{"$nulls":5},0,null,null,0,0,0]
[{"$nulls":13},275,{"$nulls":5},0,null,null,0,0,0]
[{"$nulls":13},276,{"$nulls":5},0,null,null,0,0,0]
[{"$nulls":13},277,{"$nulls":5},0,null,null,0,0,0]
[{"$nulls":13},278,{"$nulls":5},0,null,null,0,0,0]
[{"$nulls":13},279,{"$nulls":5},0,null,null,0,0,0]
[{"$nulls":13},280,{"$nulls":5},0,null,null,0,0,0]
[{"$nulls":13},281,{"$nulls":5},0,null,null,0,0,0]
[{"$nulls":13},282,{"$nulls":5},0,null,null,0,0,0]
[{"$nulls":13},283,{"$nulls":5},0,null,null,0,0,0]
[{"$nulls":13},284,{"$nulls":5},0,null,null,0,0,0]
[{"$nulls":13},285,{"$nulls":5},0,null,null,0,0,0]
[{"$nulls":13},286,{"$nulls":5},0,null,null,0,0,0]
[{"$nulls":13},287,{"$nulls":5},0,null,null,0,0,0]
[{"$nulls":13},288,{"$nulls":5},0,null,null,0,0,0]
[{"$nulls":13},289,{"$nulls":5},0,null,null,0,0,0]
[{"$nulls":13},290,{"$nulls":5},0,null,null,0,0,0]
[{"$nulls":13},291,{"$nulls":5},0,null,null,0,0,0]
[{"$nulls":13},292,{"$nulls":5},0,null,null,0,0,0]
[{"$nulls":13},293,{"$nulls":5},0,null,null,0,0,0]
[{"$nulls":13},294,{"$nulls":5},0,null,null,0,0,0]
[{"$nulls":13},295,{"$nulls":5},0,null,null,0,0,0]
[{"$nulls":13},296,{"$nulls":5},0,null,null,0,0,0]
[{"$nulls":13},297,{"$nulls":5},0,null,null,0,0,0]
[{"$nulls":13},298,{"$nulls":5},0,null,null,0,0,0]
[{"$nulls":13},299,{"$nulls":5},0,null,null,0,0,0]
[{"$nulls":13},300,{"$nulls":5},0,null,null,0,0,0]
[{"$nulls":13},301,{"$nulls":5},0,null,null,0,0,0]
[{"$nulls":13},302,{"$nulls":5},0,null,null,0,0,0]
[{"$nulls":13},303,{"$nulls":5},0,null,null,0,0,0]
[{"$nulls":13},304,{"$nulls":5},0,null,null,0,0,0]
[{"$nulls":13},305,{"$nulls":5},0,null,null,0,0,0]
[{"$nulls":13},306,{"$nulls":5},0,null,null,0,0,0]
[{"$nulls":13},307,{"$nulls":5},0,null,null,0,0,0]
[{"$nulls":13},308,{"$nulls":5},0,null,null,0,0,0]
[{"$nulls":13},309,{"$nulls":5},0,null,null,0,0,0]
[{"$nulls":13},310,{"$nulls":5},0,null,null,0,0,0]
[{"$nulls":13},311,{"$nulls":5},0,null,null,0,0,0]
[{"$nulls":13},312,{"$nulls":5},0,null,null,0,0,0]
[{"$nulls":13},313,{"$nulls":5},0,null,null,0,0,0]
[{"$nulls":13},314,{"$nulls":5},0,null,null,0,0,0]
[{"$nulls":13},315,{"$nulls":5},0,null,null,0,0,0]
[{"$nulls":13},316,{"$nulls":5},0,null,null,0,0,0]
[{"$nulls":13},317,{"$nulls":5},0,null,null,0,0,0]
[{"$nulls":13},318,{"$nulls":5},0,null,null,0,0,0]
[{"$nulls":13},319,{"$nulls":5},0,null,null,0,0,0]
[{"$nulls":13},320,{"$nulls":5},0,null,null,0,0,0]
[{"$nulls":13},321,{"$nulls":5},0,null,null,0,0,0]
[{"$nulls":13},322,{"$nulls":5},{"$f":"IF(OR(R325=5,R325=10, R325=15, R325=\"BP\",R325=\"SCR\"),\"NT\",S325)","v":0},null,null,{"$f":"IF(OR(U325=5,U325=10, U325=15, U325=\"BP\",U325=\"SCR\"),\"NT\",V325)","v":0},{"$f":"(T325+W325)","v":0},{"$f":"(T325+W325)/2","v":0}]
[{"$nulls":13},323,{"$nulls":5},0,null,null,0,0,0]
[{"$nulls":13},324,{"$nulls":5},0,null,null,0,0,0]
[{"$nulls":13},325,{"$nulls":5},0,null,null,0,0,0]
[{"$nulls":13},326,{"$nulls":5},0,null,null,0,0,0]
[{"$nulls":13},327,{"$nulls":5},0,null,null,0,0,0]
[{"$nulls":13},328,{"$nulls":5},0,null,null,0,0,0]
[{"$nulls":13},329,{"$nulls":5},0,null,null,0,0,0]
[{"$nulls":13},330,{"$nulls":5},0,null,null,0,0,0]
[{"$nulls":13},331,{"$nulls":5},0,null,null,0,0,0]
[{"$nulls":13},332,{"$nulls":5},0,null,null,0,0,0]
[{"$nulls":13},333,{"$nulls":5},0,null,null,0,0,0]
[{"$nulls":13},334,{"$nulls":5},0,null,null,0,0,0]
[{"$nulls":13},335,{"$nulls":5},0,null,null,0,0,0]
[{"$nulls":13},336,{"$nulls":5},0,null,null,0,0,0]
[{"$nulls":13},337,{"$nulls":5},0,null,null,0,0,0]
[{"$nulls":13},338,{"$nulls":5},0,null,null,0,0,0]
[{"$nulls":13},339,{"$nulls":5},0,null,null,0,0,0]
[{"$nulls":13},340,{"$nulls":5},0,null,null,0,0,0]
[{"$nulls":13},341,{"$nulls":5},0,null,null,0,0,0]
[{"$nulls":13},342,{"$nulls":5},0,null,null,0,0,0]
[{"$nulls":13},343,{"$nulls":5},0,null,null,0,0,0]
[{"$nulls":13},344,{"$nulls":5},0,null,null,0,0,0]
[{"$nulls":13},345,{"$nulls":5},0,null,null,0,0,0]
[{"$nulls":13},346,{"$nulls":5},0,null,null,0,0,0]
[{"$nulls":13},347,{"$nulls":5},0,null,null,0,0,0]
[{"$nulls":13},348,{"$nulls":5},0,null,null,0,0,0]
[{"$nulls":13},349,{"$nulls":5},0,null,null,0,0,0]
[{"$nulls":13},350,{"$nulls":5},0,null,null,0,0,0]
[{"$nulls":13},351,{"$nulls":5},0,null,null,0,0,0]
[{"$nulls":13},352,{"$nulls":5},0,null,null,0,0,0]
[{"$nulls":13},353,{"$nulls":5},0,null,null,0,0,0]
[{"$nulls":13},354,{"$nulls":5},0,null,null,0,0,0]
[{"$nulls":13},355,{"$nulls":5},0,null,null,0,0,0]
[{"$nulls":13},356,{"$nulls":5},0,null,null,0,0,0]
[{"$nulls":13},357,{"$nulls":5},0,null,null,0,0,0]
[{"$nulls":13},358,{"$nulls":5},0,null,null,0,0,0]
[{"$nulls":13},359,{"$nulls":5},0,null,null,0,0,0]
[{"$nulls":13},360,{"$nulls":5},0,null,null,0,0,0]
[{"$nulls":13},361,{"$nulls":5},0,null,null,0,0,0]
[{"$nulls":13},362,{"$nulls":5},0,null,null,0,0,0]
[{"$nulls":13},363,{"$nulls":5},0,null,null,0,0,0]
[{"$nulls":13},364,{"$nulls":5},0,null,null,0,0,0]
[{"$nulls":13},365,{"$nulls":5},0,null,null,0,0,0]
[{"$nulls":13},366,{"$nulls":5},0,null,null,0,0,0]
[{"$nulls":13},367,{"$nulls":5},0,null,null,0,0,0]
[{"$nulls":13},368,{"$nulls":5},0,null,null,0,0,0]
[{"$nulls":13},369,{"$nulls":5},0,null,null,0,0,0]
[{"$nulls":13},370,{"$nulls":5},0,null,null,0,0,0]
[{"$nulls":13},371,{"$nulls":5},0,null,null,0,0,0]
[{"$nulls":13},372,{"$nulls":5},0,null,null,0,0,0]
[{"$nulls":13},373,{"$nulls":5},0,null,null,0,0,0]
[{"$nulls":13},374,{"$nulls":5},0,null,null,0,0,0]
[{"$nulls":13},375,{"$nulls":5},0,null,null,0,0,0]
[{"$nulls":13},376,{"$nulls":5},0,null,null,0,0,0]
[{"$nulls":13},377,{"$nulls":5},0,null,null,0,0,0]
[{"$nulls":13},378,{"$nulls":5},0,null,null,0,0,0]
[{"$nulls":13},379,{"$nulls":5},0,null,null,0,0,0]
[{"$nulls":13},380,{"$nulls":5},0,null,null,0,0,0]
[{"$nulls":13},381,{"$nulls":5},0,null,null,0,0,0]
[{"$nulls":13},382,{"$nulls":5},0,null,null,0,0,0]
[{"$nulls":13},383,{"$nulls":5},0,null,null,0,0,0]
[{"$nulls":13},384,{"$nulls":5},0,null,null,0,0,0]
[{"$nulls":13},385,{"$nulls":5},0,null,null,0,0,0]
[{"$nulls":13},386,{"$nulls":5},{"$f":"IF(OR(R389=5,R389=10, R389=15, R389=\"BP\",R389=\"SCR\"),\"NT\",S389)","v":0},null,null,{"$f":"IF(OR(U389=5,U389=10, U389=15, U389=\"BP\",U389=\"SCR\"),\"NT\",V389)","v":0},{"$f":"(T389+W389)","v":0},{"$f":"(T389+W389)/2","v":0}]
[{"$nulls":13},387,{"$nulls":5},0,null,null,0,0,0]
[{"$nulls":13},388,{"$nulls":5},0,null,null,0,0,0]
[{"$nulls":13},389,{"$nulls":5},0,null,null,0,0,0]
[{"$nulls":13},390,{"$nulls":5},0,null,null,0,0,0]
[{"$nulls":13},391,{"$nulls":5},0,null,null,0,0,0]
[{"$nulls":13},392,{"$nulls":5},0,null,null,0,0,0]
[{"$nulls":13},393,{"$nulls":5},0,null,null,0,0,0]
[{"$nulls":13},394,{"$nulls":5},0,null,null,0,0,0]
[{"$nulls":13},395,{"$nulls":5},0,null,null,0,0,0]
[{"$nulls":13},396,{"$nulls":5},0,null,null,0,0,0]
[{"$nulls":13},397,{"$nulls":5},0,null,null,0,0,0]
[{"$nulls":13},398,{"$nulls":5},0,null,null,0,0,0]
[{"$nulls":13},399,{"$nulls":5},0,null,null,0,0,0]
[{"$nulls":13},400,{"$nulls":5},0,null,null,0,0,0]
[{"$nulls":13},401,{"$nulls":5},0,null,null,0,0,0]
[{"$nulls":13},402,{"$nulls":5},0,null,null,0,0,0]
[{"$nulls":13},403,{"$nulls":5},0,null,null,0,0,0]
[{"$nulls":13},404,{"$nulls":5},0,null,null,0,0,0]
[{"$nulls":13},405,{"$nulls":5},0,null,null,0,0,0]
[{"$nulls":13},406,{"$nulls":5},0,null,null,0,0,0]
[{"$nulls":13},407,{"$nulls":5},0,null,null,0,0,0]
[{"$nulls":13},408,{"$nulls":5},0,null,null,0,0,0]
[{"$nulls":13},409,{"$nulls":5},0,null,null,0,0,0]
[{"$nulls":13},410,{"$nulls":5},0,null,null,0,0,0]
[{"$nulls":13},411,{"$nulls":5},0,null,null,0,0,0]
[{"$nulls":13},412,{"$nulls":5},0,null,null,0,0,0]
[{"$nulls":13},413,{"$nulls":5},0,null,null,0,0,0]
[{"$nulls":13},414,{"$nulls":5},0,null,null,0,0,0]
[{"$nulls":13},415,{"$nulls":5},0,null,null,0,0,0]
[{"$nulls":13},416,{"$nulls":5},0,null,null,0,0,0]
[{"$nulls":13},417,{"$nulls":5},0,null,null,0,0,0]
[{"$nulls":13},418,{"$nulls":5},0,null,null,0,0,0]
[{"$nulls":13},419,{"$nulls":5},0,null,null,0,0,0]
[{"$nulls":13},420,{"$nulls":5},0,null,null,0,0,0]
[{"$nulls":13},421,{"$nulls":5},0,null,null,0,0,0]
[{"$nulls":13},422,{"$nulls":5},0,null,null,0,0,0]
[{"$nulls":13},423,{"$nulls":5},0,null,null,0,0,0]
[{"$nulls":13},424,{"$nulls":5},0,null,null,0,0,0]
[{"$nulls":13},425,{"$nulls":5},0,null,null,0,0,0]
[{"$nulls":13},426,{"$nulls":5},0,null,null,0,0,0]
[{"$nulls":13},427,{"$nulls":5},0,null,null,0,0,0]
[{"$nulls":13},428,{"$nulls":5},0,null,null,0,0,0]
[{"$nulls":13},429,{"$nulls":5},0,null,null,0,0,0]
[{"$nulls":13},430,{"$nulls":5},0,null,null,0,0,0]
[{"$nulls":13},431,{"$nulls":5},0,null,null,0,0,0]
[{"$nulls":13},432,{"$nulls":5},0,null,null,0,0,0]
[{"$nulls":13},433,{"$nulls":5},0,null,null,0,0,0]
[{"$nulls":13},434,{"$nulls":5},0,null,null,0,0,0]
[{"$nulls":13},435,{"$nulls":5},0,null,null,0,0,0]
[{"$nulls":13},436,{"$nulls":5},0,null,null,0,0,0]
[{"$nulls":13},437,{"$nulls":5},0,null,null,0,0,0]
[{"$nulls":13},438,{"$nulls":5},0,null,null,0,0,0]
[{"$nulls":13},439,{"$nulls":5},0,null,null,0,0,0]
[{"$nulls":13},440,{"$nulls":5},0,null,null,0,0,0]
[{"$nulls":13},441,{"$nulls":5},0,null,null,0,0,0]
[{"$nulls":13},442,{"$nulls":5},0,null,null,0,0,0]
[{"$nulls":13},443,{"$nulls":5},0,null,null,0,0,0]
[{"$nulls":13},444,{"$nulls":5},0,null,null,0,0,0]
[{"$nulls":13},445,{"$nulls":5},0,null,null,0,0,0]
[{"$nulls":13},446,{"$nulls":5},0,null,null,0,0,0]
[{"$nulls":13},447,{"$nulls":5},0,null,null,0,0,0]
[{"$nulls":13},448,{"$nulls":5},0,null,null,0,0,0]
[{"$nulls":13},449,{"$nulls":5},0,null,null,0,0,0]
[{"$nulls":13},450,{"$nulls":5},{"$f":"IF(OR(R453=5,R453=10, R453=15, R453=\"BP\",R453=\"SCR\"),\"NT\",S453)","v":0},null,null,{"$f":"IF(OR(U453=5,U453=10, U453=15, U453=\"BP\",U453=\"SCR\"),\"NT\",V453)","v":0},{"$f":"(T453+W453)","v":0},{"$f":"(T453+W453)/2","v":0}]
[{"$nulls":13},451,{"$nulls":5},0,null,null,0,0,0]
[{"$nulls":13},452,{"$nulls":5},0,null,null,0,0,0]
[{"$nulls":13},453,{"$nulls":5},0,null,null,0,0,0]
[{"$nulls":13},454,{"$nulls":5},0,null,null,0,0,0]
[{"$nulls":13},455,{"$nulls":5},0,null,null,0,0,0]
[{"$nulls":13},456,{"$nulls":5},0,null,null,0,0,0]
[{"$nulls":13},457,{"$nulls":5},0,null,null,0,0,0]
[{"$nulls":13},458,{"$nulls":5},0,null,null,0,0,0]
[{"$nulls":13},459,{"$nulls":5},0,null,null,0,0,0]
[{"$nulls":13},460,{"$nulls":5},0,null,null,0,0,0]
[{"$nulls":13},461,{"$nulls":5},0,null,null,0,0,0]
[{"$nulls":13},462,{"$nulls":5},0,null,null,0,0,0]
[{"$nulls":13},463,{"$nulls":5},0,null,null,0,0,0]
[{"$nulls":13},464,{"$nulls":5},0,null,null,0,0,0]
[{"$nulls":13},465,{"$nulls":5},0,null,null,0,0,0]
[{"$nulls":13},466,{"$nulls":5},0,null,null,0,0,0]
[{"$nulls":13},467,{"$nulls":5},0,null,null,0,0,0]
[{"$nulls":13},468,{"$nulls":5},0,null,null,0,0,0]
[{"$nulls":13},469,{"$nulls":5},0,null,null,0,0,0]
[{"$nulls":13},470,{"$nulls":5},0,null,null,0,0,0]
[{"$nulls":13},471,{"$nulls":5},0,null,null,0,0,0]
[{"$nulls":13},472,{"$nulls":5},0,null,null,0,0,0]
[{"$nulls":13},473,{"$nulls":5},0,null,null,0,0,0]
[{"$nulls":13},474,{"$nulls":5},0,null,null,0,0,0]
[{"$nulls":13},475,{"$nulls":5},0,null,null,0,0,0]
[{"$nulls":13},476,{"$nulls":5},0,null,null,0,0,0]
[{"$nulls":13},477,{"$nulls":5},0,null,null,0,0,0]
[{"$nulls":13},478,{"$nulls":5},0,null,null,0,0,0]
[{"$nulls":13},479,{"$nulls":5},0,null,null,0,0,0]
[{"$nulls":13},480,{"$nulls":5},0,null,null,0,0,0]
[{"$nulls":13},481,{"$nulls":5},0,null,null,0,0,0]
[{"$nulls":13},482,{"$nulls":5},0,null,null,0,0,0]
[{"$nulls":13},483,{"$nulls":5},0,null,null,0,0,0]
[{"$nulls":13},484,{"$nulls":5},0,null,null,0,0,0]
[{"$nulls":13},485,{"$nulls":5},0,null,null,0,0,0]
[{"$nulls":13},486,{"$nulls":5},0,null,null,0,0,0]
[{"$nulls":13},487,{"$nulls":5},0,null,null,0,0,0]
[{"$nulls":13},488,{"$nulls":5},0,null,null,0,0,0]
[{"$nulls":13},489,{"$nulls":5},0,null,null,0,0,0]
[{"$nulls":13},490,{"$nulls":5},0,null,null,0,0,0]
[{"$nulls":13},491,{"$nulls":5},0,null,null,0,0,0]
[{"$nulls":13},492,{"$nulls":5},0,null,null,0,0,0]
[{"$nulls":13},493,{"$nulls":5},0,null,null,0,0,0]
[{"$nulls":13},494,{"$nulls":5},0,null,null,0,0,0]
[{"$nulls":13},495,{"$nulls":5},0,null,null,0,0,0]
[{"$nulls":13},496,{"$nulls":5},0,null,null,0,0,0]
[{"$nulls":13},497,{"$nulls":5},0,null,null,0,0,0]
[{"$nulls":13},498,{"$nulls":5},0,null,null,0,0,0]
[{"$nulls":13},499,{"$nulls":5},0,null,null,0,0,0]
[{"$nulls":13},500,{"$nulls":5},0,null,null,0,0,0]

{"sheet":"BFA 2D Payout","index":12,"n_rows":52,"n_cols":6,"rows_kept":52,"cut":false,"hidden":true,"merged":[[51,0,51,4],[20,0,20,4],[28,0,28,4],[29,0,29,4],[39,0,39,4],[40,0,40,4],[25,3,26,4],[35,3,37,4],[46,3,49,4],[19,0,19,4],[0,0,0,4],[3,0,3,4],[4,0,4,4],[11,0,11,4],[12,0,12,4],[7,3,9,4],[16,3,17,4]]}
["BFA 2D Payout"]
["Entry Fee","# Entries","% Payback","Added $","  Total Payout","Each Go"]
[25,19,0.8,200,{"$f":"(A3*$C$3)*B3+D3","v":580},0.3]
[{"$nulls":5},{"$f":"$E$3*$F$3","v":174}]
["$5,000-7,500 Pays 5 Places         4 to 1D 1 to 2D"]
["Placings","1D",null,"2D"]
["1st",{"$f":"($F$4*$C$7)","v":57.42},0.33,{"$f":"$F$4*$E$7","v":12.180000000000001},7.0000000000000007E-2]
["2nd",{"$f":"$F$4*$C$8","v":46.980000000000004},0.27]
["3rd",{"$f":"$F$4*$C$9","v":34.800000000000004},0.2]
["4th",{"$f":"$F$4*$C$10","v":22.62},0.13]
["Totals",{"$f":"SUM(B7:B10)","v":161.82000000000002},null,{"$f":"SUM(D7:D10)","v":12.180000000000001},{"$f":"(C7+C8+C9+C10+E7+E8)","v":1}]
[{"$f":"B11+D11","v":174.00000000000003}]
["$7,501 - 10,000 Pays 6 Places        4 to 1D,  2 to 2D"]
["Placings","1D",null,"2D"]
["1st",{"$f":"$F$4*$C$15","v":50.459999999999994},0.28999999999999998,{"$f":"$F$4*$E$15","v":15.66},0.09]
["2nd",{"$f":"+$F$4*$C$16","v":41.76},0.24,{"$f":"F4*E16","v":8.7000000000000011},0.05]
["3rd",{"$f":"$F$4*$C$17","v":33.06},0.19]
["4th",{"$f":"$F$4*$C$18","v":24.360000000000003},0.14000000000000001]
["Totals",{"$f":"SUM(B15:B18)","v":149.64000000000001},null,{"$f":"D16+D15","v":24.36},{"$f":"SUM(C15+C16+C17+C18+E15+E16)","v":1}]
[{"$f":"D19+B19","v":174}]
["   $10,001 - $15,000 Payes 8 Places        5 to 1D, 3 to 2D"]
["Placings","1D",null,"2D"]
["1st",{"$f":"F4*C23","v":41.76},0.24,{"$f":"F4*E23","v":12.180000000000001},7.0000000000000007E-2]
["2nd",{"$f":"F4*C24","v":34.800000000000004},0.2,{"$f":"F4*E24","v":8.7000000000000011},0.05]
["3rd",{"$f":"F4*C25","v":29.580000000000002},0.17,{"$f":"F4*E25","v":6.96},0.04]
["4th",{"$f":"F4*C26","v":22.62},0.13]
["5th",{"$f":"F4*C27","v":17.400000000000002},0.1]
["Totals",{"$f":"SUM(B23:B27)","v":146.16},null,{"$f":"SUM(D23:D27)","v":27.840000000000003},{"$f":"C23+C24+C25+C26+C27+E23+E24+E25","v":1}]
[{"$f":"B28+D28","v":174}]
["$15,001 - $25,000 Payes 11 Places        7 to 1D, 4 to 2D"]
["Placings","1D",null,"2D"]
["1st",{"$f":"$F$4*C32","v":36.54},0.21,{"$f":"$F$4*E32","v":8.7000000000000011},0.05]
["2nd",{"$f":"$F$4*C33","v":31.32},0.18,{"$f":"$F$4*E33","v":6.96},0.04]
["3rd",26.099999999999998,0.15,5.22,0.03]
["4th",19.14,0.11,3.48,0.02]
["5th",13.92,0.08]
["6th",12.180000000000001,7.0000000000000007E-2]
["7th",10.44,0.06]
["Totals",{"$f":"SUM(B32:B38)","v":149.63999999999999},null,{"$f":"SUM(D32:D38)","v":24.36},{"$f":"C32+C33+C34+C35+C36+C37+C38+E32+E33+E34+E35","v":1.0000000000000002}]
[{"$f":"SUM(B39+D39)","v":174}]
["$25,001 - $35,000 Payes 12 Places          8 to 1D, 4 to 2D"]
["Placings","1D",null,"2D"]
["1st",{"$f":"$F$4*C43","v":33.06},0.19,{"$f":"$F$4*E43","v":8.7000000000000011},0.05]
["2nd",{"$f":"$F$4*C44","v":26.099999999999998},0.15,{"$f":"$F$4*E44","v":6.96},0.04]
["3rd",20.88,0.12,5.22,0.03]
["4th",17.400000000000002,0.1,3.48,0.02]
["5th",15.66,0.09]
["6th",13.92,0.08]
["7th",12.180000000000001,7.0000000000000007E-2]
["8th",10.44,0.06]
["Totals",{"$f":"SUM(B43:B50)","v":149.63999999999999},null,{"$f":"SUM(D43:D46)","v":24.36},{"$f":"C43+C44+C45+C46+C47+C48+C49+C50+E43+E44+E45+E46","v":1}]
[{"$f":"D51+B51","v":174}]

{"sheet":"2D Payout","index":13,"n_rows":76,"n_cols":5,"rows_kept":76,"cut":false,"hidden":false,"merged":[[35,0,35,4],[34,0,34,4],[28,3,28,4],[19,0,19,4],[26,0,26,4],[21,3,21,4],[13,0,13,4],[14,0,14,4],[20,0,20,4],[15,3,15,4],[27,0,27,4],[0,0,0,4],[8,0,8,4],[9,0,9,4],[3,0,3,4],[10,3,10,4],[5,3,6,3],[5,4,7,4],[36,3,36,4],[76,0,76,4],[43,0,43,4],[53,0,53,4],[65,0,65,4],[44,0,44,4],[54,0,54,4],[64,0,64,4],[45,3,45,4],[55,3,55,4],[66,3,66,4]]}
["2D Payout"]
["Entry Fee","# Entries","% Payback","Added $","  Total Payout"]
[100,8,0.8,null,{"$f":"(A3*$C$3)*B3+D3","v":640}]
[]
["% in each D",0.6,0.4,"Total % =",{"$f":"SUM(B5:C5)","v":1}]
[null,"1D","2D"]
[null,{"$f":"(($A$3*$B$3*$C$3*$B$5)+($D$3*$B$5))","v":384},{"$f":"(($A$3*$B$3*$C$3*$C$5)+($D$3*$C$5))","v":256}]
["Totals",{"$f":"SUM(B7)","v":384},{"$f":"SUM(C7)","v":256},{"$f":"SUM(B8:C8)","v":640}]
[]
["For 1-7 riders 1 place"]
["Placings","1D","2D"]
["1st",{"$f":"$B$7*$E$12","v":384},{"$f":"$C$7*$E$5","v":256},"è",1]
["Totals",{"$f":"SUM(B12:B12)","v":384},{"$f":"SUM(C12:C12)","v":256},{"$f":"SUM(B13:C13)","v":640},{"$f":"SUM(E12)","v":1}]
[]
["For 8-11 riders 2 places"]
["Placings","1D","2D"]
["1st",{"$f":"$B$7*$E$17","v":230.39999999999998},{"$f":"$C$7*$E$17","v":153.6},"è",0.6]
["2nd",{"$f":"$B$7*$E$18","v":153.60000000000002},{"$f":"$C$7*$E$18","v":102.4},"è",0.4]
["Totals",{"$f":"SUM(B17:B18)","v":384},{"$f":"SUM(C17:C18)","v":256},{"$f":"SUM(B19:C19)","v":640},{"$f":"SUM(E17:E18)","v":1}]
[]
["For 12-15 riders 3 places"]
["Placings","1D","2D"]
["1st",{"$f":"$B$7*$E$23","v":192},{"$f":"$C$7*$E$23","v":128},"è",0.5]
["2nd",{"$f":"$B$7*$E$24","v":115.19999999999999},{"$f":"$C$7*$E$24","v":76.8},"è",0.3]
["3rd",{"$f":"$B$7*$E$25","v":76.800000000000011},{"$f":"$C$7*$E$25","v":51.2},"è",0.2]
["Totals",{"$f":"SUM(B23:B25)","v":384},{"$f":"SUM(C23:C25)","v":256},{"$f":"SUM(B26:C26)","v":640},{"$f":"SUM(E23:E25)","v":1}]
[]
["For 16-19 riders 4 places"]
["Placings","1D","2D"]
["1st",{"$f":"$B$7*$E$30","v":153.60000000000002},{"$f":"$C$7*$E$30","v":102.4},"è",0.4]
["2nd",{"$f":"$B$7*$E$31","v":115.19999999999999},{"$f":"$C$7*$E$31","v":76.8},"è",0.3]
["3rd",{"$f":"$B$7*$E$32","v":76.800000000000011},{"$f":"$C$7*$E$32","v":51.2},"è",0.2]
["4th",{"$f":"$B$7*$E$33","v":38.400000000000006},{"$f":"$C$7*$E$33","v":25.6},"è",0.1]
["Totals",{"$f":"SUM(B30:B33)","v":384},{"$f":"SUM(C30:C33)","v":255.99999999999997},{"$f":"SUM(B34:C34)","v":640},{"$f":"SUM(E30:E33)","v":0.99999999999999989}]
[]
["For 20-23 riders 5 places"]
["Placings","1D","2D"]
["1st",{"$f":"$B$7*$E$38","v":115.19999999999999},{"$f":"$C$7*$E$38","v":76.8},"è",0.3]
["2nd",{"$f":"$B$7*$E$39","v":96},{"$f":"$C$7*$E$39","v":64},"è",0.25]
["3rd",{"$f":"$B$7*$E$40","v":76.800000000000011},{"$f":"$C$7*$E$40","v":51.2},"è",0.2]
["4th",{"$f":"$B$7*$E$41","v":57.599999999999994},{"$f":"$C$7*$E$41","v":38.4},"è",0.15]
["5th",{"$f":"$B$7*$E$42","v":38.400000000000006},{"$f":"$C$7*$E$42","v":25.6},"è",0.1]
["Totals",{"$f":"SUM(B38:B42)","v":384},{"$f":"SUM(C38:C42)","v":256},{"$f":"SUM(B43:C43)","v":640},{"$f":"SUM(E38:E42)","v":1}]
[]
["For 24-27 riders 6 places"]
["Placings","1D","2D"]
["1st",{"$f":"$B$7*$E$47","v":96},{"$f":"$C$7*$E$47","v":64},"è",0.25]
["2nd",{"$f":"$B$7*$E$48","v":76.800000000000011},{"$f":"$C$7*$E$48","v":51.2},"è",0.2]
["3rd",{"$f":"$B$7*$E$49","v":69.12},{"$f":"$C$7*$E$49","v":46.08},"è",0.18]
["4th",{"$f":"$B$7*$E$50","v":57.599999999999994},{"$f":"$C$7*$E$50","v":38.4},"è",0.15]
["5th",{"$f":"$B$7*$E$51","v":46.08},{"$f":"$C$7*$E$51","v":30.72},"è",0.12]
["6th",{"$f":"$B$7*$E$52","v":38.400000000000006},{"$f":"$C$7*$E$52","v":25.6},"è",0.1]
["Totals",{"$f":"SUM(B47:B52)","v":384},{"$f":"SUM(C47:C52)","v":256},{"$f":"SUM(B53:C53)","v":640},{"$f":"SUM(E47:E52)","v":1}]
[]
["For 28-31 riders 7 places"]
["Placings","1D","2D"]
["1st",{"$f":"$B$7*$E$57","v":84.48},{"$f":"$C$7*$E$57","v":56.32},"è",0.22]
["2nd",{"$f":"$B$7*$E$58","v":69.12},{"$f":"$C$7*$E$58","v":46.08},"è",0.18]
["3rd",{"$f":"$B$7*$E$59","v":61.44},{"$f":"$C$7*$E$59","v":40.96},"è",0.16]
["4th",{"$f":"$B$7*$E$60","v":53.760000000000005},{"$f":"$C$7*$E$60","v":35.840000000000003},"è",0.14000000000000001]
["5th",{"$f":"$B$7*$E$61","v":46.08},{"$f":"$C$7*$E$61","v":30.72},"è",0.12]
["6th",{"$f":"$B$7*$E$62","v":38.400000000000006},{"$f":"$C$7*$E$62","v":25.6},"è",0.1]
["7th",{"$f":"$B$7*$E$63","v":30.72},{"$f":"$C$7*$E$63","v":20.48},"è",0.08]
["Totals",{"$f":"SUM(B57:B63)","v":384},{"$f":"SUM(C57:C63)","v":256},{"$f":"SUM(B64:C64)","v":640},{"$f":"SUM(E57:E63)","v":1}]
[]
["For 32 or more riders 8 places"]
["Placings","1D","2D"]
["1st",{"$f":"$B$7*$E$68","v":88.320000000000007},{"$f":"$C$7*$E$68","v":58.88},"è",0.23]
["2nd",{"$f":"$B$7*$E$69","v":76.800000000000011},{"$f":"$C$7*$E$69","v":51.2},"è",0.2]
["3rd",{"$f":"$B$7*$E$70","v":65.28},{"$f":"$C$7*$E$70","v":43.52},"è",0.17]
["4th",{"$f":"$B$7*$E$71","v":53.760000000000005},{"$f":"$C$7*$E$71","v":35.840000000000003},"è",0.14000000000000001]
["5th",{"$f":"$B$7*$E$72","v":42.24},{"$f":"$C$7*$E$72","v":28.16},"è",0.11]
["6th",{"$f":"$B$7*$E$73","v":30.72},{"$f":"$C$7*$E$73","v":20.48},"è",0.08]
["7th",{"$f":"$B$7*$E$74","v":19.200000000000003},{"$f":"$C$7*$E$74","v":12.8},"è",0.05]
["8th",{"$f":"$B$7*$E$75","v":7.68},{"$f":"$C$7*$E$75","v":5.12},"è",0.02]
["Totals",{"$f":"SUM(B68:B75)","v":384},{"$f":"SUM(C68:C75)","v":256},{"$f":"SUM(B76:C76)","v":640},{"$f":"SUM(E68:E75)","v":1}]

{"sheet":"3D Payout","index":14,"n_rows":76,"n_cols":6,"rows_kept":76,"cut":false,"hidden":true,"merged":[[20,0,20,5],[26,0,26,5],[65,0,65,5],[44,0,44,5],[54,0,54,5],[27,0,27,5],[35,0,35,5],[21,4,21,5],[55,4,55,5],[45,4,45,5],[36,4,36,5],[28,4,28,5],[34,0,34,5],[0,0,0,5],[3,0,3,5],[8,0,8,5],[9,0,9,5],[5,5,7,5],[5,4,6,4],[13,0,13,5],[19,0,19,5],[14,0,14,5],[15,4,15,5],[10,4,10,5],[76,0,76,5],[43,0,43,5],[53,0,53,5],[64,0,64,5],[66,4,66,5]]}
["3D Payout"]
["Entry Fee","# Entries","% Payback","$ From Entry","Added $","  Total Payout"]
[10,3,0.8,{"$f":"$A$3*$C$3*$B$3","v":24},null,{"$f":"$D$3+$E$3","v":24}]
[]
["% in each D",0.5,0.3,0.2,"Total % =",{"$f":"SUM(B5:D5)","v":1}]
[null,"1D","2D","3D"]
[null,{"$f":"(($A$3*$B$3*$C$3*$B$5)+($E$3*$B$5))","v":12},{"$f":"(($A$3*$B$3*$C$3*$C$5)+($E$3*$C$5))","v":7.1999999999999993},{"$f":"(($A$3*$B$3*$C$3*$D$5)+($E$3*$D$5))","v":4.8000000000000007}]
["Totals",{"$f":"SUM(B7)","v":12},{"$f":"SUM(C7)","v":7.1999999999999993},4.8000000000000007,{"$f":"SUM(B8:D8)","v":24}]
[]
["For 1-10 riders 1 place"]
["Placings","1D","2D","3D"]
["1st",{"$f":"$B$7*$F$12","v":12},{"$f":"$C$7*$F$12","v":7.1999999999999993},{"$f":"$D$7*$F$12","v":4.8000000000000007},"è",1]
["Totals",{"$f":"SUM(B12:B12)","v":12},{"$f":"SUM(C12:C12)","v":7.1999999999999993},{"$f":"SUM(D12:D12)","v":4.8000000000000007},{"$f":"SUM(B13:D13)","v":24},{"$f":"SUM(F12)","v":1}]
[]
["For 11-15 riders 2 places"]
["Placings","1D","2D","3D"]
["1st",{"$f":"$B$7*$F$17","v":7.1999999999999993},{"$f":"$C$7*$F$17","v":4.3199999999999994},{"$f":"$D$7*$F$17","v":2.8800000000000003},"è",0.6]
["2nd",{"$f":"$B$7*$F$18","v":4.8000000000000007},{"$f":"$C$7*$F$18","v":2.88},{"$f":"$D$7*$F$18","v":1.9200000000000004},"è",0.4]
["Totals",{"$f":"SUM(B17:B18)","v":12},{"$f":"SUM(C17:C18)","v":7.1999999999999993},{"$f":"SUM(D17:D18)","v":4.8000000000000007},{"$f":"SUM(B19:D19)","v":24},{"$f":"SUM(F17:F18)","v":1}]
[]
["For 16-30 riders 3 places"]
["Placings","1D","2D","3D"]
["1st",{"$f":"$B$7*$F$23","v":6},{"$f":"$C$7*$F$23","v":3.5999999999999996},{"$f":"$D$7*$F$23","v":2.4000000000000004},"è",0.5]
["2nd",{"$f":"$B$7*$F$24","v":3.5999999999999996},{"$f":"$C$7*$F$24","v":2.1599999999999997},{"$f":"$D$7*$F$24","v":1.4400000000000002},"è",0.3]
["3rd",{"$f":"$B$7*$F$25","v":2.4000000000000004},{"$f":"$C$7*$F$25","v":1.44},{"$f":"$D$7*$F$25","v":0.96000000000000019},"è",0.2]
["Totals",{"$f":"SUM(B23:B25)","v":12},{"$f":"SUM(C23:C25)","v":7.1999999999999993},{"$f":"SUM(D22:D25)","v":4.8000000000000007},{"$f":"SUM(B26:D26)","v":24},{"$f":"SUM(F23:F25)","v":1}]
[]
["For 31-60 riders 4 places"]
["Placings","1D","2D","3D"]
["1st",{"$f":"$B$7*$F$30","v":5.04},{"$f":"$C$7*$F$30","v":3.0239999999999996},{"$f":"$D$7*$F$30","v":2.016},"è",0.42]
["2nd",{"$f":"$B$7*$F$31","v":3.4799999999999995},{"$f":"$C$7*$F$31","v":2.0879999999999996},{"$f":"$D$7*$F$31","v":1.3920000000000001},"è",0.28999999999999998]
["3rd",{"$f":"$B$7*$F$32","v":2.2800000000000002},{"$f":"$C$7*$F$32","v":1.3679999999999999},{"$f":"$D$7*$F$32","v":0.91200000000000014},"è",0.19]
["4th",{"$f":"$B$7*$F$33","v":1.2000000000000002},{"$f":"$C$7*$F$33","v":0.72},{"$f":"$D$7*$F$33","v":0.48000000000000009},"è",0.1]
["Totals",{"$f":"SUM(B30:B33)","v":12},{"$f":"SUM(C30:C33)","v":7.1999999999999984},{"$f":"SUM(D30:D33)","v":4.8000000000000007},{"$f":"SUM(B34:D34)","v":24},{"$f":"SUM(F30:F33)","v":0.99999999999999989}]
[]
["For 61-90 riders 5 places"]
["Placings","1D","2D","3D"]
["1st",{"$f":"$B$7*$F$38","v":4.5600000000000005},{"$f":"$C$7*$F$38","v":2.7359999999999998},{"$f":"$D$7*$F$38","v":1.8240000000000003},"è",0.38]
["2nd",{"$f":"$B$7*$F$39","v":3.3600000000000003},{"$f":"$C$7*$F$39","v":2.016},{"$f":"$D$7*$F$39","v":1.3440000000000003},"è",0.28000000000000003]
["3rd",{"$f":"$B$7*$F$40","v":2.16},{"$f":"$C$7*$F$40","v":1.2959999999999998},{"$f":"$D$7*$F$40","v":0.8640000000000001},"è",0.18]
["4th",{"$f":"$B$7*$F$41","v":1.2000000000000002},{"$f":"$C$7*$F$41","v":0.72},{"$f":"$D$7*$F$41","v":0.48000000000000009},"è",0.1]
["5th",{"$f":"$B$7*$F$42","v":0.72},{"$f":"$C$7*$F$42","v":0.43199999999999994},{"$f":"$D$7*$F$42","v":0.28800000000000003},"è",0.06]
["Totals",{"$f":"SUM(B38:B42)","v":12.000000000000002},{"$f":"SUM(C38:C42)","v":7.1999999999999993},{"$f":"SUM(D38:D42)","v":4.8000000000000016},{"$f":"SUM(B43:D43)","v":24.000000000000004},{"$f":"SUM(F38:F42)","v":1}]
[]
["For 91-120 riders 6 places"]
["Placings","1D","2D","3D"]
["1st",{"$f":"$B$7*$F$47","v":4.32},{"$f":"$C$7*$F$47","v":2.5919999999999996},{"$f":"$D$7*$F$47","v":1.7280000000000002},"è",0.36]
["2nd",{"$f":"$B$7*$F$48","v":3.12},{"$f":"$C$7*$F$48","v":1.8719999999999999},{"$f":"$D$7*$F$48","v":1.2480000000000002},"è",0.26]
["3rd",{"$f":"$B$7*$F$49","v":1.92},{"$f":"$C$7*$F$49","v":1.1519999999999999},{"$f":"$D$7*$F$49","v":0.76800000000000013},"è",0.16]
["4th",{"$f":"$B$7*$F$50","v":1.2000000000000002},{"$f":"$C$7*$F$50","v":0.72},{"$f":"$D$7*$F$50","v":0.48000000000000009},"è",0.1]
["5th",{"$f":"$B$7*$F$51","v":0.84000000000000008},{"$f":"$C$7*$F$51","v":0.504},{"$f":"$D$7*$F$51","v":0.33600000000000008},"è",7.0000000000000007E-2]
["6th",{"$f":"$B$7*$F$52","v":0.60000000000000009},{"$f":"$C$7*$F$52","v":0.36},{"$f":"$D$7*$F$52","v":0.24000000000000005},"è",0.05]
["Totals",{"$f":"SUM(B47:B52)","v":11.999999999999998},{"$f":"SUM(C47:C52)","v":7.2},{"$f":"SUM(D47:D52)","v":4.8000000000000016},{"$f":"SUM(B53:D53)","v":24},{"$f":"SUM(F47:F52)","v":1}]
[]
["For 121-200 riders 7 places"]
["Placings","1D","2D","3D"]
["1st",{"$f":"$B$7*$F$57","v":3.12},{"$f":"$C$7*$F$57","v":1.8719999999999999},{"$f":"$D$7*$F$57","v":1.2480000000000002},"è",0.26]
["2nd",{"$f":"$B$7*$F$58","v":2.4000000000000004},{"$f":"$C$7*$F$58","v":1.44},{"$f":"$D$7*$F$58","v":0.96000000000000019},"è",0.2]
["3rd",{"$f":"$B$7*$F$59","v":1.7999999999999998},{"$f":"$C$7*$F$59","v":1.0799999999999998},{"$f":"$D$7*$F$59","v":0.72000000000000008},"è",0.15]
["4th",{"$f":"$B$7*$F$60","v":1.44},{"$f":"$C$7*$F$60","v":0.86399999999999988},{"$f":"$D$7*$F$60","v":0.57600000000000007},"è",0.12]
["5th",{"$f":"$B$7*$F$61","v":1.2000000000000002},{"$f":"$C$7*$F$61","v":0.72},{"$f":"$D$7*$F$61","v":0.48000000000000009},"è",0.1]
["6th",{"$f":"$B$7*$F$62","v":1.08},{"$f":"$C$7*$F$62","v":0.64799999999999991},{"$f":"$D$7*$F$62","v":0.43200000000000005},"è",0.09]
["7th",{"$f":"$B$7*$F$63","v":0.96},{"$f":"$C$7*$F$63","v":0.57599999999999996},{"$f":"$D$7*$F$63","v":0.38400000000000006},"è",0.08]
["Totals",{"$f":"SUM(B57:B63)","v":12},{"$f":"SUM(C57:C63)","v":7.1999999999999984},{"$f":"SUM(D57:D63)","v":4.8000000000000007},{"$f":"SUM(B64:D64)","v":24},{"$f":"SUM(F57:F63)","v":0.99999999999999989}]
[]
["For 201 or more riders 8 places"]
["Placings","1D","2D","3D"]
["1st",{"$f":"$B$7*0.24","v":2.88},{"$f":"$C$7*0.24","v":1.7279999999999998},{"$f":"$D$7*0.24","v":1.1520000000000001},"è",0.24]
["2nd",{"$f":"$B$7*0.18","v":2.16},{"$f":"$C$7*0.18","v":1.2959999999999998},{"$f":"$D$7*0.18","v":0.8640000000000001},"è",0.18]
["3rd",{"$f":"$B$7*0.15","v":1.7999999999999998},{"$f":"$C$7*0.15","v":1.0799999999999998},{"$f":"$D$7*0.15","v":0.72000000000000008},"è",0.15]
["4th",{"$f":"$B$7*0.12","v":1.44},{"$f":"$C$7*0.12","v":0.86399999999999988},{"$f":"$D$7*0.12","v":0.57600000000000007},"è",0.12]
["5th",{"$f":"$B$7*0.1","v":1.2000000000000002},{"$f":"$C$7*0.1","v":0.72},{"$f":"$D$7*0.1","v":0.48000000000000009},"è",0.1]
["6th",{"$f":"$B$7*0.08","v":0.96},{"$f":"$C$7*0.08","v":0.57599999999999996},{"$f":"$D$7*0.08","v":0.38400000000000006},"è",0.08]
["7th",{"$f":"$B$7*0.07","v":0.84000000000000008},{"$f":"$C$7*0.07","v":0.504},{"$f":"$D$7*0.07","v":0.33600000000000008},"è",7.0000000000000007E-2]
["8th",{"$f":"$B$7*0.06","v":0.72},{"$f":"$C$7*0.06","v":0.43199999999999994},{"$f":"$D$7*0.06","v":0.28800000000000003},"è",0.06]
["Totals",{"$f":"SUM(B68:B75)","v":12.000000000000002},{"$f":"SUM(C68:C75)","v":7.1999999999999993},{"$f":"SUM(D68:D75)","v":4.8000000000000007},{"$f":"SUM(B76:D76)","v":24.000000000000004},{"$f":"SUM(F68:F75)","v":1}]

{"sheet":"4D Payout BBR","index":15,"n_rows":172,"n_cols":7,"rows_kept":172,"cut":false,"hidden":true,"merged":[[139,0,139,6],[140,5,140,6],[79,0,79,6],[80,0,80,6],[81,5,81,6],[96,0,96,6],[97,5,97,6],[95,0,95,6],[114,0,114,6],[115,0,115,6],[55,5,55,6],[65,0,65,6],[66,0,66,6],[116,5,116,6],[138,0,138,6],[0,0,0,6],[3,0,3,6],[5,5,6,5],[5,6,7,6],[8,0,8,6],[9,0,9,6],[10,5,10,6],[13,0,13,6],[14,0,14,6],[20,0,20,6],[172,0,172,5],[21,5,21,6],[15,5,15,6],[27,0,27,6],[45,5,45,6],[54,0,54,6],[28,5,28,6],[35,0,35,6],[36,5,36,6],[44,0,44,6],[19,0,19,6],[67,5,67,6],[53,0,53,6],[43,0,43,6],[34,0,34,6],[26,0,26,6]]}
["4D Payout BBR"]
["Entry Fee","# Entries","% Payback","$ From Entry","Added $","Total Payout"]
[40,200,0.8,{"$f":"$A$3*$C$3*$B$3","v":6400},1100,{"$f":"($A$3*$C$3)*$B$3+$E$3","v":7500}]
[]
["% in each D",0.35,0.3,0.2,0.15,"Total % Payout",{"$f":"SUM(B5:E5)","v":0.99999999999999989}]
[null,"1D","2D","3D","4D"]
[null,{"$f":"(($A$3*$B$3*$C$3*0.35)+($E$3/4))","v":2515},{"$f":"(($A$3*$B$3*$C$3*0.3)+($E$3/4))","v":2195},{"$f":"(($A$3*$B$3*$C$3*0.2)+($E$3/4))","v":1555},{"$f":"(($A$3*$B$3*$C$3*0.15)+($E$3/4))","v":1235}]
["Totals",{"$f":"SUM(B7)","v":2515},{"$f":"SUM(C7)","v":2195},1555,1235,{"$f":"SUM(B8:E8)","v":7500}]
[]
["For 1-16 riders 1 place"]
["Placings","1D","2D","3D","4D"]
["1st",{"$f":"$B$7*$G$12","v":2515},{"$f":"$C$7*$G$12","v":2195},{"$f":"$D$7*$G$12","v":1555},{"$f":"$E$7*$G$12","v":1235},"è",1]
["Totals",{"$f":"SUM(B12:B12)","v":2515},{"$f":"SUM(C12:C12)","v":2195},{"$f":"SUM(D12:D12)","v":1555},{"$f":"SUM(E12:E12)","v":1235},{"$f":"SUM(B13:E13)","v":7500},{"$f":"SUM(G12)","v":1}]
[]
["For 17-33 riders 2 places"]
["Placings","1D","2D","3D","4D"]
["1st",{"$f":"$B$7*$G$17","v":1509},{"$f":"$C$7*$G$17","v":1317},{"$f":"$D$7*$G$17","v":933},{"$f":"$E$7*$G$17","v":741},"è",0.6]
["2nd",{"$f":"$B$7*$G$18","v":1006},{"$f":"$C$7*$G$18","v":878},{"$f":"$D$7*$G$18","v":622},{"$f":"$E$7*$G$18","v":494},"è",0.4]
["Totals",{"$f":"SUM(B17:B18)","v":2515},{"$f":"SUM(C17:C18)","v":2195},{"$f":"SUM(D17:D18)","v":1555},{"$f":"SUM(E17:E18)","v":1235},{"$f":"SUM(B19:E19)","v":7500},{"$f":"SUM(G17:G18)","v":1}]
[]
["For 34-66 riders 3 places"]
["Placings","1D","2D","3D","4D"]
["1st",{"$f":"$B$7*$G$23","v":1257.5},{"$f":"$C$7*$G$23","v":1097.5},{"$f":"$D$7*$G$23","v":777.5},{"$f":"$E$7*$G$23","v":617.5},"è",0.5]
["2nd",{"$f":"$B$7*$G$24","v":754.5},{"$f":"$C$7*$G$24","v":658.5},{"$f":"$D$7*$G$24","v":466.5},{"$f":"$E$7*$G$24","v":370.5},"è",0.3]
["3rd",{"$f":"$B$7*$G$25","v":503},{"$f":"$C$7*$G$25","v":439},{"$f":"$D$7*$G$25","v":311},{"$f":"$E$7*$G$25","v":247},"è",0.2]
["Totals",{"$f":"SUM(B23:B25)","v":2515},{"$f":"SUM(C23:C25)","v":2195},{"$f":"SUM(D23:D25)","v":1555},{"$f":"SUM(E23:E25)","v":1235},{"$f":"SUM(B26:E26)","v":7500},{"$f":"SUM(G23:G25)","v":1}]
[]
["For 97-95 riders 4 places"]
["Placings","1D","2D","3D","4D"]
["1st",{"$f":"$B$7*$G$30","v":1006},{"$f":"$C$7*$G$30","v":878},{"$f":"$D$7*$G$30","v":622},{"$f":"$E$7*$G$30","v":494},"è",0.4]
["2nd",{"$f":"$B$7*$G$31","v":754.5},{"$f":"$C$7*$G$31","v":658.5},{"$f":"$D$7*$G$31","v":466.5},{"$f":"$E$7*$G$31","v":370.5},"è",0.3]
["3rd",{"$f":"$B$7*$G$32","v":503},{"$f":"$C$7*$G$32","v":439},{"$f":"$D$7*$G$32","v":311},{"$f":"$E$7*$G$32","v":247},"è",0.2]
["4th",{"$f":"$B$7*$G$33","v":251.5},{"$f":"$C$7*$G$33","v":219.5},{"$f":"$D$7*$G$33","v":155.5},{"$f":"$E$7*$G$33","v":123.5},"è",0.1]
["Totals",{"$f":"SUM(B30:B33)","v":2515},{"$f":"SUM(C30:C33)","v":2195},{"$f":"SUM(D30:D33)","v":1555},{"$f":"SUM(E30:E33)","v":1235},{"$f":"SUM(B34:E34)","v":7500},{"$f":"SUM(G30:G33)","v":0.99999999999999989}]
[]
["For 96-133 riders 5 places"]
["Placings","1D","2D","3D","4D"]
["1st",{"$f":"$B$7*$G$38","v":829.95},{"$f":"$C$7*$G$38","v":724.35},{"$f":"$D$7*G38","v":513.15},{"$f":"$E$7*$G$38","v":407.55},"è",0.33]
["2nd",{"$f":"$B$7*$G$39","v":679.05000000000007},{"$f":"$C$7*$G$39","v":592.65000000000009},{"$f":"$D$7*$G$39","v":419.85},{"$f":"$E$7*$G$39","v":333.45000000000005},"è",0.27]
["3rd",{"$f":"$B$7*$G$40","v":503},{"$f":"$C$7*$G$40","v":439},{"$f":"$D$7*$G$40","v":311},{"$f":"$E$7*$G$40","v":247},"è",0.2]
["4th",{"$f":"$B$7*$G$41","v":326.95},{"$f":"$C$7*$G$41","v":285.35000000000002},{"$f":"$D$7*$G$41","v":202.15},{"$f":"$E$7*$G$41","v":160.55000000000001},"è",0.13]
["5th",{"$f":"$B$7*$G$42","v":176.05},{"$f":"$C$7*$G$42","v":153.65},{"$f":"$D$7*$G$42","v":108.85000000000001},{"$f":"$E$7*$G$42","v":86.45},"è",7.0000000000000007E-2]
["Totals",{"$f":"SUM(B38:B42)","v":2515},{"$f":"SUM(C38:C42)","v":2195},{"$f":"SUM(D38:D42)","v":1555},{"$f":"SUM(E38:E42)","v":1235},{"$f":"SUM(B43:E43)","v":7500},{"$f":"SUM(G38:G42)","v":1}]
[]
["For 134-166 riders 6 places"]
["Placings","1D","2D","3D","4D"]
["1st",{"$f":"$B$7*$G$47","v":729.34999999999991},{"$f":"$C$7*$G$47","v":636.54999999999995},{"$f":"$D$7*$G$47","v":450.95},{"$f":"$E$7*$G$47","v":358.15},"è",0.28999999999999998]
["2nd",{"$f":"$B$7*$G$48","v":603.6},{"$f":"$C$7*$G$48","v":526.79999999999995},{"$f":"$D$7*$G$48","v":373.2},{"$f":"$E$7*$G$48","v":296.39999999999998},"è",0.24]
["3rd",{"$f":"$B$7*$G$49","v":477.85},{"$f":"$C$7*$G$49","v":417.05},{"$f":"$D$7*$G$49","v":295.45},{"$f":"$E$7*$G$49","v":234.65},"è",0.19]
["4th",{"$f":"$B$7*$G$50","v":352.1},{"$f":"$C$7*$G$50","v":307.3},{"$f":"$D$7*$G$50","v":217.70000000000002},{"$f":"$E$7*$G$50","v":172.9},"è",0.14000000000000001]
["5th",{"$f":"$B$7*$G$51","v":226.35},{"$f":"$C$7*$G$51","v":197.54999999999998},{"$f":"$D$7*$G$51","v":139.94999999999999},{"$f":"$E$7*$G$51","v":111.14999999999999},"è",0.09]
["6th",{"$f":"$B$7*$G$52","v":125.75},{"$f":"$C$7*$G$52","v":109.75},{"$f":"$D$7*$G$52","v":77.75},{"$f":"$E$7*$G$52","v":61.75},"è",0.05]
["Totals",{"$f":"SUM(B47:B52)","v":2514.9999999999995},{"$f":"SUM(C47:C52)","v":2195},{"$f":"SUM(D47:D52)","v":1555},{"$f":"SUM(E47:E52)","v":1235},{"$f":"SUM(B53:E53)","v":7500},{"$f":"SUM(G47:G52)","v":1}]
[]
["For 167-222 riders 8 places"]
["Placings","1D","2D","3D","4D"]
["1st",{"$f":"$B$7*$G$57","v":603.6},{"$f":"$C$7*$G$57","v":526.79999999999995},{"$f":"$D$7*$G$57","v":373.2},{"$f":"$E$7*$G$57","v":296.39999999999998},"è",0.24]
["2nd",{"$f":"$B$7*$G$58","v":503},{"$f":"$C$7*$G$58","v":439},{"$f":"$D$7*$G$58","v":311},{"$f":"$E$7*$G$58","v":247},"è",0.2]
["3rd",{"$f":"$B$7*$G$59","v":427.55},{"$f":"$C$7*$G$59","v":373.15000000000003},{"$f":"$D$7*$G$59","v":264.35000000000002},{"$f":"$E$7*$G$59","v":209.95000000000002},"è",0.17]
["4th",{"$f":"$B$7*$G$60","v":326.95},{"$f":"$C$7*$G$60","v":285.35000000000002},{"$f":"$D$7*$G$60","v":202.15},{"$f":"$E$7*$G$60","v":160.55000000000001},"è",0.13]
["5th",{"$f":"$B$7*$G$61","v":251.5},{"$f":"$C$7*$G$61","v":219.5},{"$f":"$D$7*$G$61","v":155.5},{"$f":"$E$7*$G$61","v":123.5},"è",0.1]
["6th",{"$f":"$B$7*$G$62","v":176.05},{"$f":"$C$7*$G$62","v":153.65},{"$f":"$D$7*$G$62","v":108.85000000000001},{"$f":"$E$7*$G$62","v":86.45},"è",7.0000000000000007E-2]
["7th",{"$f":"$B$7*$G$63","v":125.75},{"$f":"$C$7*$G$63","v":109.75},{"$f":"$D$7*$G$63","v":77.75},{"$f":"$E$7*$G$63","v":61.75},"è",0.05]
["8th",{"$f":"$B$7*$G$64","v":100.60000000000001},{"$f":"$C$7*$G$64","v":87.8},{"$f":"$D$7*$G$64","v":62.2},{"$f":"$E$7*$G$64","v":49.4},"è",0.04]
["Totals",{"$f":"SUM(B57:B64)","v":2515},{"$f":"SUM(C57:C64)","v":2195.0000000000005},{"$f":"SUM(D57:D64)","v":1555},{"$f":"SUM(E57:E64)","v":1235.0000000000002},{"$f":"SUM(B65:E65)","v":7500},{"$f":"SUM(G57:G64)","v":1}]
[]
["For 223-333 riders 10 places"]
["Placings","1D","2D","3D","4D"]
["1st",{"$f":"$B$7*$G$69","v":528.15},{"$f":"$C$7*$G$69","v":460.95},{"$f":"$D$7*$G$69","v":326.55},{"$f":"$E$7*$G$69","v":259.34999999999997},"è",0.21]
["2nd",{"$f":"$B$7*$G$70","v":452.7},{"$f":"$C$7*$G$70","v":395.09999999999997},{"$f":"$D$7*$G$70","v":279.89999999999998},{"$f":"$E$7*$G$70","v":222.29999999999998},"è",0.18]
["3rd",{"$f":"$B$7*$G$71","v":377.25},{"$f":"$C$7*$G$71","v":329.25},{"$f":"$D$7*$G$71","v":233.25},{"$f":"$E$7*$G$71","v":185.25},"è",0.15]
["4th",{"$f":"$B$7*$G$72","v":301.8},{"$f":"$C$7*$G$72","v":263.39999999999998},{"$f":"$D$7*$G$72","v":186.6},{"$f":"$E$7*$G$72","v":148.19999999999999},"è",0.12]
["5th",{"$f":"$B$7*$G$73","v":226.35},{"$f":"$C$7*$G$73","v":197.54999999999998},{"$f":"$D$7*$G$73","v":139.94999999999999},{"$f":"$E$7*$G$73","v":111.14999999999999},"è",0.09]
["6th",{"$f":"$B$7*$G$74","v":176.05},{"$f":"$C$7*$G$74","v":153.65},{"$f":"$D$7*$G$74","v":108.85000000000001},{"$f":"$E$7*$G$74","v":86.45},"è",7.0000000000000007E-2]
["7th",{"$f":"$B$7*$G$75","v":150.9},{"$f":"$C$7*$G$75","v":131.69999999999999},{"$f":"$D$7*$G$75","v":93.3},{"$f":"$E$7*$G$75","v":74.099999999999994},"è",0.06]
["8th",{"$f":"$B$7*$G$76","v":125.75},{"$f":"$C$7*$G$76","v":109.75},{"$f":"$D$7*$G$76","v":77.75},{"$f":"$E$7*$G$76","v":61.75},"è",0.05]
["9th",{"$f":"$B$7*$G$77","v":100.60000000000001},{"$f":"$C$7*$G$77","v":87.8},{"$f":"$D$7*$G$77","v":62.2},{"$f":"$E$7*$G$77","v":49.4},"è",0.04]
["10th",{"$f":"$B$7*$G$78","v":75.45},{"$f":"$C$7*$G$78","v":65.849999999999994},{"$f":"$D$7*$G$78","v":46.65},{"$f":"$E$7*$G$78","v":37.049999999999997},"è",0.03]
["Totals",{"$f":"SUM(B69:B78)","v":2514.9999999999995},{"$f":"SUM(C69:C78)","v":2195},{"$f":"SUM(D69:D78)","v":1555},{"$f":"SUM(E69:E78)","v":1235},{"$f":"B79+C79+D79+E79","v":7500},{"$f":"SUM(G69:G78)","v":1.0000000000000002}]
[]
["For 334-500 riders 12 places"]
["Placings","1D","2D","3D","4D"]
["1st",{"$f":"$B$7*$G$83","v":477.85},{"$f":"$C$7*$G$83","v":417.05},{"$f":"$D$7*$G$83","v":295.45},{"$f":"$E$7*$G$83","v":234.65},"è",0.19]
["2nd",{"$f":"$B$7*$G$84","v":377.25},{"$f":"$C$7*$G$84","v":329.25},{"$f":"$D$7*$G$84","v":233.25},{"$f":"$E$7*$G$84","v":185.25},"è",0.15]
["3rd",{"$f":"$B$7*$G$85","v":301.8},{"$f":"$C$7*$G$85","v":263.39999999999998},{"$f":"$D$7*$G$85","v":186.6},{"$f":"$E$7*$G$85","v":148.19999999999999},"è",0.12]
["4th",{"$f":"$B$7*$G$86","v":251.5},{"$f":"$C$7*$G$86","v":219.5},{"$f":"$D$7*$G$86","v":155.5},{"$f":"$E$7*$G$86","v":123.5},"è",0.1]
["5th",{"$f":"$B$7*$G$87","v":226.35},{"$f":"$C$7*$G$87","v":197.54999999999998},{"$f":"$D$7*$G$87","v":139.94999999999999},{"$f":"$E$7*$G$87","v":111.14999999999999},"è",0.09]
["6th",{"$f":"$B$7*$G$88","v":201.20000000000002},{"$f":"$C$7*$G$88","v":175.6},{"$f":"$D$7*$G$88","v":124.4},{"$f":"$E$7*$G$88","v":98.8},"è",0.08]
["7th",{"$f":"$B$7*$G$89","v":176.05},{"$f":"$C$7*$G$89","v":153.65},{"$f":"$D$7*$G$89","v":108.85000000000001},{"$f":"$E$7*$G$89","v":86.45},"è",7.0000000000000007E-2]
["8th",{"$f":"$B$7*$G$90","v":150.9},{"$f":"$C$7*$G$90","v":131.69999999999999},{"$f":"$D$7*$G$90","v":93.3},{"$f":"$E$7*$G$90","v":74.099999999999994},"è",0.06]
["9th",{"$f":"$B$7*$G$91","v":125.75},{"$f":"$C$7*$G$91","v":109.75},{"$f":"$D$7*$G$91","v":77.75},{"$f":"$E$7*$G$91","v":61.75},"è",0.05]
["10th",{"$f":"$B$7*$G$92","v":100.60000000000001},{"$f":"$C$7*$G$92","v":87.8},{"$f":"$D$7*$G$92","v":62.2},{"$f":"$E$7*$G$92","v":49.4},"è",0.04]
["11th",{"$f":"$B$7*$G$93","v":75.45},{"$f":"$C$7*$G$93","v":65.849999999999994},{"$f":"$D$7*$G$93","v":46.65},{"$f":"$E$7*$G$93","v":37.049999999999997},"è",0.03]
["12th",{"$f":"$B$7*$G$94","v":50.300000000000004},{"$f":"$C$7*$G$94","v":43.9},{"$f":"$D$7*$G$94","v":31.1},{"$f":"$E$7*$G$94","v":24.7},"è",0.02]
["Totals",{"$f":"SUM(B83:B94)","v":2515},{"$f":"SUM(C83:C94)","v":2195},1555,1235,{"$f":"B95+C95+D95+E95","v":7500},{"$f":"SUM(G83:G94)","v":1}]
[]
["For 501-750 riders 15 places"]
["Placings","1D","2D","3D","4D"]
["1st",{"$f":"$B$7*$G$99","v":452.7},{"$f":"$C$7*$G$99","v":395.09999999999997},{"$f":"$D$7*$G$99","v":279.89999999999998},{"$f":"$E$7*$G$99","v":222.29999999999998},"è",0.18]
["2nd",{"$f":"$B$7*$G$100","v":377.25},{"$f":"$C$7*$G$100","v":329.25},{"$f":"$D$7*$G$100","v":233.25},{"$f":"$E$7*$G$100","v":185.25},"è",0.15]
["3rd",{"$f":"$B$7*$G$101","v":301.8},{"$f":"$C$7*$G$101","v":263.39999999999998},{"$f":"$D$7*$G$101","v":186.6},{"$f":"$E$7*$G$101","v":148.19999999999999},"è",0.12]
["4th",{"$f":"$B$7*$G$102","v":251.5},{"$f":"$C$7*$G$102","v":219.5},{"$f":"$D$7*$G$102","v":155.5},{"$f":"$E$7*$G$102","v":123.5},"è",0.1]
["5th",{"$f":"$B$7*$G$103","v":213.77500000000001},{"$f":"$C$7*$G$103","v":186.57500000000002},{"$f":"$D$7*$G$103","v":132.17500000000001},{"$f":"$E$7*$G$103","v":104.97500000000001},"è",8.5000000000000006E-2]
["6th",{"$f":"$B$7*$G$104","v":176.05},{"$f":"$C$7*$G$104","v":153.65},{"$f":"$D$7*$G$104","v":108.85000000000001},{"$f":"$E$7*$G$104","v":86.45},"è",7.0000000000000007E-2]
["7th",{"$f":"$B$7*$G$105","v":150.9},{"$f":"$C$7*$G$105","v":131.69999999999999},{"$f":"$D$7*$G$105","v":93.3},{"$f":"$E$7*$G$105","v":74.099999999999994},"è",0.06]
["8th",{"$f":"$B$7*$G$106","v":125.75},{"$f":"$C$7*$G$106","v":109.75},{"$f":"$D$7*$G$106","v":77.75},{"$f":"$E$7*$G$106","v":61.75},"è",0.05]
["9th",{"$f":"$B$7*$G$107","v":106.8875},{"$f":"$C$7*$G$107","v":93.287500000000009},{"$f":"$D$7*$G$107","v":66.087500000000006},{"$f":"$E$7*$G$107","v":52.487500000000004},"è",4.2500000000000003E-2]
["10th",{"$f":"$B$7*$G$108","v":88.025000000000006},{"$f":"$C$7*$G$108","v":76.825000000000003},{"$f":"$D$7*$G$108","v":54.425000000000004},{"$f":"$E$7*$G$108","v":43.225000000000001},"è",3.5000000000000003E-2]
["11th",{"$f":"$B$7*$G$109","v":75.45},{"$f":"$C$7*$G$109","v":65.849999999999994},{"$f":"$D$7*$G$109","v":46.65},{"$f":"$E$7*$G$109","v":37.049999999999997},"è",0.03]
["12th",{"$f":"$B$7*$G$110","v":62.875},{"$f":"$C$7*$G$110","v":54.875},{"$f":"$D$7*$G$110","v":38.875},{"$f":"$E$7*$G$110","v":30.875},"è",2.5000000000000001E-2]
["13th",{"$f":"$B$7*$G$111","v":50.300000000000004},{"$f":"$C$7*$G$111","v":43.9},{"$f":"$D$7*$G$111","v":31.1},{"$f":"$E$7*$G$111","v":24.7},"è",0.02]
["14th",{"$f":"$B$7*$G$112","v":44.012500000000003},{"$f":"$C$7*$G$112","v":38.412500000000001},{"$f":"$D$7*$G$112","v":27.212500000000002},{"$f":"$E$7*$G$112","v":21.612500000000001},"è",1.7500000000000002E-2]
["15th",{"$f":"$B$7*$G$113","v":37.725000000000001},{"$f":"$C$7*$G$113","v":32.924999999999997},{"$f":"$D$7*$G$113","v":23.324999999999999},{"$f":"$E$7*$G$113","v":18.524999999999999},"è",1.4999999999999999E-2]
["Totals",{"$f":"SUM(B99:B113)","v":2515},{"$f":"SUM(C99:C113)","v":2195},1555,1235,{"$f":"B114+C114+D114+E114","v":7500},{"$f":"SUM(G99:G113)","v":1}]
[]
["For 751-1200 riders 20 places"]
["Placings","1D","2D","3D","4D"]
["1st",{"$f":"$B$7*$G$118","v":352.1},{"$f":"$C$7*$G$118","v":307.3},{"$f":"$D$7*$G$118","v":217.70000000000002},{"$f":"$E$7*$G$118","v":172.9},"è",0.14000000000000001]
["2nd",{"$f":"$B$7*$G$119","v":276.64999999999998},{"$f":"$C$7*$G$119","v":241.45},{"$f":"$D$7*$G$119","v":171.05},{"$f":"$E$7*$G$119","v":135.85},"è",0.11]
["3rd",{"$f":"$B$7*$G$120","v":226.35},{"$f":"$C$7*$G$120","v":197.54999999999998},{"$f":"$D$7*$G$120","v":139.94999999999999},{"$f":"$E$7*$G$120","v":111.14999999999999},"è",0.09]
["4th",{"$f":"$B$7*$G$121","v":193.655},{"$f":"$C$7*$G$121","v":169.01499999999999},{"$f":"$D$7*$G$121","v":119.735},{"$f":"$E$7*$G$121","v":95.094999999999999},"è",7.6999999999999999E-2]
["5th",{"$f":"$B$7*$G$122","v":176.05},{"$f":"$C$7*$G$122","v":153.65},{"$f":"$D$7*$G$122","v":108.85000000000001},{"$f":"$E$7*$G$122","v":86.45},"è",7.0000000000000007E-2]
["6th",{"$f":"$B$7*$G$123","v":163.47499999999999},{"$f":"$C$7*$G$123","v":142.67500000000001},{"$f":"$D$7*$G$123","v":101.075},{"$f":"$E$7*$G$123","v":80.275000000000006},"è",6.5000000000000002E-2]
["7th",{"$f":"$B$7*$G$124","v":150.9},{"$f":"$C$7*$G$124","v":131.69999999999999},{"$f":"$D$7*$G$124","v":93.3},{"$f":"$E$7*$G$124","v":74.099999999999994},"è",0.06]
["8th",{"$f":"$B$7*$G$125","v":138.32499999999999},{"$f":"$C$7*$G$125","v":120.72499999999999},{"$f":"$D$7*$G$125","v":85.525000000000006},{"$f":"$E$7*$G$125","v":67.924999999999997},"è",5.5E-2]
["9th",{"$f":"$B$7*$G$126","v":125.75},{"$f":"$C$7*$G$126","v":109.75},{"$f":"$D$7*$G$126","v":77.75},{"$f":"$E$7*$G$126","v":61.75},"è",0.05]
["10th",{"$f":"$B$7*$G$127","v":113.175},{"$f":"$C$7*$G$127","v":98.774999999999991},{"$f":"$D$7*$G$127","v":69.974999999999994},{"$f":"$E$7*$G$127","v":55.574999999999996},"è",4.4999999999999998E-2]
["11th",{"$f":"$B$7*$G$128","v":100.60000000000001},{"$f":"$C$7*$G$128","v":87.8},{"$f":"$D$7*$G$128","v":62.2},{"$f":"$E$7*$G$128","v":49.4},"è",0.04]
["12th",{"$f":"$B$7*$G$129","v":93.054999999999993},{"$f":"$C$7*$G$129","v":81.214999999999989},{"$f":"$D$7*$G$129","v":57.534999999999997},{"$f":"$E$7*$G$129","v":45.695},"è",3.6999999999999998E-2]
["13th",{"$f":"$B$7*$G$130","v":82.995000000000005},{"$f":"$C$7*$G$130","v":72.435000000000002},{"$f":"$D$7*$G$130","v":51.315000000000005},{"$f":"$E$7*$G$130","v":40.755000000000003},"è",3.3000000000000002E-2]
["14th",{"$f":"$B$7*$G$131","v":72.935000000000002},{"$f":"$C$7*$G$131","v":63.655000000000001},{"$f":"$D$7*$G$131","v":45.094999999999999},{"$f":"$E$7*$G$131","v":35.815000000000005},"è",2.9000000000000001E-2]
["15th",{"$f":"$B$7*$G$132","v":62.875},{"$f":"$C$7*$G$132","v":54.875},{"$f":"$D$7*$G$132","v":38.875},{"$f":"$E$7*$G$132","v":30.875},"è",2.5000000000000001E-2]
["16th",{"$f":"$B$7*$G$133","v":52.815000000000005},{"$f":"$C$7*$G$133","v":46.095000000000006},{"$f":"$D$7*$G$133","v":32.655000000000001},{"$f":"$E$7*$G$133","v":25.935000000000002},"è",2.1000000000000001E-2]
["17th",{"$f":"$B$7*$G$134","v":42.755000000000003},{"$f":"$C$7*$G$134","v":37.315000000000005},{"$f":"$D$7*$G$134","v":26.435000000000002},{"$f":"$E$7*$G$134","v":20.995000000000001},"è",1.7000000000000001E-2]
["18th",{"$f":"$B$7*$G$135","v":35.21},{"$f":"$C$7*$G$135","v":30.73},{"$f":"$D$7*$G$135","v":21.77},{"$f":"$E$7*$G$135","v":17.29},"è",1.4E-2]
["19th",{"$f":"$B$7*$G$136","v":30.18},{"$f":"$C$7*$G$136","v":26.34},{"$f":"$D$7*$G$136","v":18.66},{"$f":"$E$7*$G$136","v":14.82},"è",1.2E-2]
["20th",{"$f":"$B$7*$G$137","v":25.150000000000002},{"$f":"$C$7*$G$137","v":21.95},{"$f":"$D$7*$G$137","v":15.55},{"$f":"$E$7*$G$137","v":12.35},"è",0.01]
["Totals",{"$f":"SUM(B118:B137)","v":2515},{"$f":"SUM(C118:C137)","v":2194.9999999999995},1555.0000000000002,1234.9999999999998,{"$f":"B138+C138+D138+E138","v":7500},{"$f":"SUM(G118:G137)","v":1.0000000000000004}]
[]
["For 1201 or More riders 30 places"]
["Placings","1D","2D","3D","4D"]
["1st",{"$f":"$B$7*$G$142","v":301.8},{"$f":"$C$7*$G$142","v":263.39999999999998},{"$f":"$D$7*$G$142","v":186.6},{"$f":"$E$7*$G$142","v":148.19999999999999},"è",0.12]
["2nd",{"$f":"$B$7*$G$143","v":238.92500000000001},{"$f":"$C$7*$G$143","v":208.52500000000001},{"$f":"$D$7*$G$143","v":147.72499999999999},{"$f":"$E$7*$G$143","v":117.325},"è",9.5000000000000001E-2]
["3rd",{"$f":"$B$7*$G$144","v":183.595},{"$f":"$C$7*$G$144","v":160.23499999999999},{"$f":"$D$7*$G$144","v":113.51499999999999},{"$f":"$E$7*$G$144","v":90.155000000000001},"è",7.2999999999999995E-2]
["4th",{"$f":"$B$7*$G$145","v":155.93},{"$f":"$C$7*$G$145","v":136.09},{"$f":"$D$7*$G$145","v":96.41},{"$f":"$E$7*$G$145","v":76.569999999999993},"è",6.2E-2]
["5th",{"$f":"$B$7*$G$146","v":125.75},{"$f":"$C$7*$G$146","v":109.75},{"$f":"$D$7*$G$146","v":77.75},{"$f":"$E$7*$G$146","v":61.75},"è",0.05]
["6th",{"$f":"$B$7*$G$147","v":113.175},{"$f":"$C$7*$G$147","v":98.774999999999991},{"$f":"$D$7*$G$147","v":69.974999999999994},{"$f":"$E$7*$G$147","v":55.574999999999996},"è",4.4999999999999998E-2]
["7th",{"$f":"$B$7*$G$148","v":108.145},{"$f":"$C$7*$G$148","v":94.384999999999991},{"$f":"$D$7*$G$148","v":66.864999999999995},{"$f":"$E$7*$G$148","v":53.104999999999997},"è",4.2999999999999997E-2]
["8th",{"$f":"$B$7*$G$149","v":100.60000000000001},{"$f":"$C$7*$G$149","v":87.8},{"$f":"$D$7*$G$149","v":62.2},{"$f":"$E$7*$G$149","v":49.4},"è",0.04]
["9th",{"$f":"$B$7*$G$150","v":93.054999999999993},{"$f":"$C$7*$G$150","v":81.214999999999989},{"$f":"$D$7*$G$150","v":57.534999999999997},{"$f":"$E$7*$G$150","v":45.695},"è",3.6999999999999998E-2]
["10th",{"$f":"$B$7*$G$151","v":88.025000000000006},{"$f":"$C$7*$G$151","v":76.825000000000003},{"$f":"$D$7*$G$151","v":54.425000000000004},{"$f":"$E$7*$G$151","v":43.225000000000001},"è",3.5000000000000003E-2]
["11th",{"$f":"$B$7*$G$152","v":82.995000000000005},{"$f":"$C$7*$G$152","v":72.435000000000002},{"$f":"$D$7*$G$152","v":51.315000000000005},{"$f":"$E$7*$G$152","v":40.755000000000003},"è",3.3000000000000002E-2]
["12th",{"$f":"$B$7*$G$153","v":77.965000000000003},{"$f":"$C$7*$G$153","v":68.045000000000002},{"$f":"$D$7*$G$153","v":48.204999999999998},{"$f":"$E$7*$G$153","v":38.284999999999997},"è",3.1E-2]
["13th",{"$f":"$B$7*$G$154","v":72.935000000000002},{"$f":"$C$7*$G$154","v":63.655000000000001},{"$f":"$D$7*$G$154","v":45.094999999999999},{"$f":"$E$7*$G$154","v":35.815000000000005},"è",2.9000000000000001E-2]
["14th",{"$f":"$B$7*$G$155","v":67.905000000000001},{"$f":"$C$7*$G$155","v":59.265000000000001},{"$f":"$D$7*$G$155","v":41.984999999999999},{"$f":"$E$7*$G$155","v":33.344999999999999},"è",2.7E-2]
["15th",{"$f":"$B$7*$G$156","v":62.875},{"$f":"$C$7*$G$156","v":54.875},{"$f":"$D$7*$G$156","v":38.875},{"$f":"$E$7*$G$156","v":30.875},"è",2.5000000000000001E-2]
["16th",{"$f":"$B$7*$G$157","v":60.36},{"$f":"$C$7*$G$157","v":52.68},{"$f":"$D$7*$G$157","v":37.32},{"$f":"$E$7*$G$157","v":29.64},"è",2.4E-2]
["17th",{"$f":"$B$7*$G$158","v":57.844999999999999},{"$f":"$C$7*$G$158","v":50.484999999999999},{"$f":"$D$7*$G$158","v":35.765000000000001},{"$f":"$E$7*$G$158","v":28.405000000000001},"è",2.3E-2]
["18th",{"$f":"$B$7*$G$159","v":55.33},{"$f":"$C$7*$G$159","v":48.29},{"$f":"$D$7*$G$159","v":34.21},{"$f":"$E$7*$G$159","v":27.169999999999998},"è",2.1999999999999999E-2]
["19th",{"$f":"$B$7*$G$160","v":52.815000000000005},{"$f":"$C$7*$G$160","v":46.095000000000006},{"$f":"$D$7*$G$160","v":32.655000000000001},{"$f":"$E$7*$G$160","v":25.935000000000002},"è",2.1000000000000001E-2]
["20th",{"$f":"$B$7*$G$161","v":50.300000000000004},{"$f":"$C$7*$G$161","v":43.9},{"$f":"$D$7*$G$161","v":31.1},{"$f":"$E$7*$G$161","v":24.7},"è",0.02]
["21st",{"$f":"$B$7*$G$162","v":47.784999999999997},{"$f":"$C$7*$G$162","v":41.704999999999998},{"$f":"$D$7*$G$162","v":29.544999999999998},{"$f":"$E$7*$G$162","v":23.465},"è",1.9E-2]
["22nd",{"$f":"$B$7*$G$163","v":45.269999999999996},{"$f":"$C$7*$G$163","v":39.51},{"$f":"$D$7*$G$163","v":27.99},{"$f":"$E$7*$G$163","v":22.229999999999997},"è",1.7999999999999999E-2]
["23rd",{"$f":"$B$7*$G$164","v":42.755000000000003},{"$f":"$C$7*$G$164","v":37.315000000000005},{"$f":"$D$7*$G$164","v":26.435000000000002},{"$f":"$E$7*$G$164","v":20.995000000000001},"è",1.7000000000000001E-2]
["24th",{"$f":"$B$7*$G$165","v":40.24},{"$f":"$C$7*$G$165","v":35.119999999999997},{"$f":"$D$7*$G$165","v":24.88},{"$f":"$E$7*$G$165","v":19.760000000000002},"è",1.6E-2]
["25th",{"$f":"$B$7*$G$166","v":37.725000000000001},{"$f":"$C$7*$G$166","v":32.924999999999997},{"$f":"$D$7*$G$166","v":23.324999999999999},{"$f":"$E$7*$G$166","v":18.524999999999999},"è",1.4999999999999999E-2]
["26th",{"$f":"$B$7*$G$167","v":35.21},{"$f":"$C$7*$G$167","v":30.73},{"$f":"$D$7*$G$167","v":21.77},{"$f":"$E$7*$G$167","v":17.29},"è",1.4E-2]
["27th",{"$f":"$B$7*$G$168","v":32.695},{"$f":"$C$7*$G$168","v":28.535},{"$f":"$D$7*$G$168","v":20.215},{"$f":"$E$7*$G$168","v":16.055},"è",1.2999999999999999E-2]
["28th",{"$f":"$B$7*$G$169","v":30.18},{"$f":"$C$7*$G$169","v":26.34},{"$f":"$D$7*$G$169","v":18.66},{"$f":"$E$7*$G$169","v":14.82},"è",1.2E-2]
["29th",{"$f":"$B$7*$G$170","v":27.664999999999999},{"$f":"$C$7*$G$170","v":24.145},{"$f":"$D$7*$G$170","v":17.105},{"$f":"$E$7*$G$170","v":13.584999999999999},"è",1.0999999999999999E-2]
["30th",{"$f":"$B$7*$G$171","v":25.150000000000002},{"$f":"$C$7*$G$171","v":21.95},{"$f":"$D$7*$G$171","v":15.55},{"$f":"$E$7*$G$171","v":12.35},"è",0.01]
["Totals",{"$f":"SUM(B142:B171)","v":2514.9999999999995},{"$f":"SUM(C142:C171)","v":2194.9999999999995},{"$f":"SUM(D142:D171)","v":1555},{"$f":"SUM(E142:E171)","v":1234.9999999999998},{"$f":"B172+C172+D172+E172","v":7499.9999999999991},{"$f":"SUM(G142:G171)","v":1.0000000000000002}]

{"sheet":"5D Payout BBR","index":16,"n_rows":172,"n_cols":8,"rows_kept":172,"cut":false,"hidden":false,"merged":[[139,0,139,7],[80,0,80,7],[95,0,95,7],[96,0,96,7],[81,6,81,7],[97,6,97,7],[116,6,116,7],[114,0,114,7],[115,0,115,7],[65,0,65,7],[66,0,66,7],[79,0,79,7],[67,6,67,7],[138,0,138,7],[44,0,44,7],[45,6,45,7],[53,0,53,7],[54,0,54,7],[55,6,55,7],[0,0,0,7],[3,0,3,7],[8,0,8,7],[9,0,9,7],[5,6,6,6],[10,6,10,7],[13,0,13,7],[14,0,14,7],[140,6,140,7],[5,7,7,7],[15,6,15,7],[19,0,19,7],[20,0,20,7],[21,6,21,7],[26,0,26,7],[27,0,27,7],[28,6,28,7],[34,0,34,7],[35,0,35,7],[36,6,36,7],[43,0,43,7]]}
["5D Payout BBR"]
["Entry Fee","# Entries","% Payback","$ From Entry","Added $","Total Payout","Total $ Held"]
[25,64,0.8,{"$f":"$A$3*$C$3*$B$3","v":1280},null,null,{"$f":"$A$3*(100%-$C$3)*$B$3","v":319.99999999999994}]
[]
["% in each D",0.3,0.25,0.2,0.15,0.1,"Total % Payout",{"$f":"SUM(B5:F5)","v":1}]
[null,"1D","2D","3D","4D","5D"]
[null,{"$f":"(($A$3*$B$3*$C$3*$B$5)+($E$3*$B$5))","v":384},{"$f":"(($A$3*$B$3*$C$3*$C$5)+($E$3*$C$5))","v":320},{"$f":"(($A$3*$B$3*$C$3*$D$5)+($E$3*$D$5))","v":256},{"$f":"(($A$3*$B$3*$C$3*$E$5)+($E$3*$E$5))","v":192},{"$f":"(($A$3*$B$3*$C$3*$F$5)+($E$3*$F$5))","v":128}]
["Totals",{"$f":"SUM(B7)","v":384},{"$f":"SUM(C7)","v":320},256,192,128,{"$f":"SUM(B8:F8)","v":1280}]
[]
["For 1-25 riders 1 place"]
["Placings","1D","2D","3D","4D","5D"]
["1st",{"$f":"$B$7*$H$12","v":384},{"$f":"$C$7*$H$12","v":320},{"$f":"$D$7*$H$12","v":256},{"$f":"$E$7*$H$12","v":192},{"$f":"$F$7*$H$12","v":128},"è",1]
["Totals",{"$f":"SUM(B12:B12)","v":384},{"$f":"SUM(C12:C12)","v":320},{"$f":"SUM(D12:D12)","v":256},{"$f":"SUM(E12:E12)","v":192},{"$f":"SUM(F12)","v":128},{"$f":"SUM(B13:F13)","v":1280},{"$f":"SUM(H12)","v":1}]
[]
["For 26-50 riders 2 places"]
["Placings","1D","2D","3D","4D","5D"]
["1st",{"$f":"$B$7*$H$17","v":230.39999999999998},{"$f":"$C$7*$H$17","v":192},{"$f":"$D$7*$H$17","v":153.6},{"$f":"$E$7*$H$17","v":115.19999999999999},{"$f":"$F$7*$H$17","v":76.8},"è",0.6]
["2nd",{"$f":"$B$7*$H$18","v":153.60000000000002},{"$f":"$C$7*$H$18","v":128},{"$f":"$D$7*$H$18","v":102.4},{"$f":"$E$7*$H$18","v":76.800000000000011},{"$f":"$F$7*$H$18","v":51.2},"è",0.4]
["Totals",{"$f":"SUM(B17:B18)","v":384},{"$f":"SUM(C17:C18)","v":320},{"$f":"SUM(D17:D18)","v":256},{"$f":"SUM(E17:E18)","v":192},{"$f":"SUM(F17:F18)","v":128},{"$f":"SUM(B19:F19)","v":1280},{"$f":"SUM(H17:H18)","v":1}]
[]
["For 51-100 riders 3 places"]
["Placings","1D","2D","3D","4D","5D"]
["1st",{"$f":"$B$7*$H$23","v":192},{"$f":"$C$7*$H$23","v":160},{"$f":"$D$7*$H$23","v":128},{"$f":"$E$7*$H$23","v":96},{"$f":"$F$7*$H$23","v":64},"è",0.5]
["2nd",{"$f":"$B$7*$H$24","v":115.19999999999999},{"$f":"$C$7*$H$24","v":96},{"$f":"$D$7*$H$24","v":76.8},{"$f":"$E$7*$H$24","v":57.599999999999994},{"$f":"$F$7*$H$24","v":38.4},"è",0.3]
["3rd",{"$f":"$B$7*$H$25","v":76.800000000000011},{"$f":"$C$7*$H$25","v":64},{"$f":"$D$7*$H$25","v":51.2},{"$f":"$E$7*$H$25","v":38.400000000000006},{"$f":"$F$7*$H$25","v":25.6},"è",0.2]
["Totals",{"$f":"SUM(B23:B25)","v":384},{"$f":"SUM(C23:C25)","v":320},{"$f":"SUM(D23:D25)","v":256},{"$f":"SUM(E23:E25)","v":192},{"$f":"SUM(F23:F25)","v":128},{"$f":"SUM(B26:F26)","v":1280},{"$f":"SUM(H23:H25)","v":1}]
[]
["For 101-143 riders 4 places"]
["Placings","1D","2D","3D","4D","5D"]
["1st",{"$f":"$B$7*$H$30","v":153.60000000000002},{"$f":"$C$7*$H$30","v":128},{"$f":"$D$7*$H$30","v":102.4},{"$f":"$E$7*$H$30","v":76.800000000000011},{"$f":"$F$7*$H$30","v":51.2},"è",0.4]
["2nd",{"$f":"$B$7*$H$31","v":115.19999999999999},{"$f":"$C$7*$H$31","v":96},{"$f":"$D$7*$H$31","v":76.8},{"$f":"$E$7*$H$31","v":57.599999999999994},{"$f":"$F$7*$H$31","v":38.4},"è",0.3]
["3rd",{"$f":"$B$7*$H$32","v":76.800000000000011},{"$f":"$C$7*$H$32","v":64},{"$f":"$D$7*$H$32","v":51.2},{"$f":"$E$7*$H$32","v":38.400000000000006},{"$f":"$F$7*$H$32","v":25.6},"è",0.2]
["4th",{"$f":"$B$7*$H$33","v":38.400000000000006},{"$f":"$C$7*$H$33","v":32},{"$f":"$D$7*$H$33","v":25.6},{"$f":"$E$7*$H$33","v":19.200000000000003},{"$f":"$F$7*$H$33","v":12.8},"è",0.1]
["Totals",{"$f":"SUM(B30:B33)","v":384},{"$f":"SUM(C30:C33)","v":320},{"$f":"SUM(D30:D33)","v":255.99999999999997},{"$f":"SUM(E30:E33)","v":192},{"$f":"SUM(F30:F33)","v":127.99999999999999},{"$f":"SUM(B34:F34)","v":1280},{"$f":"SUM(H30:H33)","v":0.99999999999999989}]
[]
["For 144-200 riders 5 places"]
["Placings","1D","2D","3D","4D","5D"]
["1st",{"$f":"$B$7*$H$38","v":126.72},{"$f":"$C$7*$H$38","v":105.60000000000001},{"$f":"$D$7*$H$38","v":84.48},{"$f":"$E$7*$H$38","v":63.36},{"$f":"$F$7*$H$38","v":42.24},"è",0.33]
["2nd",{"$f":"$B$7*$H$39","v":103.68},{"$f":"$C$7*$H$39","v":86.4},{"$f":"$D$7*$H$39","v":69.12},{"$f":"$E$7*$H$39","v":51.84},{"$f":"$F$7*$H$39","v":34.56},"è",0.27]
["3rd",{"$f":"$B$7*$H$40","v":76.800000000000011},{"$f":"$C$7*$H$40","v":64},{"$f":"$D$7*$H$40","v":51.2},{"$f":"$E$7*$H$40","v":38.400000000000006},{"$f":"$F$7*$H$40","v":25.6},"è",0.2]
["4th",{"$f":"$B$7*$H$41","v":49.92},{"$f":"$C$7*$H$41","v":41.6},{"$f":"$D$7*$H$41","v":33.28},{"$f":"$E$7*$H$41","v":24.96},{"$f":"$F$7*$H$41","v":16.64},"è",0.13]
["5th",{"$f":"$B$7*$H$42","v":26.880000000000003},{"$f":"$C$7*$H$42","v":22.400000000000002},{"$f":"$D$7*$H$42","v":17.920000000000002},{"$f":"$E$7*$H$42","v":13.440000000000001},{"$f":"$F$7*$H$42","v":8.9600000000000009},"è",7.0000000000000007E-2]
["Totals",{"$f":"SUM(B38:B42)","v":384.00000000000006},{"$f":"SUM(C38:C42)","v":320},{"$f":"SUM(D38:D42)","v":256},{"$f":"SUM(E38:E42)","v":192.00000000000003},{"$f":"SUM(F38:F42)","v":128},{"$f":"SUM(B43:F43)","v":1280},{"$f":"SUM(H38:H42)","v":1}]
[]
["For 201-250 riders 6 places"]
["Placings","1D","2D","3D","4D","5D"]
["1st",{"$f":"$B$7*$H$47","v":111.35999999999999},{"$f":"$C$7*$H$47","v":92.8},{"$f":"$D$7*$H$47","v":74.239999999999995},{"$f":"$E$7*$H$47","v":55.679999999999993},{"$f":"$F$7*$H$47","v":37.119999999999997},"è",0.28999999999999998]
["2nd",{"$f":"$B$7*$H$48","v":92.16},{"$f":"$C$7*$H$48","v":76.8},{"$f":"$D$7*$H$48","v":61.44},{"$f":"$E$7*$H$48","v":46.08},{"$f":"$F$7*$H$48","v":30.72},"è",0.24]
["3rd",{"$f":"$B$7*$H$49","v":72.960000000000008},{"$f":"$C$7*$H$49","v":60.8},{"$f":"$D$7*$H$49","v":48.64},{"$f":"$E$7*$H$49","v":36.480000000000004},{"$f":"$F$7*$H$49","v":24.32},"è",0.19]
["4th",{"$f":"$B$7*$H$50","v":53.760000000000005},{"$f":"$C$7*$H$50","v":44.800000000000004},{"$f":"$D$7*$H$50","v":35.840000000000003},{"$f":"$E$7*$H$50","v":26.880000000000003},{"$f":"$F$7*$H$50","v":17.920000000000002},"è",0.14000000000000001]
["5th",{"$f":"$B$7*$H$51","v":34.56},{"$f":"$C$7*$H$51","v":28.799999999999997},{"$f":"$D$7*$H$51","v":23.04},{"$f":"$E$7*$H$51","v":17.28},{"$f":"$F$7*$H$51","v":11.52},"è",0.09]
["6th",{"$f":"$B$7*$H$52","v":19.200000000000003},{"$f":"$C$7*$H$52","v":16},{"$f":"$D$7*$H$52","v":12.8},{"$f":"$E$7*$H$52","v":9.6000000000000014},{"$f":"$F$7*$H$52","v":6.4},"è",0.05]
["Totals",{"$f":"SUM(B47:B52)","v":384},{"$f":"SUM(C47:C52)","v":320},{"$f":"SUM(D47:D52)","v":256},{"$f":"SUM(E47:E52)","v":192},{"$f":"SUM(F47:F52)","v":128},{"$f":"SUM(B53:F53)","v":1280},{"$f":"SUM(H47:H52)","v":1}]
[]
["For 251-333 riders 8 places"]
["Placings","1D","2D","3D","4D","5D"]
["1st",{"$f":"$B$7*$H$57","v":92.16},{"$f":"$C$7*$H$57","v":76.8},{"$f":"$D$7*$H$57","v":61.44},{"$f":"$E$7*$H$57","v":46.08},{"$f":"$F$7*$H$57","v":30.72},"è",0.24]
["2nd",{"$f":"$B$7*$H$58","v":76.800000000000011},{"$f":"$C$7*$H$58","v":64},{"$f":"$D$7*$H$58","v":51.2},{"$f":"$E$7*$H$58","v":38.400000000000006},{"$f":"$F$7*$H$58","v":25.6},"è",0.2]
["3rd",{"$f":"$B$7*$H$59","v":65.28},{"$f":"$C$7*$H$59","v":54.400000000000006},{"$f":"$D$7*$H$59","v":43.52},{"$f":"$E$7*$H$59","v":32.64},{"$f":"$F$7*$H$59","v":21.76},"è",0.17]
["4th",{"$f":"$B$7*$H$60","v":49.92},{"$f":"$C$7*$H$60","v":41.6},{"$f":"$D$7*$H$60","v":33.28},{"$f":"$E$7*$H$60","v":24.96},{"$f":"$F$7*$H$60","v":16.64},"è",0.13]
["5th",{"$f":"$B$7*$H$61","v":38.400000000000006},{"$f":"$C$7*$H$61","v":32},{"$f":"$D$7*$H$61","v":25.6},{"$f":"$E$7*$H$61","v":19.200000000000003},{"$f":"$F$7*$H$61","v":12.8},"è",0.1]
["6th",{"$f":"$B$7*$H$62","v":26.880000000000003},{"$f":"$C$7*$H$62","v":22.400000000000002},{"$f":"$D$7*$H$62","v":17.920000000000002},{"$f":"$E$7*$H$62","v":13.440000000000001},{"$f":"$F$7*$H$62","v":8.9600000000000009},"è",7.0000000000000007E-2]
["7th",{"$f":"$B$7*$H$63","v":19.200000000000003},{"$f":"$C$7*$H$63","v":16},{"$f":"$D$7*$H$63","v":12.8},{"$f":"$E$7*$H$63","v":9.6000000000000014},{"$f":"$F$7*$H$63","v":6.4},"è",0.05]
["8th",{"$f":"$B$7*$H$64","v":15.36},{"$f":"$C$7*$H$64","v":12.8},{"$f":"$D$7*$H$64","v":10.24},{"$f":"$E$7*$H$64","v":7.68},{"$f":"$F$7*$H$64","v":5.12},"è",0.04]
["Totals",{"$f":"SUM(B57:B64)","v":384.00000000000006},{"$f":"SUM(C57:C64)","v":320},{"$f":"SUM(D57:D64)","v":256},{"$f":"SUM(E57:E64)","v":192.00000000000003},{"$f":"SUM(F57:F64)","v":128},{"$f":"SUM(B65:F65)","v":1280},{"$f":"SUM(H57:H64)","v":1}]
[]
["For 334-500 riders 10 places"]
["Placings","1D","2D","3D","4D","5D"]
["1st",{"$f":"$B$7*$H$69","v":80.64},{"$f":"$C$7*$H$69","v":67.2},{"$f":"$D$7*$H$69","v":53.76},{"$f":"$E$7*$H$69","v":40.32},{"$f":"$F$7*$H$69","v":26.88},"è",0.21]
["2nd",{"$f":"$B$7*$H$70","v":69.12},{"$f":"$C$7*$H$70","v":57.599999999999994},{"$f":"$D$7*$H$70","v":46.08},{"$f":"$E$7*$H$70","v":34.56},{"$f":"$F$7*$H$70","v":23.04},"è",0.18]
["3rd",{"$f":"$B$7*$H$71","v":57.599999999999994},{"$f":"$C$7*$H$71","v":48},{"$f":"$D$7*$H$71","v":38.4},{"$f":"$E$7*$H$71","v":28.799999999999997},{"$f":"$F$7*$H$71","v":19.2},"è",0.15]
["4th",{"$f":"$B$7*$H$72","v":46.08},{"$f":"$C$7*$H$72","v":38.4},{"$f":"$D$7*$H$72","v":30.72},{"$f":"$E$7*$H$72","v":23.04},{"$f":"$F$7*$H$72","v":15.36},"è",0.12]
["5th",{"$f":"$B$7*$H$73","v":34.56},{"$f":"$C$7*$H$73","v":28.799999999999997},{"$f":"$D$7*$H$73","v":23.04},{"$f":"$E$7*$H$73","v":17.28},{"$f":"$F$7*$H$73","v":11.52},"è",0.09]
["6th",{"$f":"$B$7*$H$74","v":26.880000000000003},{"$f":"$C$7*$H$74","v":22.400000000000002},{"$f":"$D$7*$H$74","v":17.920000000000002},{"$f":"$E$7*$H$74","v":13.440000000000001},{"$f":"$F$7*$H$74","v":8.9600000000000009},"è",7.0000000000000007E-2]
["7th",{"$f":"$B$7*$H$75","v":23.04},{"$f":"$C$7*$H$75","v":19.2},{"$f":"$D$7*$H$75","v":15.36},{"$f":"$E$7*$H$75","v":11.52},{"$f":"$F$7*$H$75","v":7.68},"è",0.06]
["8th",{"$f":"$B$7*$H$76","v":19.200000000000003},{"$f":"$C$7*$H$76","v":16},{"$f":"$D$7*$H$76","v":12.8},{"$f":"$E$7*$H$76","v":9.6000000000000014},{"$f":"$F$7*$H$76","v":6.4},"è",0.05]
["9th",{"$f":"$B$7*$H$77","v":15.36},{"$f":"$C$7*$H$77","v":12.8},{"$f":"$D$7*$H$77","v":10.24},{"$f":"$E$7*$H$77","v":7.68},{"$f":"$F$7*$H$77","v":5.12},"è",0.04]
["10th",{"$f":"$B$7*$H$78","v":11.52},{"$f":"$C$7*$H$78","v":9.6},{"$f":"$D$7*$H$78","v":7.68},{"$f":"$E$7*$H$78","v":5.76},{"$f":"$F$7*$H$78","v":3.84},"è",0.03]
["Totals",{"$f":"SUM(B69:B78)","v":384},{"$f":"SUM(C69:C78)","v":320},256.00000000000006,192,128.00000000000003,{"$f":"SUM(B79:F79)","v":1280},{"$f":"SUM(H69:H78)","v":1.0000000000000002}]
[]
["For 501-666 riders 12 places"]
["Placings","1D","2D","3D","4D","5D"]
["1st",{"$f":"$B$7*$H$83","v":72.960000000000008},{"$f":"$C$7*$H$83","v":60.8},{"$f":"$D$7*$H$83","v":48.64},{"$f":"$E$7*$H$83","v":36.480000000000004},{"$f":"$F$7*$H$83","v":24.32},"è",0.19]
["2nd",{"$f":"$B$7*$H$84","v":57.599999999999994},{"$f":"$C$7*$H$84","v":48},{"$f":"$D$7*$H$84","v":38.4},{"$f":"$E$7*$H$84","v":28.799999999999997},{"$f":"$F$7*$H$84","v":19.2},"è",0.15]
["3rd",{"$f":"$B$7*$H$85","v":46.08},{"$f":"$C$7*$H$85","v":38.4},{"$f":"$D$7*$H$85","v":30.72},{"$f":"$E$7*$H$85","v":23.04},{"$f":"$F$7*$H$85","v":15.36},"è",0.12]
["4th",{"$f":"$B$7*$H$86","v":38.400000000000006},{"$f":"$C$7*$H$86","v":32},{"$f":"$D$7*$H$86","v":25.6},{"$f":"$E$7*$H$86","v":19.200000000000003},{"$f":"$F$7*$H$86","v":12.8},"è",0.1]
["5th",{"$f":"$B$7*$H$87","v":34.56},{"$f":"$C$7*$H$87","v":28.799999999999997},{"$f":"$D$7*$H$87","v":23.04},{"$f":"$E$7*$H$87","v":17.28},{"$f":"$F$7*$H$87","v":11.52},"è",0.09]
["6th",{"$f":"$B$7*$H$88","v":30.72},{"$f":"$C$7*$H$88","v":25.6},{"$f":"$D$7*$H$88","v":20.48},{"$f":"$E$7*$H$88","v":15.36},{"$f":"$F$7*$H$88","v":10.24},"è",0.08]
["7th",{"$f":"$B$7*$H$89","v":26.880000000000003},{"$f":"$C$7*$H$89","v":22.400000000000002},{"$f":"$D$7*$H$89","v":17.920000000000002},{"$f":"$E$7*$H$89","v":13.440000000000001},{"$f":"$F$7*$H$89","v":8.9600000000000009},"è",7.0000000000000007E-2]
["8th",{"$f":"$B$7*$H$90","v":23.04},{"$f":"$C$7*$H$90","v":19.2},{"$f":"$D$7*$H$90","v":15.36},{"$f":"$E$7*$H$90","v":11.52},{"$f":"$F$7*$H$90","v":7.68},"è",0.06]
["9th",{"$f":"$B$7*$H$91","v":19.200000000000003},{"$f":"$C$7*$H$91","v":16},{"$f":"$D$7*$H$91","v":12.8},{"$f":"$E$7*$H$91","v":9.6000000000000014},{"$f":"$F$7*$H$91","v":6.4},"è",0.05]
["10th",{"$f":"$B$7*$H$92","v":15.36},{"$f":"$C$7*$H$92","v":12.8},{"$f":"$D$7*$H$92","v":10.24},{"$f":"$E$7*$H$92","v":7.68},{"$f":"$F$7*$H$92","v":5.12},"è",0.04]
["11th",{"$f":"$B$7*$H$93","v":11.52},{"$f":"$C$7*$H$93","v":9.6},{"$f":"$D$7*$H$93","v":7.68},{"$f":"$E$7*$H$93","v":5.76},{"$f":"$F$7*$H$93","v":3.84},"è",0.03]
["12th",{"$f":"$B$7*$H$94","v":7.68},{"$f":"$C$7*$H$94","v":6.4},{"$f":"$D$7*$H$94","v":5.12},{"$f":"$E$7*$H$94","v":3.84},{"$f":"$F$7*$H$94","v":2.56},"è",0.02]
["Totals",{"$f":"SUM(B83:B94)","v":384},{"$f":"SUM(C83:C94)","v":320},{"$f":"SUM(D83:D94)","v":256},{"$f":"SUM(E83:E94)","v":192},{"$f":"SUM(F83:F94)","v":128},{"$f":"SUM(B95:F95)","v":1280},{"$f":"SUM(H83:H94)","v":1}]
[]
["For 667-1000 riders 15 places"]
["Placings","1D","2D","3D","4D","5D"]
["1st",{"$f":"$B$7*$H$99","v":69.12},{"$f":"$C$7*$H$99","v":57.599999999999994},{"$f":"$D$7*$H$99","v":46.08},{"$f":"$E$7*$H$99","v":34.56},{"$f":"$F$7*$H$99","v":23.04},"è",0.18]
["2nd",{"$f":"$B$7*$H$100","v":57.599999999999994},{"$f":"$C$7*$H$100","v":48},{"$f":"$D$7*$H$100","v":38.4},{"$f":"$E$7*$H$100","v":28.799999999999997},{"$f":"$F$7*$H$100","v":19.2},"è",0.15]
["3rd",{"$f":"$B$7*$H$101","v":46.08},{"$f":"$C$7*$H$101","v":38.4},{"$f":"$D$7*$H$101","v":30.72},{"$f":"$E$7*$H$101","v":23.04},{"$f":"$F$7*$H$101","v":15.36},"è",0.12]
["4th",{"$f":"$B$7*$H$102","v":38.400000000000006},{"$f":"$C$7*$H$102","v":32},{"$f":"$D$7*$H$102","v":25.6},{"$f":"$E$7*$H$102","v":19.200000000000003},{"$f":"$F$7*$H$102","v":12.8},"è",0.1]
["5th",{"$f":"$B$7*$H$103","v":32.64},{"$f":"$C$7*$H$103","v":27.200000000000003},{"$f":"$D$7*$H$103","v":21.76},{"$f":"$E$7*$H$103","v":16.32},{"$f":"$F$7*$H$103","v":10.88},"è",8.5000000000000006E-2]
["6th",{"$f":"$B$7*$H$104","v":26.880000000000003},{"$f":"$C$7*$H$104","v":22.400000000000002},{"$f":"$D$7*$H$104","v":17.920000000000002},{"$f":"$E$7*$H$104","v":13.440000000000001},{"$f":"$F$7*$H$104","v":8.9600000000000009},"è",7.0000000000000007E-2]
["7th",{"$f":"$B$7*$H$105","v":23.04},{"$f":"$C$7*$H$105","v":19.2},{"$f":"$D$7*$H$105","v":15.36},{"$f":"$E$7*$H$105","v":11.52},{"$f":"$F$7*$H$105","v":7.68},"è",0.06]
["8th",{"$f":"$B$7*$H$106","v":19.200000000000003},{"$f":"$C$7*$H$106","v":16},{"$f":"$D$7*$H$106","v":12.8},{"$f":"$E$7*$H$106","v":9.6000000000000014},{"$f":"$F$7*$H$106","v":6.4},"è",0.05]
["9th",{"$f":"$B$7*$H$107","v":16.32},{"$f":"$C$7*$H$107","v":13.600000000000001},{"$f":"$D$7*$H$107","v":10.88},{"$f":"$E$7*$H$107","v":8.16},{"$f":"$F$7*$H$107","v":5.44},"è",4.2500000000000003E-2]
["10th",{"$f":"$B$7*$H$108","v":13.440000000000001},{"$f":"$C$7*$H$108","v":11.200000000000001},{"$f":"$D$7*$H$108","v":8.9600000000000009},{"$f":"$E$7*$H$108","v":6.7200000000000006},{"$f":"$F$7*$H$108","v":4.4800000000000004},"è",3.5000000000000003E-2]
["11th",{"$f":"$B$7*$H$109","v":11.52},{"$f":"$C$7*$H$109","v":9.6},{"$f":"$D$7*$H$109","v":7.68},{"$f":"$E$7*$H$109","v":5.76},{"$f":"$F$7*$H$109","v":3.84},"è",0.03]
["12th",{"$f":"$B$7*$H$110","v":9.6000000000000014},{"$f":"$C$7*$H$110","v":8},{"$f":"$D$7*$H$110","v":6.4},{"$f":"$E$7*$H$110","v":4.8000000000000007},{"$f":"$F$7*$H$110","v":3.2},"è",2.5000000000000001E-2]
["13th",{"$f":"$B$7*$H$111","v":7.68},{"$f":"$C$7*$H$111","v":6.4},{"$f":"$D$7*$H$111","v":5.12},{"$f":"$E$7*$H$111","v":3.84},{"$f":"$F$7*$H$111","v":2.56},"è",0.02]
["14th",{"$f":"$B$7*$H$112","v":6.7200000000000006},{"$f":"$C$7*$H$112","v":5.6000000000000005},{"$f":"$D$7*$H$112","v":4.4800000000000004},{"$f":"$E$7*$H$112","v":3.3600000000000003},{"$f":"$F$7*$H$112","v":2.2400000000000002},"è",1.7500000000000002E-2]
["15th",{"$f":"$B$7*$H$113","v":5.76},{"$f":"$C$7*$H$113","v":4.8},{"$f":"$D$7*$H$113","v":3.84},{"$f":"$E$7*$H$113","v":2.88},{"$f":"$F$7*$H$113","v":1.92},"è",1.4999999999999999E-2]
["Totals",{"$f":"SUM(B99:B113)","v":384.00000000000006},{"$f":"SUM(C99:C113)","v":320},{"$f":"SUM(D99:D113)","v":256},{"$f":"SUM(E99:E113)","v":192.00000000000003},{"$f":"SUM(F99:F113)","v":128},{"$f":"SUM(B114:F114)","v":1280},{"$f":"SUM(H99:H113)","v":1}]
[]
["For 1001-1500 riders 20 places"]
["Placings","1D","2D","3D","4D","5D"]
["1st",{"$f":"$B$7*$H$118","v":53.760000000000005},{"$f":"$C$7*$H$118","v":44.800000000000004},{"$f":"$D$7*$H$118","v":35.840000000000003},{"$f":"$E$7*$H$118","v":26.880000000000003},{"$f":"$F$7*$H$118","v":17.920000000000002},"è",0.14000000000000001]
["2nd",{"$f":"$B$7*$H$119","v":42.24},{"$f":"$C$7*$H$119","v":35.200000000000003},{"$f":"$D$7*$H$119","v":28.16},{"$f":"$E$7*$H$119","v":21.12},{"$f":"$F$7*$H$119","v":14.08},"è",0.11]
["3rd",{"$f":"$B$7*$H$120","v":34.56},{"$f":"$C$7*$H$120","v":28.799999999999997},{"$f":"$D$7*$H$120","v":23.04},{"$f":"$E$7*$H$120","v":17.28},{"$f":"$F$7*$H$120","v":11.52},"è",0.09]
["4th",{"$f":"$B$7*$H$121","v":29.567999999999998},{"$f":"$C$7*$H$121","v":24.64},{"$f":"$D$7*$H$121","v":19.712},{"$f":"$E$7*$H$121","v":14.783999999999999},{"$f":"$F$7*$H$121","v":9.8559999999999999},"è",7.6999999999999999E-2]
["5th",{"$f":"$B$7*$H$122","v":26.880000000000003},{"$f":"$C$7*$H$122","v":22.400000000000002},{"$f":"$D$7*$H$122","v":17.920000000000002},{"$f":"$E$7*$H$122","v":13.440000000000001},{"$f":"$F$7*$H$122","v":8.9600000000000009},"è",7.0000000000000007E-2]
["6th",{"$f":"$B$7*$H$123","v":24.96},{"$f":"$C$7*$H$123","v":20.8},{"$f":"$D$7*$H$123","v":16.64},{"$f":"$E$7*$H$123","v":12.48},{"$f":"$F$7*$H$123","v":8.32},"è",6.5000000000000002E-2]
["7th",{"$f":"$B$7*$H$124","v":23.04},{"$f":"$C$7*$H$124","v":19.2},{"$f":"$D$7*$H$124","v":15.36},{"$f":"$E$7*$H$124","v":11.52},{"$f":"$F$7*$H$124","v":7.68},"è",0.06]
["8th",{"$f":"$B$7*$H$125","v":21.12},{"$f":"$C$7*$H$125","v":17.600000000000001},{"$f":"$D$7*$H$125","v":14.08},{"$f":"$E$7*$H$125","v":10.56},{"$f":"$F$7*$H$125","v":7.04},"è",5.5E-2]
["9th",{"$f":"$B$7*$H$126","v":19.200000000000003},{"$f":"$C$7*$H$126","v":16},{"$f":"$D$7*$H$126","v":12.8},{"$f":"$E$7*$H$126","v":9.6000000000000014},{"$f":"$F$7*$H$126","v":6.4},"è",0.05]
["10th",{"$f":"$B$7*$H$127","v":17.28},{"$f":"$C$7*$H$127","v":14.399999999999999},{"$f":"$D$7*$H$127","v":11.52},{"$f":"$E$7*$H$127","v":8.64},{"$f":"$F$7*$H$127","v":5.76},"è",4.4999999999999998E-2]
["11th",{"$f":"$B$7*$H$128","v":15.36},{"$f":"$C$7*$H$128","v":12.8},{"$f":"$D$7*$H$128","v":10.24},{"$f":"$E$7*$H$128","v":7.68},{"$f":"$F$7*$H$128","v":5.12},"è",0.04]
["12th",{"$f":"$B$7*$H$129","v":14.207999999999998},{"$f":"$C$7*$H$129","v":11.84},{"$f":"$D$7*$H$129","v":9.4719999999999995},{"$f":"$E$7*$H$129","v":7.1039999999999992},{"$f":"$F$7*$H$129","v":4.7359999999999998},"è",3.6999999999999998E-2]
["13th",{"$f":"$B$7*$H$130","v":12.672000000000001},{"$f":"$C$7*$H$130","v":10.56},{"$f":"$D$7*$H$130","v":8.4480000000000004},{"$f":"$E$7*$H$130","v":6.3360000000000003},{"$f":"$F$7*$H$130","v":4.2240000000000002},"è",3.3000000000000002E-2]
["14th",{"$f":"$B$7*$H$131","v":11.136000000000001},{"$f":"$C$7*$H$131","v":9.2800000000000011},{"$f":"$D$7*$H$131","v":7.4240000000000004},{"$f":"$E$7*$H$131","v":5.5680000000000005},{"$f":"$F$7*$H$131","v":3.7120000000000002},"è",2.9000000000000001E-2]
["15th",{"$f":"$B$7*$H$132","v":9.6000000000000014},{"$f":"$C$7*$H$132","v":8},{"$f":"$D$7*$H$132","v":6.4},{"$f":"$E$7*$H$132","v":4.8000000000000007},{"$f":"$F$7*$H$132","v":3.2},"è",2.5000000000000001E-2]
["16th",{"$f":"$B$7*$H$133","v":8.0640000000000001},{"$f":"$C$7*$H$133","v":6.7200000000000006},{"$f":"$D$7*$H$133","v":5.3760000000000003},{"$f":"$E$7*$H$133","v":4.032},{"$f":"$F$7*$H$133","v":2.6880000000000002},"è",2.1000000000000001E-2]
["17th",{"$f":"$B$7*$H$134","v":6.5280000000000005},{"$f":"$C$7*$H$134","v":5.44},{"$f":"$D$7*$H$134","v":4.3520000000000003},{"$f":"$E$7*$H$134","v":3.2640000000000002},{"$f":"$F$7*$H$134","v":2.1760000000000002},"è",1.7000000000000001E-2]
["18th",{"$f":"$B$7*$H$135","v":5.3760000000000003},{"$f":"$C$7*$H$135","v":4.4800000000000004},{"$f":"$D$7*$H$135","v":3.5840000000000001},{"$f":"$E$7*$H$135","v":2.6880000000000002},{"$f":"$F$7*$H$135","v":1.792},"è",1.4E-2]
["19th",{"$f":"$B$7*$H$136","v":4.6080000000000005},{"$f":"$C$7*$H$136","v":3.84},{"$f":"$D$7*$H$136","v":3.0720000000000001},{"$f":"$E$7*$H$136","v":2.3040000000000003},{"$f":"$F$7*$H$136","v":1.536},"è",1.2E-2]
["20th",{"$f":"$B$7*$H$137","v":3.84},{"$f":"$C$7*$H$137","v":3.2},{"$f":"$D$7*$H$137","v":2.56},{"$f":"$E$7*$H$137","v":1.92},{"$f":"$F$7*$H$137","v":1.28},"è",0.01]
["Totals",{"$f":"SUM(B118:B137)","v":384},{"$f":"SUM(C118:C137)","v":319.99999999999994},256.00000000000011,192,128.00000000000006,{"$f":"SUM(B138:F138)","v":1280},{"$f":"SUM(H118:H137)","v":1.0000000000000004}]
[]
["For 1501 or More riders 30 places"]
["Placings","1D","2D","3D","4D","5D"]
["1st",{"$f":"$B$7*$H142","v":46.08},{"$f":"$C$7*$H142","v":38.4},{"$f":"$D$7*$H142","v":30.72},{"$f":"$E$7*$H142","v":23.04},{"$f":"$F$7*$H142","v":15.36},"è",0.12]
["2nd",{"$f":"$B$7*$H143","v":36.480000000000004},30.4,24.32,18.240000000000002,12.16,"è",9.5000000000000001E-2]
["3rd",{"$f":"$B$7*$H144","v":28.031999999999996},23.36,18.687999999999999,14.015999999999998,9.3439999999999994,"è",7.2999999999999995E-2]
["4th",{"$f":"$B$7*$H145","v":23.808},19.84,15.872,11.904,7.9359999999999999,"è",6.2E-2]
["5th",19.200000000000003,16,12.8,9.6000000000000014,6.4,"è",0.05]
["6th",17.28,14.399999999999999,11.52,8.64,5.76,"è",4.4999999999999998E-2]
["7th",16.512,13.759999999999998,11.007999999999999,8.2560000000000002,5.5039999999999996,"è",4.2999999999999997E-2]
["8th",15.36,12.8,10.24,7.68,5.12,"è",0.04]
["9th",14.207999999999998,11.84,9.4719999999999995,7.1039999999999992,4.7359999999999998,"è",3.6999999999999998E-2]
["10th",13.440000000000001,11.200000000000001,8.9600000000000009,6.7200000000000006,4.4800000000000004,"è",3.5000000000000003E-2]
["11th",12.672000000000001,10.56,8.4480000000000004,6.3360000000000003,4.2240000000000002,"è",3.3000000000000002E-2]
["12th",11.904,9.92,7.9359999999999999,5.952,3.968,"è",3.1E-2]
["13th",11.136000000000001,9.2800000000000011,7.4240000000000004,5.5680000000000005,3.7120000000000002,"è",2.9000000000000001E-2]
["14th",10.368,8.64,6.9119999999999999,5.1840000000000002,3.456,"è",2.7E-2]
["15th",9.6000000000000014,8,6.4,4.8000000000000007,3.2,"è",2.5000000000000001E-2]
["16th",9.2160000000000011,7.68,6.1440000000000001,4.6080000000000005,3.0720000000000001,"è",2.4E-2]
["17th",8.8320000000000007,7.3599999999999994,5.8879999999999999,4.4160000000000004,2.944,"è",2.3E-2]
["18th",8.4480000000000004,7.0399999999999991,5.6319999999999997,4.2240000000000002,2.8159999999999998,"è",2.1999999999999999E-2]
["19th",8.0640000000000001,6.7200000000000006,5.3760000000000003,4.032,2.6880000000000002,"è",2.1000000000000001E-2]
["20th",7.68,6.4,5.12,3.84,2.56,"è",0.02]
["21st",7.2959999999999994,6.08,4.8639999999999999,3.6479999999999997,2.4319999999999999,"è",1.9E-2]
["22nd",6.911999999999999,5.76,4.6079999999999997,3.4559999999999995,2.3039999999999998,"è",1.7999999999999999E-2]
["23rd",6.5280000000000005,5.44,4.3520000000000003,3.2640000000000002,2.1760000000000002,"è",1.7000000000000001E-2]
["24th",6.1440000000000001,5.12,4.0960000000000001,3.0720000000000001,2.048,"è",1.6E-2]
["25th",5.76,4.8,3.84,2.88,1.92,"è",1.4999999999999999E-2]
["26th",5.3760000000000003,4.4800000000000004,3.5840000000000001,2.6880000000000002,1.792,"è",1.4E-2]
["27th",4.992,4.16,3.3279999999999998,2.496,1.6639999999999999,"è",1.2999999999999999E-2]
["28th",4.6080000000000005,3.84,3.0720000000000001,2.3040000000000003,1.536,"è",1.2E-2]
["29th",4.2240000000000002,3.5199999999999996,2.8159999999999998,2.1120000000000001,1.4079999999999999,"è",1.0999999999999999E-2]
["30th",3.84,3.2,2.56,1.92,1.28,"è",0.01]
["Totals",{"$f":"SUM(B142:B171)","v":384},{"$f":"SUM(C142:C171)","v":320},256.00000000000006,192,128.00000000000003,{"$f":"SUM(B172:F172)","v":1280},{"$f":"SUM(H142:H171)","v":1.0000000000000002}]

{"sheet":"DON'T TOUCH","index":17,"n_rows":6,"n_cols":5,"rows_kept":6,"cut":false,"hidden":true,"merged":[]}
[]
["Yes",null,"S",5,"X"]
[null,null,"A",10]
[null,null,"Y",15]
[null,null,"P","BP"]
[null,null,null,"SCR"]