{"text_format":"2","workbook":"xlsx","n_sheets":15,"sheets":["Open","Senior","Adult","Youth","Derby","High Stakes","Futurity","12 & Under","10&under","BFA 2D Payout","2D Payout","3D Payout","4D Payout BBR","5D Payout BBR","DON'T TOUCH"],"not_rendered":{"charts":0,"images":0,"macros":0,"external_links":0,"defined_names":6,"comments":0,"pivot_tables":0},"unopened":[],"bounds":{"document_bytes":16777216,"sheet_cells":100000,"run_cost":"one","rows_first":2000,"rows_last":500,"rows_between":2000,"halvings":0,"cell_chars":16384,"cell_head_chars":4096},"cells_cut":0,"cells_raw":0,"read":"whole","date_system":"1900"}

{"sheet":"Open","index":0,"n_rows":503,"n_cols":18,"rows_kept":503,"cut":false,"hidden":false,"merged":[[1,0,1,13],[0,0,0,13],[13,15,13,16],[15,15,15,16],[16,15,16,16],[2,15,2,16],[9,15,9,16],[10,15,10,16],[12,15,12,16]]}
[]
["Stone Oak Ranch $2000 Added Open"]
["FUT","DER","Age Inc","HS","Y/co","Youth","Draw","Rider Name","Horse Name","Pen","Time","Final Time","Placing","Money Earned",null,"D Placing",null,"Split"]
[{"$nulls":6},441,"Casey Mathis","SH Stylish and Sly",null,15.334,{"$f":"IF(OR(J4=5,J4=10, J4=15, J4=\"BP\",J4=\"SCR\"),\"NT\",K4)","v":15.334},"1D 1st",1232.28,null,"1D",15.334]
[null,null,null,"X",null,null,12,"Stevi Hillman","Quatro Fame",null,15.664999999999999,null,"1D 2nd",1056.24,null,"2D",{"$f":"SUM(Q4+0.5)","v":15.834},0.5]
[{"$nulls":6},206,"Schelli Creacy","Nico",null,15.709,null,"1D 3rd",880.19999999999993,null,"3D",{"$f":"SUM(Q4+1)","v":16.334},0.5]
[null,"X","A","X",null,null,51,"Cassidy Teague","Tres Socks",null,15.712,null,"1D 4th",704.16,null,"4D",{"$f":"SUM(Q4+1.5)","v":16.834},0.5]
[{"$nulls":6},426,"Kassie Mowry","CP He Will Be Epic",null,15.726000000000001,{"$f":"IF(OR(J8=5,J8=10, J8=15, J8=\"BP\",J8=\"SCR\"),\"NT\",K8)","v":15.726000000000001},"1D 5th",528.12,null,"5D",{"$f":"SUM(Q4+2)","v":17.334},0.5]
[null,"X",null,"X",null,null,52,"SHeaLynn McConnel","Smooth N Heavenly",null,15.731999999999999,null,"1D 6th",410.76000000000005]
[null,null,null,"X",null,null,274,"Caroline Kelly","Hesa Dashin Dreamer",null,15.742000000000001,null,"1D 7th",352.08,null,"# Entered"]
[{"$nulls":6},71,"Emma Abbott","Br Galsfrench hayday",null,15.768000000000001,null,"1D 8th",293.40000000000003,null,{"$f":"COUNTA(H4:H503)","v":445}]
[{"$nulls":4},"X","X",19,"Tristan Bowles","Short Okie Lena",null,15.804,null,"1D 9th",234.72]
[null,null,"A","X",null,null,276,"Andrea Busby","Famous Heartbreaker",null,15.821999999999999,null,"1D 10th tie",88,null,"# Ran"]
[{"$nulls":6},22,"Hallie Hanssen","Tres Movidas",null,15.821999999999999,null,"1D 10th tie",88,null,{"$f":"COUNTA(K4:K503)","v":445}]
[{"$nulls":6},427,"Molly Otto","Sixappeal",null,15.842000000000001,{"$f":"IF(OR(J15=5,J15=10, J15=15, J15=\"BP\",J15=\"SCR\"),\"NT\",K15)","v":15.842000000000001},"2D 1st",1026.8999999999999]
[{"$nulls":6},122,"Cassidy Champlin","Wood Bea French Girl",null,15.846,null,"2D 2nd",880,null,"# Left"]
[{"$nulls":6},359,"Ivy Hurst","JL Tularosa",null,15.852,null,"2D 3rd",733.5,null,{"$f":"$P$11-$P$14","v":0}]
[null,"X",{"$nulls":4},118,"Emma Abbott","Rr Too Slick Eye Mist",null,15.874000000000001,null,"2D 4th",586.79999999999995]
["X",{"$nulls":5},136,"Billie Ann Harmon","Famous Disco Bugs",null,15.885,null,"2D 5th",440.09999999999997]
[null,"X",{"$nulls":4},174,"Billie Ann Harmon","Me Flingin Diamonds",null,15.89,null,"2D 6th",342.3]
[null,null,"A","X",null,null,203,"Jimmie Smith","Marthas Bullion",null,15.891,null,"2D 7th",293.39999999999998]
[{"$nulls":6},348,"McKenzie Morgan","Infirewatershonor",null,15.901999999999999,null,"2D 8th",244.5]
[{"$nulls":6},279,"Andrea Long","Solomon",null,15.906000000000001,null,"2D 9th",195.6]
[{"$nulls":6},155,"Cassidy Champlin","Casadys Cash N Fame",null,15.911,null,"2D 10th",146.69999999999999]
[null,"X",{"$nulls":4},28,"Ryann Pedone","Streakers Queen",null,15.919]
[null,null,"A",null,null,null,303,"Joy Wargo","Cashin On The Bayou",null,15.948]
[null,null,"S",null,null,null,223,"Donna Kay Rule","High Valor",null,15.954000000000001]
[null,null,"S",null,null,null,212,"Martha Smith","Firewatermakemehappy",null,15.955]
[{"$nulls":6},246,"Lauren Howe","A Hero Spotted",null,15.971]
[{"$nulls":6},1,"Ryann Pedone","Streakin Queenie",null,15.996]
[null,"X",{"$nulls":4},81,"Brittany Pierson","CF Dash N Dirty",null,15.999000000000001]
[{"$nulls":6},69,"Wendy Suhn","Hes Just A fling",null,16]
[{"$nulls":6},347,"Kenzie Cook","Fletch N Flo",null,16.013000000000002]
[{"$nulls":6},247,"Nisa Berry","Luv That Cool Corona",null,16.021000000000001]
[{"$nulls":6},123,"Jimmie Smith","Guys Ima Bunny Cat",null,16.032]
[{"$nulls":6},97,"Emma Abbott","Hr Night Lingered On",null,16.052]
[{"$nulls":6},361,"Olivia Hodnett","Yella Izabella",null,16.07]
[{"$nulls":6},16,"Haley Thorne","No Holy Rollin",null,16.071000000000002]
[{"$nulls":6},228,"Savanna Morgan","Fairleas Star Date",null,16.071999999999999]
[null,null,"A",null,null,null,312,"Karri McKim","Firen Ta Fame",null,16.077999999999999]
[{"$nulls":6},451,"Molly Otto","No Lion Shes Flying",null,16.082000000000001,{"$f":"IF(OR(J41=5,J41=10, J41=15, J41=\"BP\",J41=\"SCR\"),\"NT\",K41)","v":16.082000000000001}]
[{"$nulls":6},227,"Sally Conway","Dashing Jetolena",null,16.085999999999999]
["X",{"$nulls":5},176,"Kelsey Treharne (Treehorn)","VQ Nonstop Stinson",null,16.096]
[null,null,"A",null,null,null,249,"Kinsey Chandler","Judge Knott",null,16.103000000000002]
[{"$nulls":6},423,"Shelbi Reynolds","Radar Cats Merada",null,16.109000000000002]
[{"$nulls":6},149,"Louis Paradis","Purrfect Choice",null,16.111000000000001]
[{"$nulls":6},452,"Kassie Mowry","Epic Guy",null,16.114000000000001,{"$f":"IF(OR(J47=5,J47=10, J47=15, J47=\"BP\",J47=\"SCR\"),\"NT\",K47)","v":16.114000000000001}]
[{"$nulls":6},354,"Shannon Pearson","Reds Roany Pony",null,16.128]
[{"$nulls":4},"X","X",406,"Emily Wilkins","Shake It For Tina",null,16.149000000000001,{"$f":"IF(OR(J49=5,J49=10, J49=15, J49=\"BP\",J49=\"SCR\"),\"NT\",K49)","v":16.149000000000001}]
[{"$nulls":6},125,"Cassidy Teague","Diva",null,16.151]
[{"$nulls":6},159,"Schelli Creacy","Blazin Superior",null,16.16]
[null,"X",{"$nulls":4},363,"Ashley Schafer","French Streaking Slew",null,16.166]
[{"$nulls":6},285,"Stephanie Harris","PJ Preacher Jones",null,16.178000000000001]
["X",{"$nulls":5},210,"Joy Wargo","Wildchildsgotcashuno",null,16.187999999999999]
["X",{"$nulls":5},153,"Kelsey Treharne (Treehorn)","Aintgotnothinonme",null,16.189]
[{"$nulls":6},151,"Jenna Napier","Frenchmans Dually",null,16.190999999999999]
["X",{"$nulls":5},236,"Stormi Pittman","Shake It Frenchman",null,16.2]
[null,null,"A",null,null,null,18,"Molly Steffen",null,null,16.2]
[{"$nulls":6},103,"Wendy Suhn","HLH Streakin A Fling",null,16.207000000000001]
[{"$nulls":6},425,"Halyn Lide","Hez Runnin Ta Heaven",null,16.209,{"$f":"IF(OR(J60=5,J60=10, J60=15, J60=\"BP\",J60=\"SCR\"),\"NT\",K60)","v":16.209}]
[null,"X",{"$nulls":4},146,"Lauren Strough","Dineros Spare Change",null,16.216000000000001]
[{"$nulls":6},382,"Maggie Carter","Dial Ta Fame",null,16.216000000000001]
[{"$nulls":6},93,"Cassidy Champlin","DG Excuse My French",null,16.222999999999999]
[null,null,"S",null,null,null,192,"Lisa Wernli","Flashs Fine Effort",null,16.224]
[{"$nulls":6},75,"Kylie Bowles","Miracle Christmas",null,16.234000000000002]
[{"$nulls":6},130,"Becky Dillard","Wow Shes Hot",null,16.234000000000002]
[{"$nulls":6},215,"Brianna Woodmansee","CC Fancy Lil Cowgirl",null,16.234000000000002]
[null,null,"S",null,null,null,317,"Louis Ferguson","Epic Two KS",null,16.239000000000001]
[null,null,"A",null,null,null,194,"Kylee Scribner","Badger A Conchadrift",null,16.248000000000001]
[{"$nulls":6},85,"Lainey Whitmire","Bullseye Bullion",null,16.254999999999999]
[{"$nulls":6},158,"Tristan Spivey","WR Perfect Cut",null,16.265000000000001]
[{"$nulls":4},"X","X",397,"Aspen Adams","Credit The Gin",null,16.265999999999998]
[{"$nulls":6},233,"Abigail Plants","Misbehaven Barbie",null,16.268999999999998]
[{"$nulls":6},345,"Kristel Ising","Miss Gray",null,16.27]
[{"$nulls":4},"X","X",181,"Emily Welch","Blazin Bay",null,16.274999999999999]
[null,"X",{"$nulls":4},386,"Ashley Schafer","Bobby McGee",null,16.277000000000001]
[{"$nulls":6},340,"Maggie Carter","Slick N Slide",null,16.280999999999999]
[{"$nulls":6},263,"Krista Whitley","Frenchmans Splash",null,16.283999999999999]
[null,null,"A",null,null,null,171,"Brooke Kelley","Nu Bueno Karma",null,16.285]
[{"$nulls":6},91,"Haley Thorne","Superflytoo",null,16.285]
[{"$nulls":6},65,"Lindsey McLeod","Blazin Hot Chick",null,16.298999999999999]
[{"$nulls":6},404,"Sunnie Thiberville","Rocker",null,16.309000000000001]
[{"$nulls":6},417,"Jessica Beauvais","Eyes Okie Dokie",null,16.309000000000001]
[{"$nulls":6},138,"McKenna Brown","Shesza Hottie Guys",null,16.309999999999999]
[{"$nulls":6},388,"Phillip Kenyon","Contagious Charm",null,16.329000000000001]
[{"$nulls":6},360,"Danica Hoppman","Lonaker",null,16.334,null,"3D 1st",821.52]
[{"$nulls":6},282,"Alicia Childers","Raygan",null,16.337,null,"3D 2nd",704.16]
[{"$nulls":6},62,"Misty Peek","Amos",null,16.343,null,"3D 3rd",586.79999999999995]
["X",{"$nulls":5},47,"Wyatt Paul","MJ Condo Cowboy",null,16.350000000000001,null,"3D 4th",469.44]
[null,null,"S",null,null,null,275,"Sherri Barnes","Racing For Perks",null,16.363,null,"3D 5th",352.08]
[{"$nulls":6},338,"Courtney Worthington","CM Bubblin Dynamite",null,16.364999999999998,null,"3D 6th",273.84000000000003]
[{"$nulls":4},"X","X",323,"Samantha Willoughby","Moose On The Loose",null,16.366,null,"3D 7th",234.72]
[null,null,"S",null,null,null,25,"Amy Swan","Boons Prescription",null,16.37,null,"3D 8th",195.60000000000002]
[{"$nulls":6},55,"Nisa Berry","Floriana",null,16.376000000000001,null,"3D 9th",156.47999999999999]
[{"$nulls":6},308,"Tori Volk","CN Holy Cow",null,16.376999999999999,null,"3D 10th",117.36]
["X",{"$nulls":5},61,"Kelsey Treharne (Treehorn)","Firewater Streakin",null,16.382000000000001]
[null,null,"S",null,null,null,234,"Lisa Wernli","Babe On The Run",null,16.387]
[{"$nulls":6},305,"Kortney Fisher","Stolin French Kisses",null,16.388999999999999]
[{"$nulls":4},"X","X",106,"Jolie Smith","Ms Hollywood Delight",null,16.396000000000001]
[{"$nulls":6},232,"Riley Fountain","Royal Dame Ta Fame",null,16.398]
[{"$nulls":6},358,"Maggie Carter","No Leadin Larry",null,16.402000000000001]
[{"$nulls":6},410,"Phillip Kenyon","Tillies Hayday",null,16.405000000000001,{"$f":"IF(OR(J102=5,J102=10, J102=15, J102=\"BP\",J102=\"SCR\"),\"NT\",K102)","v":16.405000000000001}]
[{"$nulls":6},429,"Lacy Billingsley","PV Watchmeneighneigh",null,16.407,{"$f":"IF(OR(J103=5,J103=10, J103=15, J103=\"BP\",J103=\"SCR\"),\"NT\",K103)","v":16.407}]
[{"$nulls":6},401,"Maggie Carter","GQH November Rain",null,16.414000000000001]
[{"$nulls":6},44,"Shelby Shackelford","RTF A Natural Stoli",null,16.414999999999999]
[{"$nulls":6},74,"Gena Franklin","SS Secret Six",null,16.417999999999999]
[{"$nulls":6},20,"Cheyenne Walling","Rocky",null,16.422000000000001]
[{"$nulls":6},428,"Maria Mannering","Moonshine",null,16.425000000000001,{"$f":"IF(OR(J108=5,J108=10, J108=15, J108=\"BP\",J108=\"SCR\"),\"NT\",K108)","v":16.425000000000001}]
["X",{"$nulls":5},172,"Abigail Plants","Playing In Traffic",null,16.428000000000001]
[{"$nulls":6},432,"Natalie Kurosky","Turn N With Ease",null,16.439,{"$f":"IF(OR(J110=5,J110=10, J110=15, J110=\"BP\",J110=\"SCR\"),\"NT\",K110)","v":16.439}]
[null,null,"S",null,null,null,265,"Jo Kirby","Heavenly Joak",null,16.446999999999999]
[{"$nulls":6},21,"Casey Hammons","BH Trip Ta Fame",null,16.452000000000002]
[{"$nulls":6},342,"Ivy Hurst","No Coolin This Jet",null,16.472999999999999]
[{"$nulls":6},353,"Janie Johnson","Peachy",null,16.48]
[{"$nulls":6},230,"Tallaney Clark","MR Tres A Bug",null,16.481000000000002]
[{"$nulls":6},143,"Jo Fisher","Fancy",null,16.486000000000001]
[{"$nulls":4},"X","X",180,"Hadley Durfey","Delightful Brownies",null,16.501000000000001]
[{"$nulls":6},434,"Janee Ornelas","Handsome",null,16.501000000000001,{"$f":"IF(OR(J118=5,J118=10, J118=15, J118=\"BP\",J118=\"SCR\"),\"NT\",K118)","v":16.501000000000001}]
["X",{"$nulls":5},248,"Kelsey Treharne (Treehorn)","VF Rosie Stinson",null,16.503]
[{"$nulls":6},257,"Billie Ann Harmon","Sheza Famous Bugs",null,16.504999999999999]
[null,"X",{"$nulls":4},438,"Phillip Kenyon","Make It A Mojito",null,16.506,{"$f":"IF(OR(J121=5,J121=10, J121=15, J121=\"BP\",J121=\"SCR\"),\"NT\",K121)","v":16.506}]
[{"$nulls":6},408,"Ashley Schafer","Famous Streakin Guy",null,16.509,{"$f":"IF(OR(J122=5,J122=10, J122=15, J122=\"BP\",J122=\"SCR\"),\"NT\",K122)","v":16.509}]
["X",{"$nulls":5},17,"Kylie Bowles","Slick A Lena",null,16.518999999999998]
["X",{"$nulls":5},163,"Ben McDonnell","AJ Shakeitlike Elvis",null,16.518999999999998]
[null,"X",{"$nulls":4},261,"Savanna Morgan","Bout To Get Reckless",null,16.523]
["X",{"$nulls":5},95,"Billie Ann Harmon","Zero Judgement",null,16.527999999999999]
[{"$nulls":6},185,"Fallon Forbes","Another Bug Leo",null,16.529]
[{"$nulls":6},356,"Nicki Zimmerman","Queenie",null,16.533000000000001]
[{"$nulls":6},98,"Wyatt Paul","Try For First",null,16.536000000000001]
["X",{"$nulls":5},99,"Ryann Pedone","Kool Rocket Man",null,16.539000000000001]
["X",{"$nulls":5},200,"Kelsey Treharne (Treehorn)","VF Silver Design",null,16.541]
[{"$nulls":6},226,"Jessica McRae","Ruby",null,16.550999999999998]
[{"$nulls":4},"X","X",262,"Grace Gardiner","Eye On Fame",null,16.555]
[{"$nulls":6},4,"Sara Redden","Pedro",null,16.565000000000001]
["X",null,"A",null,null,null,365,"Whitney Godinez","Chilla On The Rocks",null,16.577999999999999]
[{"$nulls":6},58,"Jade Crago","Nitros Next Topmodel",null,16.585000000000001]
[{"$nulls":6},355,"Tori Morris","Oscar",null,16.594999999999999]
[{"$nulls":6},191,"Tristan Spivey","Peppys Hot Spice",null,16.613]
[{"$nulls":4},"X","X",229,"Grace Gardiner","Firewater Kool Eyes",null,16.620999999999999]
[{"$nulls":6},366,"Brooke Bailey","Crown Royal Rona",null,16.622]
["X",{"$nulls":5},199,"Stormi Pittman","Bar S Streaking Taz",null,16.623000000000001]
["X",{"$nulls":5},26,"Wendy Suhn","Jess B Gone",null,16.628]
[{"$nulls":6},88,"Cassidy Thomas","Shiftwell",null,16.64]
[{"$nulls":6},100,"Maggie Carter","Miss Inapropriate",null,16.646000000000001]
["X",{"$nulls":5},53,"Haley Thorne","Superflyandfamous",null,16.652999999999999]
[{"$nulls":6},331,"Brooke Hickey","Another French Boy",null,16.66]
[{"$nulls":6},392,"Rudie Hepper",null,null,16.672000000000001]
["X",{"$nulls":5},37,"Kelsey Treharne (Treehorn)","The First Lady",null,16.673999999999999]
[{"$nulls":6},73,"Sydney Swatsell","Feature Me Firin",null,16.684999999999999]
[{"$nulls":6},31,"Tillar Murray","JL Lava Roc",null,16.689]
[null,null,"A",null,null,null,170,"Cierra Chapman","Ginger",null,16.704999999999998]
[{"$nulls":6},119,"Jenna Napier","Joselina",null,16.704999999999998]
["X",{"$nulls":5},224,"Kelsey Treharne (Treehorn)","VF Wheely Cool",null,16.718]
[{"$nulls":6},322,"Cheyenne Lange","The+I379e Running Rebel",null,16.734999999999999]
[{"$nulls":4},"X","X",148,"McKenzie Jo Brown","Jae Supreme Lena",null,16.754000000000001]
[{"$nulls":6},23,"Emma Abbott","First Down Nicky",null,16.774000000000001]
[{"$nulls":6},313,"Sarah Rau","MV Famous Margarita",null,16.777000000000001]
[{"$nulls":6},105,"McKenna Brown","Done Too Suen",null,16.780999999999999]
[{"$nulls":4},"X","X",300,"Torie Bush","Total Co Motion",null,16.792000000000002]
[{"$nulls":6},374,"Mary Sanders","Firewater Delux",null,16.798999999999999]
[null,null,"A",null,null,null,197,"Jessica Mullins","Doc Eyed Fame",null,16.800999999999998]
[{"$nulls":6},133,"Kristi Smith","Lectronic Boomernic",null,16.817]
[{"$nulls":4},"X","X",250,"Samantha Willoughby","Fabulous Twister",null,16.824999999999999]
[{"$nulls":6},56,"Nikki Morrison","Shining For The Boys",null,16.827000000000002]
[{"$nulls":4},"X","X",281,"Laurel Allred","Quicks Blue Peppy",null,16.835000000000001,null,"4D 1st",616.14]
[{"$nulls":6},169,"Michaela Robertson","EZ On The Dynamite",null,16.838999999999999,null,"4D 2nd",528.12]
["X",{"$nulls":5},243,"Joy Wargo","Starrin Baby Rose",null,16.847999999999999,null,"4D 3rd",440.09999999999997]
["X",{"$nulls":5},183,"Lauren Strough","Drifting For Dineros",null,16.853000000000002,null,"4D 4th",352.08]
["X",{"$nulls":5},201,"Abigail Plants","KN Baileys Sidecar",null,16.861000000000001,null,"4D 5th",264.06]
[{"$nulls":5},"X",369,"Kimberlee Littlejohn","ICR Painted Chex",null,16.87,null,"4D 6th",205.38000000000002]
[{"$nulls":6},30,"Sydney Swatsell","Smalls",null,16.873999999999999,null,"4D 7th",176.04]
[{"$nulls":4},"X","X",286,"Samantha Willoughby","Cash ",null,16.878,null,"4D 8th",146.70000000000002]
[{"$nulls":6},270,"Gina Hill","BF Makin It Happen",null,16.882000000000001,null,"4D 9th",117.36]
[null,null,"S",null,null,null,5,"Karen Hancock","Just Anotherstreak",null,16.893000000000001,null,"4D 10th",88.02]
[{"$nulls":6},129,"Cassidy Thomas","Ladys Moon Fire",null,16.899000000000001]
[null,null,"S",null,null,null,27,"Lisa Corey","Beda Dream",null,16.904]
[{"$nulls":6},184,"Hanna Trimber","Eye Jess Zoomed Bye",null,16.907]
[null,"X","A",null,null,null,164,"Jessica Mullins","Kakunamatadi",null,16.911000000000001]
[{"$nulls":4},"X","X",437,"Emily Wilkins","Stickin Ta Fame",null,16.925999999999998,{"$f":"IF(OR(J179=5,J179=10, J179=15, J179=\"BP\",J179=\"SCR\"),\"NT\",K179)","v":16.925999999999998}]
[{"$nulls":6},220,"Hollie Sirman","Easter Bunny Special",null,16.945]
[{"$nulls":6},343,"Jesse Jaureguito","Foxx Me",null,16.95]
[{"$nulls":4},"X","X",160,"Jolie Smith","Bartender Nics",null,16.956]
[{"$nulls":6},7,"Lisa Jo Velliquette","Namgis D 44",null,16.966999999999999]
[{"$nulls":6},49,"Emma Abbott","RR Yawanna Peasa Dis",null,16.97]
[{"$nulls":6},259,"Allie Zant","Dbsweetnsmooth",null,16.998999999999999]
[{"$nulls":4},"X","X",79,"Kimberly Steffen","Frosted Country",null,17]
[{"$nulls":6},294,"Brooke Hickey","Shes Flyin High Guys",null,17.006]
[{"$nulls":6},333,"Lauren Howe","Shiner",null,17.007999999999999]
[{"$nulls":6},120,"Haley Thorne","Superfly ",null,17.016999999999999]
[{"$nulls":6},268,"Jackie Hartt","Storm To Honor",null,17.024000000000001]
[{"$nulls":6},385,"Alex Hall","Rocket Star Boy",null,17.024999999999999]
["X",{"$nulls":5},139,"Abigail Plants","KN Stopbuginmebailey",null,17.036999999999999]
[{"$nulls":6},421,"Ava Corey","Simi Sioux",null,17.039000000000001]
[{"$nulls":6},217,"Hanna Trimber","Eye Jess Win",null,17.045000000000002]
[{"$nulls":6},96,"Michaela Robertson","CM Platinum Dondi",null,17.056999999999999]
[{"$nulls":6},375,"Tiffany Davis","Sticks Up For The Dr",null,17.056999999999999]
[{"$nulls":4},"X","X",439,"Katy Barrett","Breeze Of Sonitalena",null,17.062000000000001,{"$f":"IF(OR(J197=5,J197=10, J197=15, J197=\"BP\",J197=\"SCR\"),\"NT\",K197)","v":17.062000000000001}]
[{"$nulls":6},124,"Lexi Peaden","Shelby Turns EZ",null,17.062999999999999]
[{"$nulls":4},"X","X",264,"Raedyn Brown","Booger Texas Style",null,17.073]
[{"$nulls":6},346,"Kandace Bussell","Circlebar Rare Bug",null,17.079000000000001]
[{"$nulls":6},144,"Christi Durfey","Camo",null,17.094000000000001]
[null,null,"S",null,null,null,351,"Jolene Jones","Peppys Streak of Fame",null,17.096]
[{"$nulls":6},307,"Caroline Kelly","Heavenly déjà vu",null,17.096]
[null,null,"A",null,null,null,145,"Lauren Whitmire","WR Famous Amigo",null,17.099]
["X",{"$nulls":5},77,"Ryann Pedone","Sweet Steven",null,17.102]
[{"$nulls":6},449,"Ava Corey","Hottie",null,17.123999999999999,{"$f":"IF(OR(J206=5,J206=10, J206=15, J206=\"BP\",J206=\"SCR\"),\"NT\",K206)","v":17.123999999999999}]
[{"$nulls":4},"X","X",403,"Makayla Kiser","Bell",null,17.135000000000002]
[{"$nulls":6},450,"Alysha Benitez","GCH Dash To The Sun",null,17.135000000000002,{"$f":"IF(OR(J208=5,J208=10, J208=15, J208=\"BP\",J208=\"SCR\"),\"NT\",K208)","v":17.135000000000002}]
[null,null,"A",null,null,null,273,"Crystal Allred","No Berry Just A Jewel",null,17.137]
[{"$nulls":6},13,"Nikki Morrison","Bodacious Biankus",null,17.137]
[{"$nulls":6},78,"Shelby Shackelford","Sterling Tax",null,17.137]
[{"$nulls":6},10,"Kelsey Treharne (Treehorn)","Bobby Z Dual",null,17.141999999999999]
[{"$nulls":6},107,"Cassidy Thomas","TCR A Classic Cutter",null,17.175000000000001]
[{"$nulls":6},38,"Gena Franklin","SS Streaky Me",null,17.2]
[{"$nulls":6},255,"Anisa Coates","Blazin Nike",null,17.218]
[{"$nulls":6},126,"Jade Crago","CM Nitros Kruser",null,17.253]
[{"$nulls":4},"X","X",240,"Laurel Allred","Rocket Bingoman",null,17.259]
[null,null,"A",null,null,null,278,"LeAnne Turney","Dun It With Jac",null,17.260999999999999]
[{"$nulls":6},156,"Nancy Ainsley","Hez A Hopefully",null,17.260999999999999]
[null,null,"S",null,null,null,189,"Patti Reardon","HeCOme Dun",null,17.265000000000001]
[{"$nulls":6},214,"Vicky Chauvette","Sweet Perky Bug",null,17.277999999999999]
[{"$nulls":4},"X","X",368,"Makayla Kiser","Huckleberry",null,17.280999999999999]
[{"$nulls":4},"X","X",43,"Kimberly Steffen","DJ Chicolena Katie",null,17.288]
[{"$nulls":6},329,"Christi Orr","Reload",null,17.29]
[{"$nulls":6},377,"Teneille Angland","KN Famous Ever After",null,17.295999999999999]
[{"$nulls":6},325,"Ella Burch","Red",null,17.303000000000001]
["X",{"$nulls":5},101,"Louis Paradis","All U Need Is Speed",null,17.346,null,"5D 1st",410.76]
[{"$nulls":4},"X","X",418,"Trinity Joiner","Highonbrownwhiskey",null,17.347999999999999,null,"5D 2nd",352.08]
[{"$nulls":4},"X","X",147,"Hadley Durfey","One Smooth Kelly",null,17.350999999999999,null,"5D 3rd",293.39999999999998]
[{"$nulls":6},258,"Layton Tishman","China Grove",null,17.353999999999999,null,"5D 4th",234.72]
[{"$nulls":6},350,"Blair Aaron","Driftin Gipsy",null,17.355,null,"5D 5th",176.04]
[{"$nulls":6},128,"Jessie King","Happy To Be Streakin",null,17.36,null,"5D 6th",136.92000000000002]
[null,null,"S",null,null,null,235,"Chris Boyer","Unzippinlikeastreaker",null,17.364000000000001,null,"5D 7th",117.36]
["X",null,"A",null,null,null,154,"Kaylyn Smith","Bet She Can Fly",null,17.366,null,"5D 8th",97.800000000000011]
[{"$nulls":6},48,"Tiffany Durham","Midge Ridge",null,17.388999999999999,null,"5D 9th",78.239999999999995]
[{"$nulls":6},412,"Liz Gunderson","Spinnin Cookies",null,17.395,{"$f":"IF(OR(J236=5,J236=10, J236=15, J236=\"BP\",J236=\"SCR\"),\"NT\",K236)","v":17.395},"5D 10th",58.68]
[null,null,"S",null,null,null,102,"Kathy Cribbs","Playboys Arrow",null,17.401]
[{"$nulls":4},"X","X",204,"Sterling Hopkins","Bling",null,17.407]
["X",{"$nulls":5},196,"Riley Fountain","Dixee Land Delight",null,17.411999999999999]
[null,"X",{"$nulls":4},173,"Tiffany Lujan","VF Designer Pants",null,17.413]
[{"$nulls":6},395,"Alexis Barfield","Quick",null,17.462]
[{"$nulls":6},121,"Christi Orr","Tazer",null,17.488]
["X",{"$nulls":5},225,"Lauren Strough","Marthas Slick Moons",null,17.489999999999998]
[{"$nulls":6},330,"Krista Whitley","Apieceoffame",null,17.497]
[{"$nulls":6},57,"Cooper Peek","Dolly",null,17.503]
[{"$nulls":6},260,"Camie Hastings","AP Sierra",null,17.504000000000001]
[{"$nulls":6},182,"Christi Durfey","One Of A Kind Guy",null,17.521000000000001]
[{"$nulls":6},324,"Tammmy Hickey","Guyz Yellow Rose",null,17.529]
[{"$nulls":6},389,"Rylee Hardin","Splash",null,17.53]
[null,null,"A",null,null,null,299,"Angelia Kerkhoff","Im A Dashing Star",null,17.550999999999998]
[{"$nulls":6},431,"Betina Felton","Dashing Darby",null,17.552,{"$f":"IF(OR(J251=5,J251=10, J251=15, J251=\"BP\",J251=\"SCR\"),\"NT\",K251)","v":17.552}]
[{"$nulls":6},132,"Michaela Robertson","RSR Guys Speed Com",null,17.562000000000001]
[null,null,"A",null,null,null,46,"Emily Greer","Elvis",null,17.573]
[{"$nulls":6},83,"Spring Alexander","Legend",null,17.585000000000001]
[{"$nulls":6},187,"Jade Crago","Boss Superfrost",null,17.591999999999999]
["X",{"$nulls":5},231,"Jackie Hartt","RP Dashin Star",null,17.606000000000002]
[{"$nulls":6},3,"Lylan Corey","A Royal Firewater",null,17.61]
[null,null,"A",null,null,null,344,"Richard Moore","Miss Thing",null,17.634]
[{"$nulls":4},"X","X",142,"Madelyn Taylor","Specks Boston Velvet",null,17.637]
[null,null,"A",null,null,null,110,"Michaela Robertson","Shes Cartel Streakin",null,17.655000000000001]
[{"$nulls":6},384,"Danica Hoppman","One Smooth Savage",null,17.664000000000001]
[{"$nulls":6},383,"Nicki Zimmerman","Talent and Charm",null,17.690000000000001]
[{"$nulls":6},332,"Blake Myers","Luvondarocks",null,17.713999999999999]
[{"$nulls":6},209,"LeAnn Wills","ShootYeahShesSassy",null,17.734000000000002]
[{"$nulls":6},39,"Bill Barber","Tyke",null,17.739999999999998]
[{"$nulls":4},"X","X",35,"Madeleine Moll","Vibrant Stylish Chic",null,17.742999999999999]
[{"$nulls":6},415,"Emily Necaise","Famous Bling Bling",null,17.747]
[{"$nulls":4},"X","X",6,"Addison Steed","Commander",null,17.748000000000001]
[{"$nulls":6},117,"Kylena Hager","The Savoy Express",null,17.759]
[{"$nulls":6},314,"Maddie Thompson","JKL Six Tiny Alibis",null,17.805]
[{"$nulls":6},372,"McKenzie Morgan","KC Frosted Fortune",null,17.82]
[{"$nulls":6},284,"Sage Tomeu","Stella",null,17.824000000000002]
[{"$nulls":4},"X","X",86,"Madeleine Moll","Gear'Em Up Nic",null,17.856000000000002]
[{"$nulls":6},267,"Lauren Howe","Pop Feature",null,17.882000000000001]
[null,null,"A",null,null,null,14,"Emily Greer","TF Speedywood Dyna",null,17.902000000000001]
[{"$nulls":6},424,"Alysha Benitez","Bugn For a Frenchkiss",null,17.902000000000001]
[{"$nulls":6},380,"Grace Karolczuk","Kool Toys",null,17.908999999999999]
[null,null,"A",null,null,null,405,"Christy Brower","SH Im A Fighter",null,17.945]
[{"$nulls":6},419,"Glenda Barnett","Ready Set Go Girl",null,17.978999999999999]
["X",{"$nulls":5},416,"Shelby Scott","RJ Miss Gracie Gal",null,17.984999999999999]
[{"$nulls":4},"X","X",319,"Walter Wolf","Liberty",null,18.042999999999999]
[{"$nulls":6},188,"Colt Tew","Smooth Move Ta Heaven",null,18.082999999999998]
["X",{"$nulls":5},24,"Jade Crago","Trust Your Journey",null,18.129000000000001]
[{"$nulls":6},277,"Hollie Sirman","Quick Boogie",null,18.16]
["X",{"$nulls":5},87,"Kelsey Treharne (Treehorn)","A Legendary Fling",null,18.234000000000002]
[null,"X",{"$nulls":4},211,"Tiffany Lujan","Chase My Ace",null,18.242999999999999]
[null,null,"A",null,null,null,9,"Jana Brothers","Our Kinda Tuff",null,18.245000000000001]
[null,null,"A",null,null,null,376,"Christy Brower","Miss Regal Memories",null,18.263000000000002]
[{"$nulls":6},292,"Anisa Coates","Confederate Promise",null,18.373999999999999]
[{"$nulls":6},104,"Emily Collup","Otoes Playboy Candy",null,18.414999999999999]
[{"$nulls":6},244,"Mandi Boychuk","Barbie Bok",null,18.541]
[{"$nulls":6},409,"Annabelle Martin","Posh",null,18.649999999999999,{"$f":"IF(OR(J292=5,J292=10, J292=15, J292=\"BP\",J292=\"SCR\"),\"NT\",K292)","v":18.649999999999999}]
[{"$nulls":6},178,"Stormi Branch",null,null,18.7]
[{"$nulls":6},195,"Alyssa Urbanek","Pride N Power",null,18.744]
[{"$nulls":6},177,"Wendie Bodkin","Bunny Chex Tradition",null,18.751999999999999]
[{"$nulls":6},436,"Rylee Hardin","Yeezy",null,18.856999999999999,{"$f":"IF(OR(J296=5,J296=10, J296=15, J296=\"BP\",J296=\"SCR\"),\"NT\",K296)","v":18.856999999999999}]
[null,null,"S",null,null,null,251,"Simone Elmore","Mighty Moondash",null,19.114000000000001]
[{"$nulls":6},290,"ShaeLynn Hazalwusb","Struttineffortlessly",null,19.167999999999999]
[{"$nulls":6},399,"Heather Glover","Peps Diamond Hickory",null,19.318000000000001]
[{"$nulls":6},311,"Ashley Gowens","Big Booty Judy",null,19.847999999999999]
[null,null,"S",null,null,null,309,"Jolene Jones","Capone",null,19.98]
[{"$nulls":6},316,"Josie Gillespie","Nashville",null,19.983000000000001]
[{"$nulls":6},76,"Chaney Akin","Sunny",null,21.975999999999999]
[{"$nulls":6},297,"Camie Hastings","Annies First Corona",null,22.207999999999998]
[{"$nulls":6},72,"Linda Hunter","Firebug Special",null,22.506]
["X",null,"S",null,null,null,337,"Jolene Jones","Perks Fame Aint Easy",null,"broken"]
["X",{"$nulls":5},271,"Kelsey Treharne (Treehorn)","VF Wishbone Red",null,"broken"]
[null,null,"A",null,null,null,241,"Cierra Chapman","Sun In Fun",null,"broken"]
[null,null,"S",null,null,null,11,"Trina Murray","Fuel For Dash",null,"broken"]
[null,null,"S",null,null,null,40,"Trina Murray","Dirty Dan Stinson",null,"broken"]
[null,null,"S",null,null,null,175,"Martha Smith","My Epic Moment",null,"broken"]
[{"$nulls":5},"X",370,"Lili Weaver","Hard Knock Life",null,"broken"]
[{"$nulls":6},45,"Brittney Barnett","Frenchmans Pick",null,"broken"]
[{"$nulls":6},288,"Lauren Howe","Aggie Streaking",null,"broken"]
[{"$nulls":6},298,"Rebeca Hazaleus","Ms Foxyfire",null,"broken"]
[{"$nulls":6},310,"Lauren Howe","Chex",null,"broken"]
[{"$nulls":6},379,"Victoria Covert","Cap ",null,"broken"]
[{"$nulls":6},391,"Kristel Bragg","Dry Fork Little Miss",null,"broken"]
[{"$nulls":6},422,"Callie Schaffner","Docs Bar Bay Too Bee",null,"broken"]
[{"$nulls":6},252,"Fallon Forbes","Cantina Rascal",null,"nt"]
[{"$nulls":4},"X","X",238,"Caleb Cline","Guys Dashing Jet",null,"nt15.796"]
[{"$nulls":4},"X","X",378,"Emily Wilkins","Chasin Easy Money",null,"nt15.859"]
[null,null,"A",null,null,null,280,"Kristin Shoppa","JW Freeze Fame",null,"nt15.938"]
[{"$nulls":6},207,"Dale Long","Rare Packin Six",null,"nt15.960"]
[null,"X",{"$nulls":4},36,"Stevi Hillman","DTF Texas Moon",null,"nt15.967"]
[null,null,"A",null,null,null,373,"Sunnie Thiberville","TJ",null,"nt15.969"]
[{"$nulls":6},327,"Bugg Beeler","First Famous Chic",null,"nt15.987"]
[{"$nulls":6},393,"Ashley Alligood","RB Bullys Indian Outlaw",null,"nt15.992"]
[null,null,"A",null,null,null,89,"Lauren Whitmire","Fame Rox",null,"nt16.006"]
[{"$nulls":6},326,"Cadee Williams","Smooth My Credit",null,"nt16.011"]
[{"$nulls":6},59,"Lindsay Bullard","First Down Deception",null,"nt16.013"]
[{"$nulls":6},29,"Shelby McCamey","Cuz Im French",null,"nt16.020"]
[null,null,"A","X",null,null,237,"Alyssa Urbanek","Fueled With Dinero",null,"nt16.048"]
[{"$nulls":6},90,"SHeaLynn McConnel","Louie Bug",null,"nt16.057"]
[{"$nulls":6},381,"Kristel Ising","Carlos",null,"nt16.060"]
[{"$nulls":6},362,"Kaitlin Anderson","Livin For Happy Hour",null,"nt16.092"]
[{"$nulls":6},60,"Tillar Murray","JL Fourtafame",null,"nt16.122"]
[null,"X","S",null,null,null,32,"Martha Jordan","MV Fury Of The Fame",null,"nt16.128"]
[null,null,"A","X",null,null,179,"Jimmie Smith","Lever Action",null,"nt16.129"]
[{"$nulls":6},318,"Ivy Hurst","Top of the Roc",null,"nt16.142"]
[{"$nulls":6},67,"Denny Ralls","SV Southern Comfort",null,"nt16.144"]
[{"$nulls":6},339,"Nicki Zimmerman","Prime Gold",null,"nt16.146"]
[{"$nulls":4},"X","X",256,"Brianna Woodmansee","AH Mias Cowboy",null,"nt16.156"]
[null,null,"S",null,null,null,221,"Tammy Rokus","Mitey Confederate",null,"nt16.167"]
[{"$nulls":6},387,"Janie Johnson","Popeye",null,"nt16.172"]
[{"$nulls":6},245,"Dale Long","Blazin Blurry Fame",null,"nt16.178"]
[{"$nulls":6},253,"Dakota Danley","Eddie BJ",null,"nt16.186"]
[{"$nulls":6},109,"Traci Nelson","The Cat Dun It",null,"nt16.215"]
[null,null,"A",null,null,null,66,"Rylee Leach","NMB Chesterslilbunny",null,"nt16.217"]
[null,null,"A",null,null,null,396,"Anna Johnson","Famous Resurection",null,"nt16.233"]
[{"$nulls":6},242,"Tallaney Clark","Return A Fortune",null,"nt16.270"]
[{"$nulls":6},190,"Sally Conway","Haydaysdashinfashion",null,"nt16.299"]
[{"$nulls":6},304,"Erika Ashley","Mitzi Would",null,"nt16.326"]
[null,null,"A",null,null,null,321,"Kristin Shoppa","JW MizGuyded",null,"nt16.330"]
["X",{"$nulls":5},108,"Kelsey Treharne (Treehorn)","TR Lying Badger",null,"nt16.339"]
[{"$nulls":4},"X","X",293,"Grace Gardiner","Firewater Guy",null,"nt16.346"]
[{"$nulls":6},33,"Lindsey McLeod","Rockette Scientist",null,"nt16.356"]
[null,"X",{"$nulls":4},296,"Krista Whitley","Fabulace Fame",null,"nt16.373"]
[{"$nulls":6},394,"Jenna Graf","Runaway Traffic Train",null,"nt16.375"]
[null,"X",{"$nulls":4},168,"Nisa Berry","A Kings Fmaous Fling",null,"nt16.388"]
[{"$nulls":6},82,"Becky Dillard","Shesa Hot Loop",null,"nt16.395"]
[{"$nulls":6},15,"Jaylan Clary",null,null,"nt16.435"]
[null,null,"A",null,null,null,208,"Cierra Chapman","Lil Blushing Blonde",null,"nt16.466"]
[null,"X",{"$nulls":4},433,"Jamie Olsen","Miss Famous Beduino",null,"nt16.474",{"$f":"IF(OR(J364=5,J364=10, J364=15, J364=\"BP\",J364=\"SCR\"),\"NT\",K364)","v":"nt16.474"}]
[{"$nulls":6},162,"Hannah Hertel","Lenasdashtovictory",null,"nt16.491"]
[null,"X",{"$nulls":4},213,"Christi Durfey","Jess Blazin Otoe",null,"nt16.493"]
[{"$nulls":6},390,"Amy Riley","The Grey Goose",null,"nt16.497"]
[{"$nulls":6},218,"Billie Ann Harmon","Secret Ta Heaven",null,"nt16.500"]
[{"$nulls":6},111,"Jo Fisher","Angel",null,"nt16.505"]
[{"$nulls":6},411,"Rylee Hardin","Fro",null,"nt16.524"]
[{"$nulls":6},420,"Jackie Dalchow","Dez",null,"nt16.538"]
[null,"X",{"$nulls":4},42,"Brittany Pierson","Guyko",null,"nt16.550"]
[{"$nulls":4},"X","X",219,"Josie Hartmann","Hes Honor",null,"nt16.564"]
[{"$nulls":6},283,"Sarah Rau","Her Perks R On Fire",null,"nt16.567"]
[{"$nulls":6},398,"Brooke Pierce","Son Of A Gun",null,"nt16.593"]
[{"$nulls":6},157,"Shannon Black","MR Rambo Remedy",null,"nt16.609"]
[{"$nulls":6},2,"Lindsey McLeod","Jets Famous Lady",null,"nt16.611"]
[{"$nulls":6},216,"Fallon Forbes","Perksontherocks",null,"nt16.631"]
[{"$nulls":6},357,"Courtney Worthington","CM Bubblin Barbie",null,"nt16.648"]
[{"$nulls":4},"X","X",70,"Kate Neill","Dox Maga Magnolia",null,"nt16.683"]
[{"$nulls":6},287,"Dakota Danley","Erins Last Fame",null,"nt16.706"]
[{"$nulls":6},152,"Cassidy Thomas","MC Miss Windy",null,"nt16.724"]
[{"$nulls":6},407,"Victoria Covert","Cowboy",null,"nt16.724",{"$f":"IF(OR(J383=5,J383=10, J383=15, J383=\"BP\",J383=\"SCR\"),\"NT\",K383)","v":"nt16.724"}]
[{"$nulls":6},94,"Tiffany Durham","Dual Reys Win Money",null,"nt16.726"]
[{"$nulls":6},63,"Jana Kurosky","Winnies Red Kai",null,"nt16.737"]
[{"$nulls":6},291,"Bugg Beeler","This Fling Is Famous",null,"nt16.738"]
[{"$nulls":6},402,"Danica Hoppman","Play It Boon",null,"nt16.767"]
[{"$nulls":6},413,"Sherry Alligood","Peppy Cherokee King",null,"nt16.804"]
[{"$nulls":6},34,"Madison Ward","Fitz On A Bridge",null,"nt16.833"]
[{"$nulls":6},80,"Jessie King","Sophie So Sweet",null,"nt16.834"]
["X",{"$nulls":5},272,"Joy Wargo","JL Hot Rocs",null,"nt16.869"]
[{"$nulls":6},289,"Kylie Munson","Famous Irish Moon",null,"nt16.876"]
[{"$nulls":6},341,"Kortney Fisher","Guys Got It Easy",null,"nt16.892"]
[{"$nulls":6},134,"Kelsey Treharne (Treehorn)","Lily",null,"nt16.922"]
[null,null,null,"X",null,null,448,"Rylee Hardin","Tiffany",null,"nt16.936",{"$f":"IF(OR(J395=5,J395=10, J395=15, J395=\"BP\",J395=\"SCR\"),\"NT\",K395)","v":"nt16.936"}]
[{"$nulls":6},141,"Jessica Dunbar","JJ Gone To The Moon",null,"nt16.942"]
[{"$nulls":4},"X","X",336,"Torie Bush","Wacky Wood",null,"nt16.989"]
[{"$nulls":6},349,"Sarah Rau","Cinnamon On Top",null,"nt17.006"]
[{"$nulls":6},371,"Jesse Jaureguito","Whiskey",null,"nt17.009"]
[null,null,"A",null,null,null,41,"Lauren Whitmire","WR Famous Maverick",null,"nt17.015"]
[{"$nulls":4},"X","X",367,"Jadi Jones","Vegas",null,"nt17.018"]
[{"$nulls":6},167,"Dale Long","Famous Dash Ta Vegas",null,"nt17.117"]
["X",{"$nulls":5},116,"Emma Wildiesen","I Got Your Seis",null,"nt17.145"]
[{"$nulls":6},400,"Casey Mathis","Texas Share of Fame",null,"nt17.153"]
[{"$nulls":6},254,"Bugg Beeler","JKL StreakinToTheBar",null,"nt17.164"]
[{"$nulls":6},453,"Natalie Kurosky","Dontbeadragbeaqueen",null,"nt17.179",{"$f":"IF(OR(J406=5,J406=10, J406=15, J406=\"BP\",J406=\"SCR\"),\"NT\",K406)","v":"nt17.179"}]
[null,null,"A",null,null,null,239,"Crystal Allred","Lovemas Ghost",null,"nt17.204"]
[{"$nulls":6},335,"Bliss Wells","Secret Service Gal",null,"nt17.221"]
[{"$nulls":6},266,"Monti Ford","Miss Winolena",null,"nt17.246"]
[{"$nulls":6},269,"Chastity Hastings","Smarty",null,"nt17.276"]
["X",{"$nulls":5},193,"Tallaney Clark","Perks Hickory Cat",null,"nt17.308"]
[{"$nulls":6},364,"Rudie Hepper",null,null,"nt17.329"]
[{"$nulls":6},352,"Ella Burch","Rebel",null,"nt17.330"]
["X",{"$nulls":5},50,"Ryann Pedone","Money Beea Blaizin",null,"nt17.332"]
[null,null,"S",null,null,null,198,"Chris Boyer","Lion On The Bar",null,"nt17.343"]
[{"$nulls":6},205,"Nisa Berry","A Corona Royale",null,"nt17.407"]
[{"$nulls":6},140,"Emma Abbott","Royal Traveler",null,"nt17.436"]
[{"$nulls":6},113,"Kyle Etchart","Panfis Corona",null,"nt17.443"]
[{"$nulls":6},114,"Jill Haworth","Whats Annie Oakley",null,"nt17.504"]
[{"$nulls":6},84,"Cassidy Teague","Baylor",null,"nt17.512"]
[null,null,"A",null,null,null,301,"CASey Caldwell","Busters Request",null,"nt17.538"]
[{"$nulls":4},"X","X",112,"Kate Neill","NF French Tigger",null,"nt17.591"]
[{"$nulls":4},"X","X",306,"Taylor Hice","Mac",null,"nt17.734"]
[null,"X",{"$nulls":4},131,"Wyatt Paul","FC Strait Cajun",null,"nt17.781"]
[{"$nulls":5},"X",8,"Haley King","Playboy ",null,"nt17.813"]
[{"$nulls":5},"X",54,"Josie Teague",null,null,"nt17.884"]
[{"$nulls":4},"X","X",414,"Aspen Adams","Reba",null,"nt18.125"]
[{"$nulls":6},320,"Dakota Danley","Fames French Captain",null,"nt18.197"]
[{"$nulls":6},302,"Chastity Hastings","Starlet",null,"nt18.324"]
[null,"X",null,null,"X","X",165,"Caleb Cline","SR Moonshine On Rocks",null,"nt18.468"]
[null,"X",null,null,"X","X",202,"Caleb Cline","Jade Ta Fame",null,"nt18.963"]
[{"$nulls":6},161,"Alyssa Urbanek","Pff Flits Fire Flyer",null,"nt19.018"]
[{"$nulls":6},92,"Jade Crago","VB Fire Ta Fame",null,"nt19.078"]
[{"$nulls":6},328,"ShaeLynn Hazalwusb","Magnafire",null,"nt19.085"]
[{"$nulls":6},68,"Chelan Pimentel","Guys Minnie Jet",null,"nt19.179"]
[{"$nulls":6},222,"Monica Gillespie","Streaking Buck Naked",null,"nt19.966"]
[null,null,"S",null,null,null,334,"Jim McKinney","Platinum BOK",null,"nt20.201"]
[{"$nulls":6},315,"Amber Wagner","Nordies Dash",null,"nt20.740"]
[null,null,"A",null,null,null,135,"Jennifer Abbott","Wendell Jackson",null,"nt21.082"]
[{"$nulls":6},64,"Stevi Hillman","DTF Mellow Doc",null,"nt21.390"]
[{"$nulls":6},430,"Annesa Self","Trixee",null,"nt22.273",{"$f":"IF(OR(J441=5,J441=10, J441=15, J441=\"BP\",J441=\"SCR\"),\"NT\",K441)","v":"nt22.273"}]
[null,null,"A",null,null,null,115,"Katie Kapanick","Pistol Packin Lark",null,"nt27.418"]
[null,null,"A",null,null,null,295,"Chelsea Arlington","Lil Famous Amos",null,"scratch"]
[{"$nulls":5},"X",137,"Louis-Josef Veilleux","Famous Cartel Legacy",null,"scratch"]
[{"$nulls":6},127,"Brittney Barnett","XC Easy Being Famous",null,"scratch"]
[{"$nulls":6},150,"Jimmie Smith","Tradffic Kat",null,"scratch"]
[{"$nulls":6},166,"Emma Abbott","Bayou Fame",null,"scratch"]
[{"$nulls":6},186,"Cassidy Carpenter","Chasing Dory",null,"scratch"]
[{"$nulls":6},435,{"$nulls":4},{"$f":"IF(OR(J449=5,J449=10, J449=15, J449=\"BP\",J449=\"SCR\"),\"NT\",K449)","v":0}]
[{"$nulls":6},440,{"$nulls":4},{"$f":"IF(OR(J450=5,J450=10, J450=15, J450=\"BP\",J450=\"SCR\"),\"NT\",K450)","v":0}]
[{"$nulls":6},442,{"$nulls":4},{"$f":"IF(OR(J451=5,J451=10, J451=15, J451=\"BP\",J451=\"SCR\"),\"NT\",K451)","v":0}]
[{"$nulls":6},443,{"$nulls":4},{"$f":"IF(OR(J452=5,J452=10, J452=15, J452=\"BP\",J452=\"SCR\"),\"NT\",K452)","v":0}]
[{"$nulls":6},444,{"$nulls":4},{"$f":"IF(OR(J453=5,J453=10, J453=15, J453=\"BP\",J453=\"SCR\"),\"NT\",K453)","v":0}]
[{"$nulls":6},445,{"$nulls":4},{"$f":"IF(OR(J454=5,J454=10, J454=15, J454=\"BP\",J454=\"SCR\"),\"NT\",K454)","v":0}]
[{"$nulls":6},446,{"$nulls":4},{"$f":"IF(OR(J455=5,J455=10, J455=15, J455=\"BP\",J455=\"SCR\"),\"NT\",K455)","v":0}]
[{"$nulls":6},447,{"$nulls":4},{"$f":"IF(OR(J456=5,J456=10, J456=15, J456=\"BP\",J456=\"SCR\"),\"NT\",K456)","v":0}]
[{"$nulls":6},454,{"$nulls":4},{"$f":"IF(OR(J457=5,J457=10, J457=15, J457=\"BP\",J457=\"SCR\"),\"NT\",K457)","v":0}]
[{"$nulls":6},455,{"$nulls":4},{"$f":"IF(OR(J458=5,J458=10, J458=15, J458=\"BP\",J458=\"SCR\"),\"NT\",K458)","v":0}]
[{"$nulls":6},456,{"$nulls":4},{"$f":"IF(OR(J459=5,J459=10, J459=15, J459=\"BP\",J459=\"SCR\"),\"NT\",K459)","v":0}]
[{"$nulls":6},457,{"$nulls":4},{"$f":"IF(OR(J460=5,J460=10, J460=15, J460=\"BP\",J460=\"SCR\"),\"NT\",K460)","v":0}]
[{"$nulls":6},458,{"$nulls":4},{"$f":"IF(OR(J461=5,J461=10, J461=15, J461=\"BP\",J461=\"SCR\"),\"NT\",K461)","v":0}]
[{"$nulls":6},459,{"$nulls":4},{"$f":"IF(OR(J462=5,J462=10, J462=15, J462=\"BP\",J462=\"SCR\"),\"NT\",K462)","v":0}]
[{"$nulls":6},460,{"$nulls":4},{"$f":"IF(OR(J463=5,J463=10, J463=15, J463=\"BP\",J463=\"SCR\"),\"NT\",K463)","v":0}]
[{"$nulls":6},461,{"$nulls":4},{"$f":"IF(OR(J464=5,J464=10, J464=15, J464=\"BP\",J464=\"SCR\"),\"NT\",K464)","v":0}]
[{"$nulls":6},462,{"$nulls":4},{"$f":"IF(OR(J465=5,J465=10, J465=15, J465=\"BP\",J465=\"SCR\"),\"NT\",K465)","v":0}]
[{"$nulls":6},463,{"$nulls":4},{"$f":"IF(OR(J466=5,J466=10, J466=15, J466=\"BP\",J466=\"SCR\"),\"NT\",K466)","v":0}]
[{"$nulls":6},464,{"$nulls":4},{"$f":"IF(OR(J467=5,J467=10, J467=15, J467=\"BP\",J467=\"SCR\"),\"NT\",K467)","v":0}]
[{"$nulls":6},465,{"$nulls":4},{"$f":"IF(OR(J468=5,J468=10, J468=15, J468=\"BP\",J468=\"SCR\"),\"NT\",K468)","v":0}]
[{"$nulls":6},466,{"$nulls":4},{"$f":"IF(OR(J469=5,J469=10, J469=15, J469=\"BP\",J469=\"SCR\"),\"NT\",K469)","v":0}]
[{"$nulls":6},467,{"$nulls":4},{"$f":"IF(OR(J470=5,J470=10, J470=15, J470=\"BP\",J470=\"SCR\"),\"NT\",K470)","v":0}]
[{"$nulls":6},468,{"$nulls":4},{"$f":"IF(OR(J471=5,J471=10, J471=15, J471=\"BP\",J471=\"SCR\"),\"NT\",K471)","v":0}]
[{"$nulls":6},469,{"$nulls":4},{"$f":"IF(OR(J472=5,J472=10, J472=15, J472=\"BP\",J472=\"SCR\"),\"NT\",K472)","v":0}]
[{"$nulls":6},470,{"$nulls":4},{"$f":"IF(OR(J473=5,J473=10, J473=15, J473=\"BP\",J473=\"SCR\"),\"NT\",K473)","v":0}]
[{"$nulls":6},471,{"$nulls":4},{"$f":"IF(OR(J474=5,J474=10, J474=15, J474=\"BP\",J474=\"SCR\"),\"NT\",K474)","v":0}]
[{"$nulls":6},472,{"$nulls":4},{"$f":"IF(OR(J475=5,J475=10, J475=15, J475=\"BP\",J475=\"SCR\"),\"NT\",K475)","v":0}]
[{"$nulls":6},473,{"$nulls":4},{"$f":"IF(OR(J476=5,J476=10, J476=15, J476=\"BP\",J476=\"SCR\"),\"NT\",K476)","v":0}]
[{"$nulls":6},474,{"$nulls":4},{"$f":"IF(OR(J477=5,J477=10, J477=15, J477=\"BP\",J477=\"SCR\"),\"NT\",K477)","v":0}]
[{"$nulls":6},475,{"$nulls":4},{"$f":"IF(OR(J478=5,J478=10, J478=15, J478=\"BP\",J478=\"SCR\"),\"NT\",K478)","v":0}]
[{"$nulls":6},476,{"$nulls":4},{"$f":"IF(OR(J479=5,J479=10, J479=15, J479=\"BP\",J479=\"SCR\"),\"NT\",K479)","v":0}]
[{"$nulls":6},477,{"$nulls":4},{"$f":"IF(OR(J480=5,J480=10, J480=15, J480=\"BP\",J480=\"SCR\"),\"NT\",K480)","v":0}]
[{"$nulls":6},478,{"$nulls":4},{"$f":"IF(OR(J481=5,J481=10, J481=15, J481=\"BP\",J481=\"SCR\"),\"NT\",K481)","v":0}]
[{"$nulls":6},479,{"$nulls":4},{"$f":"IF(OR(J482=5,J482=10, J482=15, J482=\"BP\",J482=\"SCR\"),\"NT\",K482)","v":0}]
[{"$nulls":6},480,{"$nulls":4},{"$f":"IF(OR(J483=5,J483=10, J483=15, J483=\"BP\",J483=\"SCR\"),\"NT\",K483)","v":0}]
[{"$nulls":6},481,{"$nulls":4},{"$f":"IF(OR(J484=5,J484=10, J484=15, J484=\"BP\",J484=\"SCR\"),\"NT\",K484)","v":0}]
[{"$nulls":6},482,{"$nulls":4},{"$f":"IF(OR(J485=5,J485=10, J485=15, J485=\"BP\",J485=\"SCR\"),\"NT\",K485)","v":0}]
[{"$nulls":6},483,{"$nulls":4},{"$f":"IF(OR(J486=5,J486=10, J486=15, J486=\"BP\",J486=\"SCR\"),\"NT\",K486)","v":0}]
[{"$nulls":6},484,{"$nulls":4},{"$f":"IF(OR(J487=5,J487=10, J487=15, J487=\"BP\",J487=\"SCR\"),\"NT\",K487)","v":0}]
[{"$nulls":6},485,{"$nulls":4},{"$f":"IF(OR(J488=5,J488=10, J488=15, J488=\"BP\",J488=\"SCR\"),\"NT\",K488)","v":0}]
[{"$nulls":6},486,{"$nulls":4},{"$f":"IF(OR(J489=5,J489=10, J489=15, J489=\"BP\",J489=\"SCR\"),\"NT\",K489)","v":0}]
[{"$nulls":6},487,{"$nulls":4},{"$f":"IF(OR(J490=5,J490=10, J490=15, J490=\"BP\",J490=\"SCR\"),\"NT\",K490)","v":0}]
[{"$nulls":6},488,{"$nulls":4},{"$f":"IF(OR(J491=5,J491=10, J491=15, J491=\"BP\",J491=\"SCR\"),\"NT\",K491)","v":0}]
[{"$nulls":6},489,{"$nulls":4},{"$f":"IF(OR(J492=5,J492=10, J492=15, J492=\"BP\",J492=\"SCR\"),\"NT\",K492)","v":0}]
[{"$nulls":6},490,{"$nulls":4},{"$f":"IF(OR(J493=5,J493=10, J493=15, J493=\"BP\",J493=\"SCR\"),\"NT\",K493)","v":0}]
[{"$nulls":6},491,{"$nulls":4},{"$f":"IF(OR(J494=5,J494=10, J494=15, J494=\"BP\",J494=\"SCR\"),\"NT\",K494)","v":0}]
[{"$nulls":6},492,{"$nulls":4},{"$f":"IF(OR(J495=5,J495=10, J495=15, J495=\"BP\",J495=\"SCR\"),\"NT\",K495)","v":0}]
[{"$nulls":6},493,{"$nulls":4},{"$f":"IF(OR(J496=5,J496=10, J496=15, J496=\"BP\",J496=\"SCR\"),\"NT\",K496)","v":0}]
[{"$nulls":6},494,{"$nulls":4},{"$f":"IF(OR(J497=5,J497=10, J497=15, J497=\"BP\",J497=\"SCR\"),\"NT\",K497)","v":0}]
[{"$nulls":6},495,{"$nulls":4},{"$f":"IF(OR(J498=5,J498=10, J498=15, J498=\"BP\",J498=\"SCR\"),\"NT\",K498)","v":0}]
[{"$nulls":6},496,{"$nulls":4},{"$f":"IF(OR(J499=5,J499=10, J499=15, J499=\"BP\",J499=\"SCR\"),\"NT\",K499)","v":0}]
[{"$nulls":6},497,{"$nulls":4},{"$f":"IF(OR(J500=5,J500=10, J500=15, J500=\"BP\",J500=\"SCR\"),\"NT\",K500)","v":0}]
[{"$nulls":6},498,{"$nulls":4},{"$f":"IF(OR(J501=5,J501=10, J501=15, J501=\"BP\",J501=\"SCR\"),\"NT\",K501)","v":0}]
[{"$nulls":6},499,{"$nulls":4},{"$f":"IF(OR(J502=5,J502=10, J502=15, J502=\"BP\",J502=\"SCR\"),\"NT\",K502)","v":0}]
[{"$nulls":6},500,{"$nulls":4},{"$f":"IF(OR(J503=5,J503=10, J503=15, J503=\"BP\",J503=\"SCR\"),\"NT\",K503)","v":0}]

{"sheet":"Senior","index":1,"n_rows":301,"n_cols":12,"rows_kept":301,"cut":false,"hidden":false,"merged":[]}
["Futurity","Der","Age Inct.","BBR","Draw","Rider Name","Horse Name","Pen","Time","Final Time","Placing","Money Earned"]
[{"$nulls":4},1,"Donna Kay Rule","High Valor",null,15.954000000000001,null,"1D 1st",106]
[{"$nulls":4},2,"Martha Smith","Firewatermakemehappy",null,15.955,null,"1D 2nd",70]
[{"$nulls":4},3,"Lisa Wernli","Flashs Fine Effort",null,16.224]
[{"$nulls":4},4,"Louis Ferguson","Epic Two KS",null,16.239000000000001]
[{"$nulls":4},5,"Sherri Barnes","Racing For Perks",null,16.363]
[{"$nulls":4},6,"Amy Swan","Boons Prescription",null,16.37]
[{"$nulls":4},7,"Lisa Wernli","Babe On The Run",null,16.387]
[{"$nulls":4},8,"Jo Kirby","Heavenly Joak",null,16.446999999999999]
[{"$nulls":4},9,"Karen Hancock","Just Anotherstreak",null,16.893000000000001,null,"2D 1st",90]
[{"$nulls":4},10,"Lisa Corey","Beda Dream",null,16.904,null,"2D 2nd",60]
[{"$nulls":4},11,"Jolene Jones","Peppys Streak of Fame",null,17.096,null,"3D 1st",60]
[{"$nulls":4},12,"Patti Reardon","HeCOme Dun",null,17.265000000000001,null,"3D 2nd",40]
[{"$nulls":4},13,"Chris Boyer","Unzippinlikeastreaker",null,17.364000000000001]
[{"$nulls":4},14,"Kathy Cribbs","Playboys Arrow",null,17.401]
[{"$nulls":4},15,"Simone Elmore","Mighty Moondash",null,19.114000000000001,null,"4D 1st",45]
[{"$nulls":4},16,"Jolene Jones","Capone",null,19.98,null,"4D 2nd",30]
[{"$nulls":4},17,"Trina Murray","Fuel For Dash",null,"nt"]
[{"$nulls":4},18,"Trina Murray","Dirty Dan Stinson",null,"nt"]
[{"$nulls":4},19,"Martha Smith","My Epic Moment",null,"nt"]
[{"$nulls":4},20,"Jolene Jones","Perks Fame Aint Easy",null,"nt"]
[{"$nulls":4},21,"Martha Jordan","MV Fury Of The Fame",null,"nt16.128"]
[{"$nulls":4},22,"Tammy Rokus","Mitey Confederate",null,"nt16.167"]
[{"$nulls":4},23,"Chris Boyer","Lion On The Bar",null,"nt17.343"]
[{"$nulls":4},25,"Jim McKinney","Platinum BOK",null,"nt20.201"]
[{"$nulls":4},26]
[{"$nulls":4},27]
[{"$nulls":4},28]
[{"$nulls":4},29]
[{"$nulls":4},30]
[{"$nulls":4},31]
[{"$nulls":4},32]
[{"$nulls":4},24]
[{"$nulls":4},33]
[{"$nulls":4},34]
[{"$nulls":4},35]
[{"$nulls":4},36]
[{"$nulls":4},37]
[{"$nulls":4},38]
[{"$nulls":4},39]
[{"$nulls":4},40]
[{"$nulls":4},41,{"$nulls":4},{"$f":"IF(OR(H42=5,H42=10, H42=15, H42=\"BP\",H42=\"SCR\"),\"NT\",I42)","v":0}]
[{"$nulls":4},42,{"$nulls":4},0]
[{"$nulls":4},43,{"$nulls":4},0]
[{"$nulls":4},44,{"$nulls":4},0]
[{"$nulls":4},45,{"$nulls":4},0]
[{"$nulls":4},46,{"$nulls":4},0]
[{"$nulls":4},47,{"$nulls":4},0]
[{"$nulls":4},48,{"$nulls":4},0]
[{"$nulls":4},49,{"$nulls":4},0]
[{"$nulls":4},50,{"$nulls":4},0]
[{"$nulls":4},51,{"$nulls":4},0]
[{"$nulls":4},52,{"$nulls":4},0]
[{"$nulls":4},53,{"$nulls":4},0]
[{"$nulls":4},54,{"$nulls":4},0]
[{"$nulls":4},55,{"$nulls":4},0]
[{"$nulls":4},56,{"$nulls":4},0]
[{"$nulls":4},57,{"$nulls":4},0]
[{"$nulls":4},58,{"$nulls":4},0]
[{"$nulls":4},59,{"$nulls":4},0]
[{"$nulls":4},60,{"$nulls":4},0]
[{"$nulls":4},61,{"$nulls":4},0]
[{"$nulls":4},62,{"$nulls":4},0]
[{"$nulls":4},63,{"$nulls":4},0]
[{"$nulls":4},64,{"$nulls":4},0]
[{"$nulls":4},65,{"$nulls":4},0]
[{"$nulls":4},66,{"$nulls":4},0]
[{"$nulls":4},67,{"$nulls":4},0]
[{"$nulls":4},68,{"$nulls":4},0]
[{"$nulls":4},69,{"$nulls":4},0]
[{"$nulls":4},70,{"$nulls":4},0]
[{"$nulls":4},71,{"$nulls":4},0]
[{"$nulls":4},72,{"$nulls":4},0]
[{"$nulls":4},73,{"$nulls":4},0]
[{"$nulls":4},74,{"$nulls":4},0]
[{"$nulls":4},75,{"$nulls":4},0]
[{"$nulls":4},76,{"$nulls":4},0]
[{"$nulls":4},77,{"$nulls":4},0]
[{"$nulls":4},78,{"$nulls":4},0]
[{"$nulls":4},79,{"$nulls":4},0]
[{"$nulls":4},80,{"$nulls":4},0]
[{"$nulls":4},81,{"$nulls":4},0]
[{"$nulls":4},82,{"$nulls":4},0]
[{"$nulls":4},83,{"$nulls":4},0]
[{"$nulls":4},84,{"$nulls":4},0]
[{"$nulls":4},85,{"$nulls":4},0]
[{"$nulls":4},86,{"$nulls":4},0]
[{"$nulls":4},87,{"$nulls":4},0]
[{"$nulls":4},88,{"$nulls":4},0]
[{"$nulls":4},89,{"$nulls":4},0]
[{"$nulls":4},90,{"$nulls":4},0]
[{"$nulls":4},91,{"$nulls":4},0]
[{"$nulls":4},92,{"$nulls":4},0]
[{"$nulls":4},93,{"$nulls":4},0]
[{"$nulls":4},94,{"$nulls":4},0]
[{"$nulls":4},95,{"$nulls":4},0]
[{"$nulls":4},96,{"$nulls":4},0]
[{"$nulls":4},97,{"$nulls":4},0]
[{"$nulls":4},98,{"$nulls":4},0]
[{"$nulls":4},99,{"$nulls":4},0]
[{"$nulls":4},100,{"$nulls":4},0]
[{"$nulls":4},101,{"$nulls":4},0]
[{"$nulls":4},102,{"$nulls":4},0]
[{"$nulls":4},103,{"$nulls":4},0]
[{"$nulls":4},104,{"$nulls":4},0]
[{"$nulls":4},105,{"$nulls":4},{"$f":"IF(OR(H106=5,H106=10, H106=15, H106=\"BP\",H106=\"SCR\"),\"NT\",I106)","v":0}]
[{"$nulls":4},106,{"$nulls":4},0]
[{"$nulls":4},107,{"$nulls":4},0]
[{"$nulls":4},108,{"$nulls":4},0]
[{"$nulls":4},109,{"$nulls":4},0]
[{"$nulls":4},110,{"$nulls":4},0]
[{"$nulls":4},111,{"$nulls":4},0]
[{"$nulls":4},112,{"$nulls":4},0]
[{"$nulls":4},113,{"$nulls":4},0]
[{"$nulls":4},114,{"$nulls":4},0]
[{"$nulls":4},115,{"$nulls":4},0]
[{"$nulls":4},116,{"$nulls":4},0]
[{"$nulls":4},117,{"$nulls":4},0]
[{"$nulls":4},118,{"$nulls":4},0]
[{"$nulls":4},119,{"$nulls":4},0]
[{"$nulls":4},120,{"$nulls":4},0]
[{"$nulls":4},121,{"$nulls":4},0]
[{"$nulls":4},122,{"$nulls":4},0]
[{"$nulls":4},123,{"$nulls":4},0]
[{"$nulls":4},124,{"$nulls":4},0]
[{"$nulls":4},125,{"$nulls":4},0]
[{"$nulls":4},126,{"$nulls":4},0]
[{"$nulls":4},127,{"$nulls":4},0]
[{"$nulls":4},128,{"$nulls":4},0]
[{"$nulls":4},129,{"$nulls":4},0]
[{"$nulls":4},130,{"$nulls":4},0]
[{"$nulls":4},131,{"$nulls":4},0]
[{"$nulls":4},132,{"$nulls":4},0]
[{"$nulls":4},133,{"$nulls":4},0]
[{"$nulls":4},134,{"$nulls":4},0]
[{"$nulls":4},135,{"$nulls":4},0]
[{"$nulls":4},136,{"$nulls":4},0]
[{"$nulls":4},137,{"$nulls":4},0]
[{"$nulls":4},138,{"$nulls":4},0]
[{"$nulls":4},139,{"$nulls":4},0]
[{"$nulls":4},140,{"$nulls":4},0]
[{"$nulls":4},141,{"$nulls":4},0]
[{"$nulls":4},142,{"$nulls":4},0]
[{"$nulls":4},143,{"$nulls":4},0]
[{"$nulls":4},144,{"$nulls":4},0]
[{"$nulls":4},145,{"$nulls":4},0]
[{"$nulls":4},146,{"$nulls":4},0]
[{"$nulls":4},147,{"$nulls":4},0]
[{"$nulls":4},148,{"$nulls":4},0]
[{"$nulls":4},149,{"$nulls":4},0]
[{"$nulls":4},150,{"$nulls":4},0]
[{"$nulls":4},151,{"$nulls":4},0]
[{"$nulls":4},152,{"$nulls":4},0]
[{"$nulls":4},153,{"$nulls":4},0]
[{"$nulls":4},154,{"$nulls":4},0]
[{"$nulls":4},155,{"$nulls":4},0]
[{"$nulls":4},156,{"$nulls":4},0]
[{"$nulls":4},157,{"$nulls":4},0]
[{"$nulls":4},158,{"$nulls":4},0]
[{"$nulls":4},159,{"$nulls":4},0]
[{"$nulls":4},160,{"$nulls":4},0]
[{"$nulls":4},161,{"$nulls":4},0]
[{"$nulls":4},162,{"$nulls":4},0]
[{"$nulls":4},163,{"$nulls":4},0]
[{"$nulls":4},164,{"$nulls":4},0]
[{"$nulls":4},165,{"$nulls":4},0]
[{"$nulls":4},166,{"$nulls":4},0]
[{"$nulls":4},167,{"$nulls":4},0]
[{"$nulls":4},168,{"$nulls":4},0]
[{"$nulls":4},169,{"$nulls":4},{"$f":"IF(OR(H170=5,H170=10, H170=15, H170=\"BP\",H170=\"SCR\"),\"NT\",I170)","v":0}]
[{"$nulls":4},170,{"$nulls":4},0]
[{"$nulls":4},171,{"$nulls":4},0]
[{"$nulls":4},172,{"$nulls":4},0]
[{"$nulls":4},173,{"$nulls":4},0]
[{"$nulls":4},174,{"$nulls":4},0]
[{"$nulls":4},175,{"$nulls":4},0]
[{"$nulls":4},176,{"$nulls":4},0]
[{"$nulls":4},177,{"$nulls":4},0]
[{"$nulls":4},178,{"$nulls":4},0]
[{"$nulls":4},179,{"$nulls":4},0]
[{"$nulls":4},180,{"$nulls":4},0]
[{"$nulls":4},181,{"$nulls":4},0]
[{"$nulls":4},182,{"$nulls":4},0]
[{"$nulls":4},183,{"$nulls":4},0]
[{"$nulls":4},184,{"$nulls":4},0]
[{"$nulls":4},185,{"$nulls":4},0]
[{"$nulls":4},186,{"$nulls":4},0]
[{"$nulls":4},187,{"$nulls":4},0]
[{"$nulls":4},188,{"$nulls":4},0]
[{"$nulls":4},189,{"$nulls":4},0]
[{"$nulls":4},190,{"$nulls":4},0]
[{"$nulls":4},191,{"$nulls":4},0]
[{"$nulls":4},192,{"$nulls":4},0]
[{"$nulls":4},193,{"$nulls":4},0]
[{"$nulls":4},194,{"$nulls":4},0]
[{"$nulls":4},195,{"$nulls":4},0]
[{"$nulls":4},196,{"$nulls":4},0]
[{"$nulls":4},197,{"$nulls":4},0]
[{"$nulls":4},198,{"$nulls":4},0]
[{"$nulls":4},199,{"$nulls":4},0]
[{"$nulls":4},200,{"$nulls":4},0]
[{"$nulls":4},201,{"$nulls":4},0]
[{"$nulls":4},202,{"$nulls":4},0]
[{"$nulls":4},203,{"$nulls":4},0]
[{"$nulls":4},204,{"$nulls":4},0]
[{"$nulls":4},205,{"$nulls":4},0]
[{"$nulls":4},206,{"$nulls":4},0]
[{"$nulls":4},207,{"$nulls":4},0]
[{"$nulls":4},208,{"$nulls":4},0]
[{"$nulls":4},209,{"$nulls":4},0]
[{"$nulls":4},210,{"$nulls":4},0]
[{"$nulls":4},211,{"$nulls":4},0]
[{"$nulls":4},212,{"$nulls":4},0]
[{"$nulls":4},213,{"$nulls":4},0]
[{"$nulls":4},214,{"$nulls":4},0]
[{"$nulls":4},215,{"$nulls":4},0]
[{"$nulls":4},216,{"$nulls":4},0]
[{"$nulls":4},217,{"$nulls":4},0]
[{"$nulls":4},218,{"$nulls":4},0]
[{"$nulls":4},219,{"$nulls":4},0]
[{"$nulls":4},220,{"$nulls":4},0]
[{"$nulls":4},221,{"$nulls":4},0]
[{"$nulls":4},222,{"$nulls":4},0]
[{"$nulls":4},223,{"$nulls":4},0]
[{"$nulls":4},224,{"$nulls":4},0]
[{"$nulls":4},225,{"$nulls":4},0]
[{"$nulls":4},226,{"$nulls":4},0]
[{"$nulls":4},227,{"$nulls":4},0]
[{"$nulls":4},228,{"$nulls":4},0]
[{"$nulls":4},229,{"$nulls":4},0]
[{"$nulls":4},230,{"$nulls":4},0]
[{"$nulls":4},231,{"$nulls":4},0]
[{"$nulls":4},232,{"$nulls":4},0]
[{"$nulls":4},233,{"$nulls":4},{"$f":"IF(OR(H234=5,H234=10, H234=15, H234=\"BP\",H234=\"SCR\"),\"NT\",I234)","v":0}]
[{"$nulls":4},234,{"$nulls":4},0]
[{"$nulls":4},235,{"$nulls":4},0]
[{"$nulls":4},236,{"$nulls":4},0]
[{"$nulls":4},237,{"$nulls":4},0]
[{"$nulls":4},238,{"$nulls":4},0]
[{"$nulls":4},239,{"$nulls":4},0]
[{"$nulls":4},240,{"$nulls":4},0]
[{"$nulls":4},241,{"$nulls":4},0]
[{"$nulls":4},242,{"$nulls":4},0]
[{"$nulls":4},243,{"$nulls":4},0]
[{"$nulls":4},244,{"$nulls":4},0]
[{"$nulls":4},245,{"$nulls":4},0]
[{"$nulls":4},246,{"$nulls":4},0]
[{"$nulls":4},247,{"$nulls":4},0]
[{"$nulls":4},248,{"$nulls":4},0]
[{"$nulls":4},249,{"$nulls":4},0]
[{"$nulls":4},250,{"$nulls":4},0]
[{"$nulls":4},251,{"$nulls":4},0]
[{"$nulls":4},252,{"$nulls":4},0]
[{"$nulls":4},253,{"$nulls":4},0]
[{"$nulls":4},254,{"$nulls":4},0]
[{"$nulls":4},255,{"$nulls":4},0]
[{"$nulls":4},256,{"$nulls":4},0]
[{"$nulls":4},257,{"$nulls":4},0]
[{"$nulls":4},258,{"$nulls":4},0]
[{"$nulls":4},259,{"$nulls":4},0]
[{"$nulls":4},260,{"$nulls":4},0]
[{"$nulls":4},261,{"$nulls":4},0]
[{"$nulls":4},262,{"$nulls":4},0]
[{"$nulls":4},263,{"$nulls":4},0]
[{"$nulls":4},264,{"$nulls":4},0]
[{"$nulls":4},265,{"$nulls":4},0]
[{"$nulls":4},266,{"$nulls":4},0]
[{"$nulls":4},267,{"$nulls":4},0]
[{"$nulls":4},268,{"$nulls":4},0]
[{"$nulls":4},269,{"$nulls":4},0]
[{"$nulls":4},270,{"$nulls":4},0]
[{"$nulls":4},271,{"$nulls":4},0]
[{"$nulls":4},272,{"$nulls":4},0]
[{"$nulls":4},273,{"$nulls":4},0]
[{"$nulls":4},274,{"$nulls":4},0]
[{"$nulls":4},275,{"$nulls":4},0]
[{"$nulls":4},276,{"$nulls":4},0]
[{"$nulls":4},277,{"$nulls":4},0]
[{"$nulls":4},278,{"$nulls":4},0]
[{"$nulls":4},279,{"$nulls":4},0]
[{"$nulls":4},280,{"$nulls":4},0]
[{"$nulls":4},281,{"$nulls":4},0]
[{"$nulls":4},282,{"$nulls":4},0]
[{"$nulls":4},283,{"$nulls":4},0]
[{"$nulls":4},284,{"$nulls":4},0]
[{"$nulls":4},285,{"$nulls":4},0]
[{"$nulls":4},286,{"$nulls":4},0]
[{"$nulls":4},287,{"$nulls":4},0]
[{"$nulls":4},288,{"$nulls":4},0]
[{"$nulls":4},289,{"$nulls":4},0]
[{"$nulls":4},290,{"$nulls":4},0]
[{"$nulls":4},291,{"$nulls":4},0]
[{"$nulls":4},292,{"$nulls":4},0]
[{"$nulls":4},293,{"$nulls":4},0]
[{"$nulls":4},294,{"$nulls":4},0]
[{"$nulls":4},295,{"$nulls":4},0]
[{"$nulls":4},296,{"$nulls":4},0]
[{"$nulls":4},297,{"$nulls":4},{"$f":"IF(OR(H298=5,H298=10, H298=15, H298=\"BP\",H298=\"SCR\"),\"NT\",I298)","v":0}]
[{"$nulls":4},298,{"$nulls":4},0]
[{"$nulls":4},299,{"$nulls":4},0]
[{"$nulls":4},300,{"$nulls":4},0]

{"sheet":"Adult","index":2,"n_rows":301,"n_cols":12,"rows_kept":301,"cut":false,"hidden":false,"merged":[]}
["Futurity","Der","Age Inct.","BBR","Draw","Rider Name","Horse Name","Pen","Time","Final Time","Placing","Money Earned"]
[{"$nulls":4},1,"Cassidy Teague","Tres Socks",null,15.712,null,"1D 1st",168]
[{"$nulls":4},2,"Andrea Busby","Famous Heartbreaker",null,15.821999999999999,null,"1D 2nd",112]
[{"$nulls":4},3,"Jimmie Smith","Marthas Bullion",null,15.891]
[{"$nulls":4},4,"Joy Wargo","Cashin On The Bayou",null,15.948]
[{"$nulls":4},5,"Karri McKim","Firen Ta Fame",null,16.077999999999999]
[{"$nulls":4},6,"Kinsey Chandler","Judge Knott",null,16.103000000000002]
[{"$nulls":4},7,"Molly Steffen",null,null,16.2]
[{"$nulls":4},8,"Kylee Scribner","Badger A Conchadrift",null,16.248000000000001,null,"2D 1st",144]
[{"$nulls":4},9,"Brooke Kelley","Nu Bueno Karma",null,16.285,null,"2D 2nd",96]
[{"$nulls":4},10,"Whitney Godinez","Chilla On The Rocks",null,16.577999999999999]
[{"$nulls":4},11,"Cierra Chapman","Ginger",null,16.704999999999998]
[{"$nulls":4},12,"Jessica Mullins","Doc Eyed Fame",null,16.800999999999998,null,"3D 1st",96]
[{"$nulls":4},13,"Jessica Mullins","Kakunamatadi",null,16.911000000000001,null,"3D 2nd",64]
[{"$nulls":4},14,"Lauren Whitmire","WR Famous Amigo",null,17.099]
[{"$nulls":4},15,"Crystal Allred","No Berry Just A Jewel",null,17.137]
[{"$nulls":4},16,"LeAnne Turney","Dun It With Jac",null,17.260999999999999,null,"4D 1st",72]
[{"$nulls":4},17,"Kaylyn Smith","Bet She Can Fly",null,17.366,null,"4D 2nd",48]
[{"$nulls":4},18,"Angelia Kerkhoff","Im A Dashing Star",null,17.550999999999998]
[{"$nulls":4},19,"Emily Greer","Elvis",null,17.573]
[{"$nulls":4},20,"Richard Moore","Miss Thing",null,17.634]
[{"$nulls":4},21,"Michaela Robertson","Shes Cartel Streakin",null,17.655000000000001]
[{"$nulls":4},22,"Emily Greer","TF Speedywood Dyna",null,17.902000000000001]
[{"$nulls":4},23,"Christy Brower","SH Im A Fighter",null,17.945]
[{"$nulls":4},24,"Jana Brothers","Our Kinda Tuff",null,18.245000000000001]
[{"$nulls":4},25,"Christy Brower","Miss Regal Memories",null,18.263000000000002]
[{"$nulls":4},26,"Cierra Chapman","Sun In Fun",null,"broken"]
[{"$nulls":4},27,"Kristin Shoppa","JW Freeze Fame",null,"nt15.938"]
[{"$nulls":4},28,"Sunnie Thiberville","TJ",null,"nt15.969"]
[{"$nulls":4},29,"Lauren Whitmire","Fame Rox",null,"nt16.006"]
[{"$nulls":4},30,"Alyssa Urbanek","Fueled With Dinero",null,"nt16.048"]
[{"$nulls":4},31,"Jimmie Smith","Lever Action",null,"nt16.129"]
[{"$nulls":4},32,"Rylee Leach","NMB Chesterslilbunny",null,"nt16.217"]
[{"$nulls":4},33,"Anna Johnson","Famous Resurection",null,"nt16.233"]
[{"$nulls":4},34,"Kristin Shoppa","JW MizGuyded",null,"nt16.330"]
[{"$nulls":4},35,"Cierra Chapman","Lil Blushing Blonde",null,"nt16.466"]
[{"$nulls":4},36,"Lauren Whitmire","WR Famous Maverick",null,"nt17.015"]
[{"$nulls":4},37,"Crystal Allred","Lovemas Ghost",null,"nt17.204"]
[{"$nulls":4},38,"CASey Caldwell","Busters Request",null,"nt17.538"]
[{"$nulls":4},39,"Jennifer Abbott","Wendell Jackson",null,"nt21.082"]
[{"$nulls":4},40,"Katie Kapanick","Pistol Packin Lark",null,"nt27.418"]
[{"$nulls":4},41]
[{"$nulls":4},42]
[{"$nulls":4},43]
[{"$nulls":4},44]
[{"$nulls":4},45]
[{"$nulls":4},46]
[{"$nulls":4},47]
[{"$nulls":4},48]
[{"$nulls":4},49]
[{"$nulls":4},50]
[{"$nulls":4},51]
[{"$nulls":4},52]
[{"$nulls":4},53]
[{"$nulls":4},54]
[{"$nulls":4},55]
[{"$nulls":4},56]
[{"$nulls":4},57]
[{"$nulls":4},58]
[{"$nulls":4},59]
[{"$nulls":4},60]
[{"$nulls":4},61]
[{"$nulls":4},62]
[{"$nulls":4},63]
[{"$nulls":4},64]
[{"$nulls":4},65]
[{"$nulls":4},66]
[{"$nulls":4},67]
[{"$nulls":4},68]
[{"$nulls":4},69]
[{"$nulls":4},70]
[{"$nulls":4},71,{"$nulls":4},{"$f":"IF(OR(H72=5,H72=10, H72=15, H72=\"BP\",H72=\"SCR\"),\"NT\",I72)","v":0}]
[{"$nulls":4},72,{"$nulls":4},0]
[{"$nulls":4},73,{"$nulls":4},0]
[{"$nulls":4},74,{"$nulls":4},0]
[{"$nulls":4},75,{"$nulls":4},0]
[{"$nulls":4},76,{"$nulls":4},0]
[{"$nulls":4},77,{"$nulls":4},0]
[{"$nulls":4},78,{"$nulls":4},0]
[{"$nulls":4},79,{"$nulls":4},0]
[{"$nulls":4},80,{"$nulls":4},0]
[{"$nulls":4},81,{"$nulls":4},0]
[{"$nulls":4},82,{"$nulls":4},0]
[{"$nulls":4},83,{"$nulls":4},0]
[{"$nulls":4},84,{"$nulls":4},0]
[{"$nulls":4},85,{"$nulls":4},0]
[{"$nulls":4},86,{"$nulls":4},0]
[{"$nulls":4},87,{"$nulls":4},0]
[{"$nulls":4},88,{"$nulls":4},0]
[{"$nulls":4},89,{"$nulls":4},0]
[{"$nulls":4},90,{"$nulls":4},0]
[{"$nulls":4},91,{"$nulls":4},0]
[{"$nulls":4},92,{"$nulls":4},0]
[{"$nulls":4},93,{"$nulls":4},0]
[{"$nulls":4},94,{"$nulls":4},0]
[{"$nulls":4},95,{"$nulls":4},0]
[{"$nulls":4},96,{"$nulls":4},0]
[{"$nulls":4},97,{"$nulls":4},0]
[{"$nulls":4},98,{"$nulls":4},0]
[{"$nulls":4},99,{"$nulls":4},0]
[{"$nulls":4},100,{"$nulls":4},0]
[{"$nulls":4},101,{"$nulls":4},0]
[{"$nulls":4},102,{"$nulls":4},0]
[{"$nulls":4},103,{"$nulls":4},0]
[{"$nulls":4},104,{"$nulls":4},0]
[{"$nulls":4},105,{"$nulls":4},0]
[{"$nulls":4},106,{"$nulls":4},0]
[{"$nulls":4},107,{"$nulls":4},0]
[{"$nulls":4},108,{"$nulls":4},0]
[{"$nulls":4},109,{"$nulls":4},0]
[{"$nulls":4},110,{"$nulls":4},0]
[{"$nulls":4},111,{"$nulls":4},0]
[{"$nulls":4},112,{"$nulls":4},0]
[{"$nulls":4},113,{"$nulls":4},0]
[{"$nulls":4},114,{"$nulls":4},0]
[{"$nulls":4},115,{"$nulls":4},0]
[{"$nulls":4},116,{"$nulls":4},0]
[{"$nulls":4},117,{"$nulls":4},0]
[{"$nulls":4},118,{"$nulls":4},0]
[{"$nulls":4},119,{"$nulls":4},0]
[{"$nulls":4},120,{"$nulls":4},0]
[{"$nulls":4},121,{"$nulls":4},0]
[{"$nulls":4},122,{"$nulls":4},0]
[{"$nulls":4},123,{"$nulls":4},0]
[{"$nulls":4},124,{"$nulls":4},0]
[{"$nulls":4},125,{"$nulls":4},0]
[{"$nulls":4},126,{"$nulls":4},0]
[{"$nulls":4},127,{"$nulls":4},0]
[{"$nulls":4},128,{"$nulls":4},0]
[{"$nulls":4},129,{"$nulls":4},0]
[{"$nulls":4},130,{"$nulls":4},0]
[{"$nulls":4},131,{"$nulls":4},0]
[{"$nulls":4},132,{"$nulls":4},0]
[{"$nulls":4},133,{"$nulls":4},0]
[{"$nulls":4},134,{"$nulls":4},0]
[{"$nulls":4},135,{"$nulls":4},{"$f":"IF(OR(H136=5,H136=10, H136=15, H136=\"BP\",H136=\"SCR\"),\"NT\",I136)","v":0}]
[{"$nulls":4},136,{"$nulls":4},0]
[{"$nulls":4},137,{"$nulls":4},0]
[{"$nulls":4},138,{"$nulls":4},0]
[{"$nulls":4},139,{"$nulls":4},0]
[{"$nulls":4},140,{"$nulls":4},0]
[{"$nulls":4},141,{"$nulls":4},0]
[{"$nulls":4},142,{"$nulls":4},0]
[{"$nulls":4},143,{"$nulls":4},0]
[{"$nulls":4},144,{"$nulls":4},0]
[{"$nulls":4},145,{"$nulls":4},0]
[{"$nulls":4},146,{"$nulls":4},0]
[{"$nulls":4},147,{"$nulls":4},0]
[{"$nulls":4},148,{"$nulls":4},0]
[{"$nulls":4},149,{"$nulls":4},0]
[{"$nulls":4},150,{"$nulls":4},0]
[{"$nulls":4},151,{"$nulls":4},0]
[{"$nulls":4},152,{"$nulls":4},0]
[{"$nulls":4},153,{"$nulls":4},0]
[{"$nulls":4},154,{"$nulls":4},0]
[{"$nulls":4},155,{"$nulls":4},0]
[{"$nulls":4},156,{"$nulls":4},0]
[{"$nulls":4},157,{"$nulls":4},0]
[{"$nulls":4},158,{"$nulls":4},0]
[{"$nulls":4},159,{"$nulls":4},0]
[{"$nulls":4},160,{"$nulls":4},0]
[{"$nulls":4},161,{"$nulls":4},0]
[{"$nulls":4},162,{"$nulls":4},0]
[{"$nulls":4},163,{"$nulls":4},0]
[{"$nulls":4},164,{"$nulls":4},0]
[{"$nulls":4},165,{"$nulls":4},0]
[{"$nulls":4},166,{"$nulls":4},0]
[{"$nulls":4},167,{"$nulls":4},0]
[{"$nulls":4},168,{"$nulls":4},0]
[{"$nulls":4},169,{"$nulls":4},0]
[{"$nulls":4},170,{"$nulls":4},0]
[{"$nulls":4},171,{"$nulls":4},0]
[{"$nulls":4},172,{"$nulls":4},0]
[{"$nulls":4},173,{"$nulls":4},0]
[{"$nulls":4},174,{"$nulls":4},0]
[{"$nulls":4},175,{"$nulls":4},0]
[{"$nulls":4},176,{"$nulls":4},0]
[{"$nulls":4},177,{"$nulls":4},0]
[{"$nulls":4},178,{"$nulls":4},0]
[{"$nulls":4},179,{"$nulls":4},0]
[{"$nulls":4},180,{"$nulls":4},0]
[{"$nulls":4},181,{"$nulls":4},0]
[{"$nulls":4},182,{"$nulls":4},0]
[{"$nulls":4},183,{"$nulls":4},0]
[{"$nulls":4},184,{"$nulls":4},0]
[{"$nulls":4},185,{"$nulls":4},0]
[{"$nulls":4},186,{"$nulls":4},0]
[{"$nulls":4},187,{"$nulls":4},0]
[{"$nulls":4},188,{"$nulls":4},0]
[{"$nulls":4},189,{"$nulls":4},0]
[{"$nulls":4},190,{"$nulls":4},0]
[{"$nulls":4},191,{"$nulls":4},0]
[{"$nulls":4},192,{"$nulls":4},0]
[{"$nulls":4},193,{"$nulls":4},0]
[{"$nulls":4},194,{"$nulls":4},0]
[{"$nulls":4},195,{"$nulls":4},0]
[{"$nulls":4},196,{"$nulls":4},0]
[{"$nulls":4},197,{"$nulls":4},0]
[{"$nulls":4},198,{"$nulls":4},0]
[{"$nulls":4},199,{"$nulls":4},{"$f":"IF(OR(H200=5,H200=10, H200=15, H200=\"BP\",H200=\"SCR\"),\"NT\",I200)","v":0}]
[{"$nulls":4},200,{"$nulls":4},0]
[{"$nulls":4},201,{"$nulls":4},0]
[{"$nulls":4},202,{"$nulls":4},0]
[{"$nulls":4},203,{"$nulls":4},0]
[{"$nulls":4},204,{"$nulls":4},0]
[{"$nulls":4},205,{"$nulls":4},0]
[{"$nulls":4},206,{"$nulls":4},0]
[{"$nulls":4},207,{"$nulls":4},0]
[{"$nulls":4},208,{"$nulls":4},0]
[{"$nulls":4},209,{"$nulls":4},0]
[{"$nulls":4},210,{"$nulls":4},0]
[{"$nulls":4},211,{"$nulls":4},0]
[{"$nulls":4},212,{"$nulls":4},0]
[{"$nulls":4},213,{"$nulls":4},0]
[{"$nulls":4},214,{"$nulls":4},0]
[{"$nulls":4},215,{"$nulls":4},0]
[{"$nulls":4},216,{"$nulls":4},0]
[{"$nulls":4},217,{"$nulls":4},0]
[{"$nulls":4},218,{"$nulls":4},0]
[{"$nulls":4},219,{"$nulls":4},0]
[{"$nulls":4},220,{"$nulls":4},0]
[{"$nulls":4},221,{"$nulls":4},0]
[{"$nulls":4},222,{"$nulls":4},0]
[{"$nulls":4},223,{"$nulls":4},0]
[{"$nulls":4},224,{"$nulls":4},0]
[{"$nulls":4},225,{"$nulls":4},0]
[{"$nulls":4},226,{"$nulls":4},0]
[{"$nulls":4},227,{"$nulls":4},0]
[{"$nulls":4},228,{"$nulls":4},0]
[{"$nulls":4},229,{"$nulls":4},0]
[{"$nulls":4},230,{"$nulls":4},0]
[{"$nulls":4},231,{"$nulls":4},0]
[{"$nulls":4},232,{"$nulls":4},0]
[{"$nulls":4},233,{"$nulls":4},0]
[{"$nulls":4},234,{"$nulls":4},0]
[{"$nulls":4},235,{"$nulls":4},0]
[{"$nulls":4},236,{"$nulls":4},0]
[{"$nulls":4},237,{"$nulls":4},0]
[{"$nulls":4},238,{"$nulls":4},0]
[{"$nulls":4},239,{"$nulls":4},0]
[{"$nulls":4},240,{"$nulls":4},0]
[{"$nulls":4},241,{"$nulls":4},0]
[{"$nulls":4},242,{"$nulls":4},0]
[{"$nulls":4},243,{"$nulls":4},0]
[{"$nulls":4},244,{"$nulls":4},0]
[{"$nulls":4},245,{"$nulls":4},0]
[{"$nulls":4},246,{"$nulls":4},0]
[{"$nulls":4},247,{"$nulls":4},0]
[{"$nulls":4},248,{"$nulls":4},0]
[{"$nulls":4},249,{"$nulls":4},0]
[{"$nulls":4},250,{"$nulls":4},0]
[{"$nulls":4},251,{"$nulls":4},0]
[{"$nulls":4},252,{"$nulls":4},0]
[{"$nulls":4},253,{"$nulls":4},0]
[{"$nulls":4},254,{"$nulls":4},0]
[{"$nulls":4},255,{"$nulls":4},0]
[{"$nulls":4},256,{"$nulls":4},0]
[{"$nulls":4},257,{"$nulls":4},0]
[{"$nulls":4},258,{"$nulls":4},0]
[{"$nulls":4},259,{"$nulls":4},0]
[{"$nulls":4},260,{"$nulls":4},0]
[{"$nulls":4},261,{"$nulls":4},0]
[{"$nulls":4},262,{"$nulls":4},0]
[{"$nulls":4},263,{"$nulls":4},{"$f":"IF(OR(H264=5,H264=10, H264=15, H264=\"BP\",H264=\"SCR\"),\"NT\",I264)","v":0}]
[{"$nulls":4},264,{"$nulls":4},0]
[{"$nulls":4},265,{"$nulls":4},0]
[{"$nulls":4},266,{"$nulls":4},0]
[{"$nulls":4},267,{"$nulls":4},0]
[{"$nulls":4},268,{"$nulls":4},0]
[{"$nulls":4},269,{"$nulls":4},0]
[{"$nulls":4},270,{"$nulls":4},0]
[{"$nulls":4},271,{"$nulls":4},0]
[{"$nulls":4},272,{"$nulls":4},0]
[{"$nulls":4},273,{"$nulls":4},0]
[{"$nulls":4},274,{"$nulls":4},0]
[{"$nulls":4},275,{"$nulls":4},0]
[{"$nulls":4},276,{"$nulls":4},0]
[{"$nulls":4},277,{"$nulls":4},0]
[{"$nulls":4},278,{"$nulls":4},0]
[{"$nulls":4},279,{"$nulls":4},0]
[{"$nulls":4},280,{"$nulls":4},0]
[{"$nulls":4},281,{"$nulls":4},0]
[{"$nulls":4},282,{"$nulls":4},0]
[{"$nulls":4},283,{"$nulls":4},0]
[{"$nulls":4},284,{"$nulls":4},0]
[{"$nulls":4},285,{"$nulls":4},0]
[{"$nulls":4},286,{"$nulls":4},0]
[{"$nulls":4},287,{"$nulls":4},0]
[{"$nulls":4},288,{"$nulls":4},0]
[{"$nulls":4},289,{"$nulls":4},0]
[{"$nulls":4},290,{"$nulls":4},0]
[{"$nulls":4},291,{"$nulls":4},0]
[{"$nulls":4},292,{"$nulls":4},0]
[{"$nulls":4},293,{"$nulls":4},0]
[{"$nulls":4},294,{"$nulls":4},0]
[{"$nulls":4},295,{"$nulls":4},0]
[{"$nulls":4},296,{"$nulls":4},0]
[{"$nulls":4},297,{"$nulls":4},0]
[{"$nulls":4},298,{"$nulls":4},0]
[{"$nulls":4},299,{"$nulls":4},0]
[{"$nulls":4},300,{"$nulls":4},0]

{"sheet":"Youth","index":3,"n_rows":301,"n_cols":11,"rows_kept":301,"cut":false,"hidden":false,"merged":[]}
["Futurity","Der","Age Inct.","BBR","Draw","Rider Name","Horse Name","Pen","Time","Placing","Money Earned"]
[{"$nulls":4},1,"Tristan Bowles","Short Okie Lena",null,15.804,"1D 1st",338]
[{"$nulls":4},2,"Emily Wilkins","Shake It For Tina",null,16.149000000000001,"1D 2nd",226]
[{"$nulls":4},3,"Aspen Adams","Credit The Gin",null,16.265999999999998,"2D 1st",202]
[{"$nulls":4},4,"Emily Welch","Blazin Bay",null,16.274999999999999,"2D 2nd",121]
[{"$nulls":4},5,"Samantha Willoughby","Moose On The Loose",null,16.366,"2D 3rd",94]
[{"$nulls":4},6,"Jolie Smith","Ms Hollywood Delight",null,16.396000000000001]
[{"$nulls":4},7,"Hadley Durfey","Delightful Brownies",null,16.501000000000001]
[{"$nulls":4},8,"Grace Gardiner","Eye On Fame",null,16.555]
[{"$nulls":4},9,"Grace Gardiner","Firewater Kool Eyes",null,16.620999999999999]
[{"$nulls":4},10,"McKenzie Jo Brown","Jae Supreme Lena",null,16.754000000000001]
[{"$nulls":4},11,"Torie Bush","Total Co Motion",null,16.792000000000002]
[{"$nulls":4},12,"Samantha Willoughby","Fabulous Twister",null,16.824999999999999,"3D 1st",134]
[{"$nulls":4},13,"Laurel Allred","Quicks Blue Peppy",null,16.835000000000001,"3D 2nd",81]
[{"$nulls":4},14,"Kimberlee Littlejohn","ICR Painted Chex",null,16.87,"3D 3rd",54]
[{"$nulls":4},15,"Samantha Willoughby","Cash ",null,16.878]
[{"$nulls":4},16,"Emily Wilkins","Stickin Ta Fame",null,16.925999999999998]
[{"$nulls":4},17,"Jolie Smith","Bartender Nics",null,16.956]
[{"$nulls":4},18,"Kimberly Steffen","Frosted Country",null,17]
[{"$nulls":4},19,"Katy Barrett","Breeze Of Sonitalena",null,17.062000000000001]
[{"$nulls":4},20,"Raedyn Brown","Booger Texas Style",null,17.073]
[{"$nulls":4},21,"Makayla Kiser","Bell",null,17.135000000000002]
[{"$nulls":4},22,"Laurel Allred","Rocket Bingoman",null,17.259,"4D 1st",101]
[{"$nulls":4},23,"Makayla Kiser","Huckleberry",null,17.280999999999999,"4D 2nd",60]
[{"$nulls":4},24,"Kimberly Steffen","DJ Chicolena Katie",null,17.288,"4D 3rd",40]
[{"$nulls":4},25,"Trinity Joiner","Highonbrownwhiskey",null,17.347999999999999]
[{"$nulls":4},26,"Hadley Durfey","One Smooth Kelly",null,17.350999999999999]
[{"$nulls":4},27,"Sterling Hopkins","Bling",null,17.407]
[{"$nulls":4},28,"Madelyn Taylor","Specks Boston Velvet",null,17.637]
[{"$nulls":4},29,"Madeleine Moll","Vibrant Stylish Chic",null,17.742999999999999]
[{"$nulls":4},30,"Addison Steed","Commander",null,17.748000000000001]
[{"$nulls":4},31,"Madeleine Moll","Gear'Em Up Nic",null,17.856000000000002]
[{"$nulls":4},32,"Walter Wolf","Liberty",null,18.042999999999999]
[{"$nulls":4},33,"Lili Weaver","Hard Knock Life",null,"broken"]
[{"$nulls":4},34,"Caleb Cline","Guys Dashing Jet",null,"nt15.796"]
[{"$nulls":4},35,"Emily Wilkins","Chasin Easy Money",null,"nt15.859"]
[{"$nulls":4},36,"Brianna Woodmansee","AH Mias Cowboy",null,"nt16.156"]
[{"$nulls":4},37,"Grace Gardiner","Firewater Guy",null,"nt16.346"]
[{"$nulls":4},38,"Josie Hartmann","Hes Honor",null,"nt16.564"]
[{"$nulls":4},39,"Kate Neill","Dox Maga Magnolia",null,"nt16.683"]
[{"$nulls":4},40,"Torie Bush","Wacky Wood",null,"nt16.989"]
[{"$nulls":4},41,"Jadi Jones","Vegas",null,"nt17.018"]
[{"$nulls":4},42,"Kate Neill","NF French Tigger",null,"nt17.591"]
[{"$nulls":4},43,"Taylor Hice","Mac",null,"nt17.734"]
[{"$nulls":4},44,"Haley King","Playboy ",null,"nt17.813"]
[{"$nulls":4},45,"Josie Teague",null,null,"nt17.884"]
[{"$nulls":4},46,"Aspen Adams","Reba",null,"nt18.125"]
[{"$nulls":4},47,"Caleb Cline","SR Moonshine On Rocks",null,"nt18.468"]
[{"$nulls":4},48,"Caleb Cline","Jade Ta Fame",null,"nt18.963"]
[{"$nulls":4},49]
[{"$nulls":4},50]
[{"$nulls":4},51]
[{"$nulls":4},52]
[{"$nulls":4},53]
[{"$nulls":4},54]
[{"$nulls":4},55]
[{"$nulls":4},56]
[{"$nulls":4},57]
[{"$nulls":4},58]
[{"$nulls":4},59]
[{"$nulls":4},60]
[{"$nulls":4},61]
[{"$nulls":4},62]
[{"$nulls":4},63]
[{"$nulls":4},64]
[{"$nulls":4},65]
[{"$nulls":4},66]
[{"$nulls":4},67]
[{"$nulls":4},68]
[{"$nulls":4},69]
[{"$nulls":4},70]
[{"$nulls":4},71]
[{"$nulls":4},72]
[{"$nulls":4},73]
[{"$nulls":4},74]
[{"$nulls":4},75]
[{"$nulls":4},76]
[{"$nulls":4},77]
[{"$nulls":4},78]
[{"$nulls":4},79]
[{"$nulls":4},80]
[{"$nulls":4},81]
[{"$nulls":4},82]
[{"$nulls":4},83]
[{"$nulls":4},84]
[{"$nulls":4},85]
[{"$nulls":4},86]
[{"$nulls":4},87]
[{"$nulls":4},88]
[{"$nulls":4},89]
[{"$nulls":4},90]
[{"$nulls":4},91]
[{"$nulls":4},92]
[{"$nulls":4},93]
[{"$nulls":4},94]
[{"$nulls":4},95]
[{"$nulls":4},96]
[{"$nulls":4},97]
[{"$nulls":4},98]
[{"$nulls":4},99]
[{"$nulls":4},100]
[{"$nulls":4},101]
[{"$nulls":4},102]
[{"$nulls":4},103]
[{"$nulls":4},104]
[{"$nulls":4},105]
[{"$nulls":4},106]
[{"$nulls":4},107]
[{"$nulls":4},108]
[{"$nulls":4},109]
[{"$nulls":4},110]
[{"$nulls":4},111]
[{"$nulls":4},112]
[{"$nulls":4},113]
[{"$nulls":4},114]
[{"$nulls":4},115]
[{"$nulls":4},116]
[{"$nulls":4},117]
[{"$nulls":4},118]
[{"$nulls":4},119]
[{"$nulls":4},120]
[{"$nulls":4},121]
[{"$nulls":4},122]
[{"$nulls":4},123]
[{"$nulls":4},124]
[{"$nulls":4},125]
[{"$nulls":4},126]
[{"$nulls":4},127]
[{"$nulls":4},128]
[{"$nulls":4},129]
[{"$nulls":4},130]
[{"$nulls":4},131]
[{"$nulls":4},132]
[{"$nulls":4},133]
[{"$nulls":4},134]
[{"$nulls":4},135]
[{"$nulls":4},136]
[{"$nulls":4},137]
[{"$nulls":4},138]
[{"$nulls":4},139]
[{"$nulls":4},140]
[{"$nulls":4},141]
[{"$nulls":4},142]
[{"$nulls":4},143]
[{"$nulls":4},144]
[{"$nulls":4},145]
[{"$nulls":4},146]
[{"$nulls":4},147]
[{"$nulls":4},148]
[{"$nulls":4},149]
[{"$nulls":4},150]
[{"$nulls":4},151]
[{"$nulls":4},152]
[{"$nulls":4},153]
[{"$nulls":4},154]
[{"$nulls":4},155]
[{"$nulls":4},156]
[{"$nulls":4},157]
[{"$nulls":4},158]
[{"$nulls":4},159]
[{"$nulls":4},160]
[{"$nulls":4},161]
[{"$nulls":4},162]
[{"$nulls":4},163]
[{"$nulls":4},164]
[{"$nulls":4},165]
[{"$nulls":4},166]
[{"$nulls":4},167]
[{"$nulls":4},168]
[{"$nulls":4},169]
[{"$nulls":4},170]
[{"$nulls":4},171]
[{"$nulls":4},172]
[{"$nulls":4},173]
[{"$nulls":4},174]
[{"$nulls":4},175]
[{"$nulls":4},176]
[{"$nulls":4},177]
[{"$nulls":4},178]
[{"$nulls":4},179]
[{"$nulls":4},180]
[{"$nulls":4},181]
[{"$nulls":4},182]
[{"$nulls":4},183]
[{"$nulls":4},184]
[{"$nulls":4},185]
[{"$nulls":4},186]
[{"$nulls":4},187]
[{"$nulls":4},188]
[{"$nulls":4},189]
[{"$nulls":4},190]
[{"$nulls":4},191]
[{"$nulls":4},192]
[{"$nulls":4},193]
[{"$nulls":4},194]
[{"$nulls":4},195]
[{"$nulls":4},196]
[{"$nulls":4},197]
[{"$nulls":4},198]
[{"$nulls":4},199]
[{"$nulls":4},200]
[{"$nulls":4},201]
[{"$nulls":4},202]
[{"$nulls":4},203]
[{"$nulls":4},204]
[{"$nulls":4},205]
[{"$nulls":4},206]
[{"$nulls":4},207]
[{"$nulls":4},208]
[{"$nulls":4},209]
[{"$nulls":4},210]
[{"$nulls":4},211]
[{"$nulls":4},212]
[{"$nulls":4},213]
[{"$nulls":4},214]
[{"$nulls":4},215]
[{"$nulls":4},216]
[{"$nulls":4},217]
[{"$nulls":4},218]
[{"$nulls":4},219]
[{"$nulls":4},220]
[{"$nulls":4},221]
[{"$nulls":4},222]
[{"$nulls":4},223]
[{"$nulls":4},224]
[{"$nulls":4},225]
[{"$nulls":4},226]
[{"$nulls":4},227]
[{"$nulls":4},228]
[{"$nulls":4},229]
[{"$nulls":4},230]
[{"$nulls":4},231]
[{"$nulls":4},232]
[{"$nulls":4},233]
[{"$nulls":4},234]
[{"$nulls":4},235]
[{"$nulls":4},236]
[{"$nulls":4},237]
[{"$nulls":4},238]
[{"$nulls":4},239]
[{"$nulls":4},240]
[{"$nulls":4},241]
[{"$nulls":4},242]
[{"$nulls":4},243]
[{"$nulls":4},244]
[{"$nulls":4},245]
[{"$nulls":4},246]
[{"$nulls":4},247]
[{"$nulls":4},248]
[{"$nulls":4},249]
[{"$nulls":4},250]
[{"$nulls":4},251]
[{"$nulls":4},252]
[{"$nulls":4},253]
[{"$nulls":4},254]
[{"$nulls":4},255]
[{"$nulls":4},256]
[{"$nulls":4},257]
[{"$nulls":4},258]
[{"$nulls":4},259]
[{"$nulls":4},260]
[{"$nulls":4},261]
[{"$nulls":4},262]
[{"$nulls":4},263]
[{"$nulls":4},264]
[{"$nulls":4},265]
[{"$nulls":4},266]
[{"$nulls":4},267]
[{"$nulls":4},268]
[{"$nulls":4},269]
[{"$nulls":4},270]
[{"$nulls":4},271]
[{"$nulls":4},272]
[{"$nulls":4},273]
[{"$nulls":4},274]
[{"$nulls":4},275]
[{"$nulls":4},276]
[{"$nulls":4},277]
[{"$nulls":4},278]
[{"$nulls":4},279]
[{"$nulls":4},280]
[{"$nulls":4},281]
[{"$nulls":4},282]
[{"$nulls":4},283]
[{"$nulls":4},284]
[{"$nulls":4},285]
[{"$nulls":4},286]
[{"$nulls":4},287]
[{"$nulls":4},288]
[{"$nulls":4},289]
[{"$nulls":4},290]
[{"$nulls":4},291]
[{"$nulls":4},292]
[{"$nulls":4},293]
[{"$nulls":4},294]
[{"$nulls":4},295]
[{"$nulls":4},296]
[{"$nulls":4},297]
[{"$nulls":4},298]
[{"$nulls":4},299]
[{"$nulls":4},300]

{"sheet":"Derby","index":4,"n_rows":299,"n_cols":12,"rows_kept":299,"cut":false,"hidden":false,"merged":[]}
["Futurity","Der","Age Inct.","BBR","Draw","Rider Name","Horse Name","c/o","Time","Final Time","Placing","Money Earned"]
[{"$nulls":4},1,"Cassidy Teague","Tres Socks",null,15.712,null,"1st",312]
[{"$nulls":4},2,"SHeaLynn McConnel","Smooth N Heavenly",null,15.731999999999999,null,"2nd",260]
[{"$nulls":4},3,"Emma Abbott","Rr Too Slick Eye Mist",null,15.874000000000001,null,"3rd",208]
[{"$nulls":4},4,"Billie Ann Harmon","Me Flingin Diamonds",null,15.89,null,"4th",156]
[{"$nulls":4},5,"Ryann Pedone","Streakers Queen",null,15.919,null,"5th",104]
[{"$nulls":4},6,"Brittany Pierson","CF Dash N Dirty",null,15.999000000000001]
[{"$nulls":4},7,"Ashley Schafer","French Streaking Slew",null,16.166]
[{"$nulls":4},8,"Lauren Strough","Dineros Spare Change",null,16.216000000000001]
[{"$nulls":4},9,"Ashley Schafer","Bobby McGee",null,16.277000000000001]
[{"$nulls":4},10,"Phillip Kenyon","Make It A Mojito",null,16.506]
[{"$nulls":4},11,"Savanna Morgan","Bout To Get Reckless",null,16.523]
[{"$nulls":4},12,"Jessica Mullins","Kakunamatadi",null,16.911000000000001]
[{"$nulls":4},13,"Tiffany Lujan","VF Designer Pants",null,17.413]
[{"$nulls":4},14,"Tiffany Lujan","Chase My Ace",null,18.242999999999999]
[{"$nulls":4},15,"Stevi Hillman","DTF Texas Moon",null,"nt15.967"]
[{"$nulls":4},16,"Martha Jordan","MV Fury Of The Fame",null,"nt16.128"]
[{"$nulls":4},17,"Krista Whitley","Fabulace Fame",null,"nt16.373"]
[{"$nulls":4},18,"Nisa Berry","A Kings Fmaous Fling",null,"nt16.388",{"$f":"IF(OR(H19=5,H19=10, H19=15, H19=\"BP\",H19=\"SCR\"),\"NT\",I19)","v":"nt16.388"}]
[{"$nulls":4},19,"Jamie Olsen","Miss Famous Beduino",null,"nt16.474","nt16.474"]
[{"$nulls":4},20,"Christi Durfey","Jess Blazin Otoe",null,"nt16.493","nt16.493"]
[{"$nulls":4},23,"Brittany Pierson","Guyko",null,"nt16.550","nt16.550"]
[{"$nulls":4},24,"Wyatt Paul","FC Strait Cajun",null,"nt17.781","nt17.781"]
[{"$nulls":4},25,"Caleb Cline","SR Moonshine On Rocks",null,"nt18.468","nt18.468"]
[{"$nulls":4},26,"Caleb Cline","Jade Ta Fame",null,"nt18.963","nt18.963"]
[{"$nulls":4},27,{"$nulls":4},0]
[{"$nulls":4},28,{"$nulls":4},0]
[{"$nulls":4},29,{"$nulls":4},0]
[{"$nulls":4},30,{"$nulls":4},0]
[{"$nulls":4},31,{"$nulls":4},0]
[{"$nulls":4},32,{"$nulls":4},0]
[{"$nulls":4},33,{"$nulls":4},0]
[{"$nulls":4},34,{"$nulls":4},0]
[{"$nulls":4},35,{"$nulls":4},0]
[{"$nulls":4},36,{"$nulls":4},0]
[{"$nulls":4},37,{"$nulls":4},0]
[{"$nulls":4},38,{"$nulls":4},0]
[{"$nulls":4},39,{"$nulls":4},0]
[{"$nulls":4},40,{"$nulls":4},0]
[{"$nulls":4},41,{"$nulls":4},0]
[{"$nulls":4},42,{"$nulls":4},0]
[{"$nulls":4},43,{"$nulls":4},0]
[{"$nulls":4},44,{"$nulls":4},0]
[{"$nulls":4},45,{"$nulls":4},0]
[{"$nulls":4},46,{"$nulls":4},0]
[{"$nulls":4},47,{"$nulls":4},0]
[{"$nulls":4},48,{"$nulls":4},0]
[{"$nulls":4},49,{"$nulls":4},0]
[{"$nulls":4},50,{"$nulls":4},0]
[{"$nulls":4},51,{"$nulls":4},0]
[{"$nulls":4},52,{"$nulls":4},0]
[{"$nulls":4},53,{"$nulls":4},0]
[{"$nulls":4},54,{"$nulls":4},0]
[{"$nulls":4},55,{"$nulls":4},0]
[{"$nulls":4},56,{"$nulls":4},0]
[{"$nulls":4},57,{"$nulls":4},0]
[{"$nulls":4},58,{"$nulls":4},0]
[{"$nulls":4},59,{"$nulls":4},0]
[{"$nulls":4},60,{"$nulls":4},0]
[{"$nulls":4},61,{"$nulls":4},0]
[{"$nulls":4},62,{"$nulls":4},0]
[{"$nulls":4},63,{"$nulls":4},0]
[{"$nulls":4},64,{"$nulls":4},0]
[{"$nulls":4},65,{"$nulls":4},0]
[{"$nulls":4},66,{"$nulls":4},0]
[{"$nulls":4},67,{"$nulls":4},0]
[{"$nulls":4},68,{"$nulls":4},0]
[{"$nulls":4},69,{"$nulls":4},0]
[{"$nulls":4},70,{"$nulls":4},0]
[{"$nulls":4},71,{"$nulls":4},0]
[{"$nulls":4},72,{"$nulls":4},0]
[{"$nulls":4},73,{"$nulls":4},0]
[{"$nulls":4},74,{"$nulls":4},0]
[{"$nulls":4},75,{"$nulls":4},0]
[{"$nulls":4},76,{"$nulls":4},0]
[{"$nulls":4},77,{"$nulls":4},0]
[{"$nulls":4},78,{"$nulls":4},0]
[{"$nulls":4},79,{"$nulls":4},0]
[{"$nulls":4},80,{"$nulls":4},0]
[{"$nulls":4},81,{"$nulls":4},{"$f":"IF(OR(H80=5,H80=10, H80=15, H80=\"BP\",H80=\"SCR\"),\"NT\",I80)","v":0}]
[{"$nulls":4},82,{"$nulls":4},0]
[{"$nulls":4},83,{"$nulls":4},0]
[{"$nulls":4},84,{"$nulls":4},0]
[{"$nulls":4},85,{"$nulls":4},0]
[{"$nulls":4},86,{"$nulls":4},0]
[{"$nulls":4},87,{"$nulls":4},0]
[{"$nulls":4},88,{"$nulls":4},0]
[{"$nulls":4},89,{"$nulls":4},0]
[{"$nulls":4},90,{"$nulls":4},0]
[{"$nulls":4},91,{"$nulls":4},0]
[{"$nulls":4},92,{"$nulls":4},0]
[{"$nulls":4},93,{"$nulls":4},0]
[{"$nulls":4},94,{"$nulls":4},0]
[{"$nulls":4},95,{"$nulls":4},0]
[{"$nulls":4},96,{"$nulls":4},0]
[{"$nulls":4},97,{"$nulls":4},0]
[{"$nulls":4},98,{"$nulls":4},0]
[{"$nulls":4},99,{"$nulls":4},0]
[{"$nulls":4},100,{"$nulls":4},0]
[{"$nulls":4},101,{"$nulls":4},0]
[{"$nulls":4},102,{"$nulls":4},0]
[{"$nulls":4},103,{"$nulls":4},0]
[{"$nulls":4},104,{"$nulls":4},0]
[{"$nulls":4},105,{"$nulls":4},0]
[{"$nulls":4},106,{"$nulls":4},0]
[{"$nulls":4},107,{"$nulls":4},0]
[{"$nulls":4},108,{"$nulls":4},0]
[{"$nulls":4},109,{"$nulls":4},0]
[{"$nulls":4},110,{"$nulls":4},0]
[{"$nulls":4},111,{"$nulls":4},0]
[{"$nulls":4},112,{"$nulls":4},0]
[{"$nulls":4},113,{"$nulls":4},0]
[{"$nulls":4},114,{"$nulls":4},0]
[{"$nulls":4},115,{"$nulls":4},0]
[{"$nulls":4},116,{"$nulls":4},0]
[{"$nulls":4},117,{"$nulls":4},0]
[{"$nulls":4},118,{"$nulls":4},0]
[{"$nulls":4},119,{"$nulls":4},0]
[{"$nulls":4},120,{"$nulls":4},0]
[{"$nulls":4},121,{"$nulls":4},0]
[{"$nulls":4},122,{"$nulls":4},0]
[{"$nulls":4},123,{"$nulls":4},0]
[{"$nulls":4},124,{"$nulls":4},0]
[{"$nulls":4},125,{"$nulls":4},0]
[{"$nulls":4},126,{"$nulls":4},0]
[{"$nulls":4},127,{"$nulls":4},0]
[{"$nulls":4},128,{"$nulls":4},0]
[{"$nulls":4},129,{"$nulls":4},0]
[{"$nulls":4},130,{"$nulls":4},0]
[{"$nulls":4},131,{"$nulls":4},0]
[{"$nulls":4},132,{"$nulls":4},0]
[{"$nulls":4},133,{"$nulls":4},0]
[{"$nulls":4},134,{"$nulls":4},0]
[{"$nulls":4},135,{"$nulls":4},0]
[{"$nulls":4},136,{"$nulls":4},0]
[{"$nulls":4},137,{"$nulls":4},0]
[{"$nulls":4},138,{"$nulls":4},0]
[{"$nulls":4},139,{"$nulls":4},0]
[{"$nulls":4},140,{"$nulls":4},0]
[{"$nulls":4},141,{"$nulls":4},0]
[{"$nulls":4},142,{"$nulls":4},0]
[{"$nulls":4},143,{"$nulls":4},0]
[{"$nulls":4},144,{"$nulls":4},0]
[{"$nulls":4},145,{"$nulls":4},{"$f":"IF(OR(H144=5,H144=10, H144=15, H144=\"BP\",H144=\"SCR\"),\"NT\",I144)","v":0}]
[{"$nulls":4},146,{"$nulls":4},0]
[{"$nulls":4},147,{"$nulls":4},0]
[{"$nulls":4},148,{"$nulls":4},0]
[{"$nulls":4},149,{"$nulls":4},0]
[{"$nulls":4},150,{"$nulls":4},0]
[{"$nulls":4},151,{"$nulls":4},0]
[{"$nulls":4},152,{"$nulls":4},0]
[{"$nulls":4},153,{"$nulls":4},0]
[{"$nulls":4},154,{"$nulls":4},0]
[{"$nulls":4},155,{"$nulls":4},0]
[{"$nulls":4},156,{"$nulls":4},0]
[{"$nulls":4},157,{"$nulls":4},0]
[{"$nulls":4},158,{"$nulls":4},0]
[{"$nulls":4},159,{"$nulls":4},0]
[{"$nulls":4},160,{"$nulls":4},0]
[{"$nulls":4},161,{"$nulls":4},0]
[{"$nulls":4},162,{"$nulls":4},0]
[{"$nulls":4},163,{"$nulls":4},0]
[{"$nulls":4},164,{"$nulls":4},0]
[{"$nulls":4},165,{"$nulls":4},0]
[{"$nulls":4},166,{"$nulls":4},0]
[{"$nulls":4},167,{"$nulls":4},0]
[{"$nulls":4},168,{"$nulls":4},0]
[{"$nulls":4},169,{"$nulls":4},0]
[{"$nulls":4},170,{"$nulls":4},0]
[{"$nulls":4},171,{"$nulls":4},0]
[{"$nulls":4},172,{"$nulls":4},0]
[{"$nulls":4},173,{"$nulls":4},0]
[{"$nulls":4},174,{"$nulls":4},0]
[{"$nulls":4},175,{"$nulls":4},0]
[{"$nulls":4},176,{"$nulls":4},0]
[{"$nulls":4},177,{"$nulls":4},0]
[{"$nulls":4},178,{"$nulls":4},0]
[{"$nulls":4},179,{"$nulls":4},0]
[{"$nulls":4},180,{"$nulls":4},0]
[{"$nulls":4},181,{"$nulls":4},0]
[{"$nulls":4},182,{"$nulls":4},0]
[{"$nulls":4},183,{"$nulls":4},0]
[{"$nulls":4},184,{"$nulls":4},0]
[{"$nulls":4},185,{"$nulls":4},0]
[{"$nulls":4},186,{"$nulls":4},0]
[{"$nulls":4},187,{"$nulls":4},0]
[{"$nulls":4},188,{"$nulls":4},0]
[{"$nulls":4},189,{"$nulls":4},0]
[{"$nulls":4},190,{"$nulls":4},0]
[{"$nulls":4},191,{"$nulls":4},0]
[{"$nulls":4},192,{"$nulls":4},0]
[{"$nulls":4},193,{"$nulls":4},0]
[{"$nulls":4},194,{"$nulls":4},0]
[{"$nulls":4},195,{"$nulls":4},0]
[{"$nulls":4},196,{"$nulls":4},0]
[{"$nulls":4},197,{"$nulls":4},0]
[{"$nulls":4},198,{"$nulls":4},0]
[{"$nulls":4},199,{"$nulls":4},0]
[{"$nulls":4},200,{"$nulls":4},0]
[{"$nulls":4},201,{"$nulls":4},0]
[{"$nulls":4},202,{"$nulls":4},0]
[{"$nulls":4},203,{"$nulls":4},0]
[{"$nulls":4},204,{"$nulls":4},0]
[{"$nulls":4},205,{"$nulls":4},0]
[{"$nulls":4},206,{"$nulls":4},0]
[{"$nulls":4},207,{"$nulls":4},0]
[{"$nulls":4},208,{"$nulls":4},0]
[{"$nulls":4},209,{"$nulls":4},{"$f":"IF(OR(H208=5,H208=10, H208=15, H208=\"BP\",H208=\"SCR\"),\"NT\",I208)","v":0}]
[{"$nulls":4},210,{"$nulls":4},0]
[{"$nulls":4},211,{"$nulls":4},0]
[{"$nulls":4},212,{"$nulls":4},0]
[{"$nulls":4},213,{"$nulls":4},0]
[{"$nulls":4},214,{"$nulls":4},0]
[{"$nulls":4},215,{"$nulls":4},0]
[{"$nulls":4},216,{"$nulls":4},0]
[{"$nulls":4},217,{"$nulls":4},0]
[{"$nulls":4},218,{"$nulls":4},0]
[{"$nulls":4},219,{"$nulls":4},0]
[{"$nulls":4},220,{"$nulls":4},0]
[{"$nulls":4},221,{"$nulls":4},0]
[{"$nulls":4},222,{"$nulls":4},0]
[{"$nulls":4},223,{"$nulls":4},0]
[{"$nulls":4},224,{"$nulls":4},0]
[{"$nulls":4},225,{"$nulls":4},0]
[{"$nulls":4},226,{"$nulls":4},0]
[{"$nulls":4},227,{"$nulls":4},0]
[{"$nulls":4},228,{"$nulls":4},0]
[{"$nulls":4},229,{"$nulls":4},0]
[{"$nulls":4},230,{"$nulls":4},0]
[{"$nulls":4},231,{"$nulls":4},0]
[{"$nulls":4},232,{"$nulls":4},0]
[{"$nulls":4},233,{"$nulls":4},0]
[{"$nulls":4},234,{"$nulls":4},0]
[{"$nulls":4},235,{"$nulls":4},0]
[{"$nulls":4},236,{"$nulls":4},0]
[{"$nulls":4},237,{"$nulls":4},0]
[{"$nulls":4},238,{"$nulls":4},0]
[{"$nulls":4},239,{"$nulls":4},0]
[{"$nulls":4},240,{"$nulls":4},0]
[{"$nulls":4},241,{"$nulls":4},0]
[{"$nulls":4},242,{"$nulls":4},0]
[{"$nulls":4},243,{"$nulls":4},0]
[{"$nulls":4},244,{"$nulls":4},0]
[{"$nulls":4},245,{"$nulls":4},0]
[{"$nulls":4},246,{"$nulls":4},0]
[{"$nulls":4},247,{"$nulls":4},0]
[{"$nulls":4},248,{"$nulls":4},0]
[{"$nulls":4},249,{"$nulls":4},0]
[{"$nulls":4},250,{"$nulls":4},0]
[{"$nulls":4},251,{"$nulls":4},0]
[{"$nulls":4},252,{"$nulls":4},0]
[{"$nulls":4},253,{"$nulls":4},0]
[{"$nulls":4},254,{"$nulls":4},0]
[{"$nulls":4},255,{"$nulls":4},0]
[{"$nulls":4},256,{"$nulls":4},0]
[{"$nulls":4},257,{"$nulls":4},0]
[{"$nulls":4},258,{"$nulls":4},0]
[{"$nulls":4},259,{"$nulls":4},0]
[{"$nulls":4},260,{"$nulls":4},0]
[{"$nulls":4},261,{"$nulls":4},0]
[{"$nulls":4},262,{"$nulls":4},0]
[{"$nulls":4},263,{"$nulls":4},0]
[{"$nulls":4},264,{"$nulls":4},0]
[{"$nulls":4},265,{"$nulls":4},0]
[{"$nulls":4},266,{"$nulls":4},0]
[{"$nulls":4},267,{"$nulls":4},0]
[{"$nulls":4},268,{"$nulls":4},0]
[{"$nulls":4},269,{"$nulls":4},0]
[{"$nulls":4},270,{"$nulls":4},0]
[{"$nulls":4},271,{"$nulls":4},0]
[{"$nulls":4},272,{"$nulls":4},0]
[{"$nulls":4},273,{"$nulls":4},{"$f":"IF(OR(H272=5,H272=10, H272=15, H272=\"BP\",H272=\"SCR\"),\"NT\",I272)","v":0}]
[{"$nulls":4},274,{"$nulls":4},0]
[{"$nulls":4},275,{"$nulls":4},0]
[{"$nulls":4},276,{"$nulls":4},0]
[{"$nulls":4},277,{"$nulls":4},0]
[{"$nulls":4},278,{"$nulls":4},0]
[{"$nulls":4},279,{"$nulls":4},0]
[{"$nulls":4},280,{"$nulls":4},0]
[{"$nulls":4},281,{"$nulls":4},0]
[{"$nulls":4},282,{"$nulls":4},0]
[{"$nulls":4},283,{"$nulls":4},0]
[{"$nulls":4},284,{"$nulls":4},0]
[{"$nulls":4},285,{"$nulls":4},0]
[{"$nulls":4},286,{"$nulls":4},0]
[{"$nulls":4},287,{"$nulls":4},0]
[{"$nulls":4},288,{"$nulls":4},0]
[{"$nulls":4},289,{"$nulls":4},0]
[{"$nulls":4},290,{"$nulls":4},0]
[{"$nulls":4},291,{"$nulls":4},0]
[{"$nulls":4},292,{"$nulls":4},0]
[{"$nulls":4},293,{"$nulls":4},0]
[{"$nulls":4},294,{"$nulls":4},0]
[{"$nulls":4},295,{"$nulls":4},0]
[{"$nulls":4},296,{"$nulls":4},0]
[{"$nulls":4},297,{"$nulls":4},0]
[{"$nulls":4},298,{"$nulls":4},0]
[{"$nulls":4},299,{"$nulls":4},0]
[{"$nulls":4},300,{"$nulls":4},0]

{"sheet":"High Stakes","index":5,"n_rows":301,"n_cols":12,"rows_kept":301,"cut":false,"hidden":false,"merged":[]}
["Futurity","Der","Age Inct.","BBR","Draw","Rider Name","Horse Name","c/o","Time","Final Time","Placing","Money Earned"]
[{"$nulls":4},1,"Stevi Hillman","Quatro Fame",null,15.664999999999999,null,"1D 1st",432]
[{"$nulls":4},2,"Cassidy Teague","Tres Socks",null,15.712,null,"1D 2nd",288]
[{"$nulls":4},3,"SHeaLynn McConnel","Smooth N Heavenly",null,15.731999999999999]
[{"$nulls":4},4,"Caroline Kelly","Hesa Dashin Dreamer",null,15.742000000000001]
[{"$nulls":4},5,"Andrea Busby","Famous Heartbreaker",null,15.821999999999999]
[{"$nulls":4},6,"Jimmie Smith","Marthas Bullion",null,15.891]
[{"$nulls":4},7,"Alyssa Urbanek","Fueled With Dinero",null,"nt16.048"]
[{"$nulls":4},8,"Jimmie Smith","Lever Action",null,"nt16.129"]
[{"$nulls":4},9,"Rylee Hardin","Tiffany",null,"nt16.936"]
[{"$nulls":4},10]
[{"$nulls":4},11]
[{"$nulls":4},12]
[{"$nulls":4},13]
[{"$nulls":4},14]
[{"$nulls":4},15]
[{"$nulls":4},16]
[{"$nulls":4},17]
[{"$nulls":4},18]
[{"$nulls":4},19]
[{"$nulls":4},20]
[{"$nulls":4},21]
[{"$nulls":4},22]
[{"$nulls":4},23]
[{"$nulls":4},24]
[{"$nulls":4},25]
[{"$nulls":4},26]
[{"$nulls":4},27]
[{"$nulls":4},28]
[{"$nulls":4},29]
[{"$nulls":4},30]
[{"$nulls":4},31]
[{"$nulls":4},32]
[{"$nulls":4},33]
[{"$nulls":4},34]
[{"$nulls":4},35]
[{"$nulls":4},36]
[{"$nulls":4},37]
[{"$nulls":4},38]
[{"$nulls":4},39,{"$nulls":4},{"$f":"IF(OR(H40=5,H40=10, H40=15, H40=\"BP\",H40=\"SCR\"),\"NT\",I40)","v":0}]
[{"$nulls":4},40,{"$nulls":4},0]
[{"$nulls":4},41,{"$nulls":4},0]
[{"$nulls":4},42,{"$nulls":4},0]
[{"$nulls":4},43,{"$nulls":4},0]
[{"$nulls":4},44,{"$nulls":4},0]
[{"$nulls":4},45,{"$nulls":4},0]
[{"$nulls":4},46,{"$nulls":4},0]
[{"$nulls":4},47,{"$nulls":4},0]
[{"$nulls":4},48,{"$nulls":4},0]
[{"$nulls":4},49,{"$nulls":4},0]
[{"$nulls":4},50,{"$nulls":4},0]
[{"$nulls":4},51,{"$nulls":4},0]
[{"$nulls":4},52,{"$nulls":4},0]
[{"$nulls":4},53,{"$nulls":4},0]
[{"$nulls":4},54,{"$nulls":4},0]
[{"$nulls":4},55,{"$nulls":4},0]
[{"$nulls":4},56,{"$nulls":4},0]
[{"$nulls":4},57,{"$nulls":4},0]
[{"$nulls":4},58,{"$nulls":4},0]
[{"$nulls":4},59,{"$nulls":4},0]
[{"$nulls":4},60,{"$nulls":4},0]
[{"$nulls":4},61,{"$nulls":4},0]
[{"$nulls":4},62,{"$nulls":4},0]
[{"$nulls":4},63,{"$nulls":4},0]
[{"$nulls":4},64,{"$nulls":4},0]
[{"$nulls":4},65,{"$nulls":4},0]
[{"$nulls":4},66,{"$nulls":4},0]
[{"$nulls":4},67,{"$nulls":4},0]
[{"$nulls":4},68,{"$nulls":4},0]
[{"$nulls":4},69,{"$nulls":4},0]
[{"$nulls":4},70,{"$nulls":4},0]
[{"$nulls":4},71,{"$nulls":4},0]
[{"$nulls":4},72,{"$nulls":4},0]
[{"$nulls":4},73,{"$nulls":4},0]
[{"$nulls":4},74,{"$nulls":4},0]
[{"$nulls":4},75,{"$nulls":4},0]
[{"$nulls":4},76,{"$nulls":4},0]
[{"$nulls":4},77,{"$nulls":4},0]
[{"$nulls":4},78,{"$nulls":4},0]
[{"$nulls":4},79,{"$nulls":4},0]
[{"$nulls":4},80,{"$nulls":4},0]
[{"$nulls":4},81,{"$nulls":4},0]
[{"$nulls":4},82,{"$nulls":4},0]
[{"$nulls":4},83,{"$nulls":4},0]
[{"$nulls":4},84,{"$nulls":4},0]
[{"$nulls":4},85,{"$nulls":4},0]
[{"$nulls":4},86,{"$nulls":4},0]
[{"$nulls":4},87,{"$nulls":4},0]
[{"$nulls":4},88,{"$nulls":4},0]
[{"$nulls":4},89,{"$nulls":4},0]
[{"$nulls":4},90,{"$nulls":4},0]
[{"$nulls":4},91,{"$nulls":4},0]
[{"$nulls":4},92,{"$nulls":4},0]
[{"$nulls":4},93,{"$nulls":4},0]
[{"$nulls":4},94,{"$nulls":4},0]
[{"$nulls":4},95,{"$nulls":4},0]
[{"$nulls":4},96,{"$nulls":4},0]
[{"$nulls":4},97,{"$nulls":4},0]
[{"$nulls":4},98,{"$nulls":4},0]
[{"$nulls":4},99,{"$nulls":4},0]
[{"$nulls":4},100,{"$nulls":4},0]
[{"$nulls":4},101,{"$nulls":4},0]
[{"$nulls":4},102,{"$nulls":4},0]
[{"$nulls":4},103,{"$nulls":4},{"$f":"IF(OR(H104=5,H104=10, H104=15, H104=\"BP\",H104=\"SCR\"),\"NT\",I104)","v":0}]
[{"$nulls":4},104,{"$nulls":4},0]
[{"$nulls":4},105,{"$nulls":4},0]
[{"$nulls":4},106,{"$nulls":4},0]
[{"$nulls":4},107,{"$nulls":4},0]
[{"$nulls":4},108,{"$nulls":4},0]
[{"$nulls":4},109,{"$nulls":4},0]
[{"$nulls":4},110,{"$nulls":4},0]
[{"$nulls":4},111,{"$nulls":4},0]
[{"$nulls":4},112,{"$nulls":4},0]
[{"$nulls":4},113,{"$nulls":4},0]
[{"$nulls":4},114,{"$nulls":4},0]
[{"$nulls":4},115,{"$nulls":4},0]
[{"$nulls":4},116,{"$nulls":4},0]
[{"$nulls":4},117,{"$nulls":4},0]
[{"$nulls":4},118,{"$nulls":4},0]
[{"$nulls":4},119,{"$nulls":4},0]
[{"$nulls":4},120,{"$nulls":4},0]
[{"$nulls":4},121,{"$nulls":4},0]
[{"$nulls":4},122,{"$nulls":4},0]
[{"$nulls":4},123,{"$nulls":4},0]
[{"$nulls":4},124,{"$nulls":4},0]
[{"$nulls":4},125,{"$nulls":4},0]
[{"$nulls":4},126,{"$nulls":4},0]
[{"$nulls":4},127,{"$nulls":4},0]
[{"$nulls":4},128,{"$nulls":4},0]
[{"$nulls":4},129,{"$nulls":4},0]
[{"$nulls":4},130,{"$nulls":4},0]
[{"$nulls":4},131,{"$nulls":4},0]
[{"$nulls":4},132,{"$nulls":4},0]
[{"$nulls":4},133,{"$nulls":4},0]
[{"$nulls":4},134,{"$nulls":4},0]
[{"$nulls":4},135,{"$nulls":4},0]
[{"$nulls":4},136,{"$nulls":4},0]
[{"$nulls":4},137,{"$nulls":4},0]
[{"$nulls":4},138,{"$nulls":4},0]
[{"$nulls":4},139,{"$nulls":4},0]
[{"$nulls":4},140,{"$nulls":4},0]
[{"$nulls":4},141,{"$nulls":4},0]
[{"$nulls":4},142,{"$nulls":4},0]
[{"$nulls":4},143,{"$nulls":4},0]
[{"$nulls":4},144,{"$nulls":4},0]
[{"$nulls":4},145,{"$nulls":4},0]
[{"$nulls":4},146,{"$nulls":4},0]
[{"$nulls":4},147,{"$nulls":4},0]
[{"$nulls":4},148,{"$nulls":4},0]
[{"$nulls":4},149,{"$nulls":4},0]
[{"$nulls":4},150,{"$nulls":4},0]
[{"$nulls":4},151,{"$nulls":4},0]
[{"$nulls":4},152,{"$nulls":4},0]
[{"$nulls":4},153,{"$nulls":4},0]
[{"$nulls":4},154,{"$nulls":4},0]
[{"$nulls":4},155,{"$nulls":4},0]
[{"$nulls":4},156,{"$nulls":4},0]
[{"$nulls":4},157,{"$nulls":4},0]
[{"$nulls":4},158,{"$nulls":4},0]
[{"$nulls":4},159,{"$nulls":4},0]
[{"$nulls":4},160,{"$nulls":4},0]
[{"$nulls":4},161,{"$nulls":4},0]
[{"$nulls":4},162,{"$nulls":4},0]
[{"$nulls":4},163,{"$nulls":4},0]
[{"$nulls":4},164,{"$nulls":4},0]
[{"$nulls":4},165,{"$nulls":4},0]
[{"$nulls":4},166,{"$nulls":4},0]
[{"$nulls":4},167,{"$nulls":4},{"$f":"IF(OR(H168=5,H168=10, H168=15, H168=\"BP\",H168=\"SCR\"),\"NT\",I168)","v":0}]
[{"$nulls":4},168,{"$nulls":4},0]
[{"$nulls":4},169,{"$nulls":4},0]
[{"$nulls":4},170,{"$nulls":4},0]
[{"$nulls":4},171,{"$nulls":4},0]
[{"$nulls":4},172,{"$nulls":4},0]
[{"$nulls":4},173,{"$nulls":4},0]
[{"$nulls":4},174,{"$nulls":4},0]
[{"$nulls":4},175,{"$nulls":4},0]
[{"$nulls":4},176,{"$nulls":4},0]
[{"$nulls":4},177,{"$nulls":4},0]
[{"$nulls":4},178,{"$nulls":4},0]
[{"$nulls":4},179,{"$nulls":4},0]
[{"$nulls":4},180,{"$nulls":4},0]
[{"$nulls":4},181,{"$nulls":4},0]
[{"$nulls":4},182,{"$nulls":4},0]
[{"$nulls":4},183,{"$nulls":4},0]
[{"$nulls":4},184,{"$nulls":4},0]
[{"$nulls":4},185,{"$nulls":4},0]
[{"$nulls":4},186,{"$nulls":4},0]
[{"$nulls":4},187,{"$nulls":4},0]
[{"$nulls":4},188,{"$nulls":4},0]
[{"$nulls":4},189,{"$nulls":4},0]
[{"$nulls":4},190,{"$nulls":4},0]
[{"$nulls":4},191,{"$nulls":4},0]
[{"$nulls":4},192,{"$nulls":4},0]
[{"$nulls":4},193,{"$nulls":4},0]
[{"$nulls":4},194,{"$nulls":4},0]
[{"$nulls":4},195,{"$nulls":4},0]
[{"$nulls":4},196,{"$nulls":4},0]
[{"$nulls":4},197,{"$nulls":4},0]
[{"$nulls":4},198,{"$nulls":4},0]
[{"$nulls":4},199,{"$nulls":4},0]
[{"$nulls":4},200,{"$nulls":4},0]
[{"$nulls":4},201,{"$nulls":4},0]
[{"$nulls":4},202,{"$nulls":4},0]
[{"$nulls":4},203,{"$nulls":4},0]
[{"$nulls":4},204,{"$nulls":4},0]
[{"$nulls":4},205,{"$nulls":4},0]
[{"$nulls":4},206,{"$nulls":4},0]
[{"$nulls":4},207,{"$nulls":4},0]
[{"$nulls":4},208,{"$nulls":4},0]
[{"$nulls":4},209,{"$nulls":4},0]
[{"$nulls":4},210,{"$nulls":4},0]
[{"$nulls":4},211,{"$nulls":4},0]
[{"$nulls":4},212,{"$nulls":4},0]
[{"$nulls":4},213,{"$nulls":4},0]
[{"$nulls":4},214,{"$nulls":4},0]
[{"$nulls":4},215,{"$nulls":4},0]
[{"$nulls":4},216,{"$nulls":4},0]
[{"$nulls":4},217,{"$nulls":4},0]
[{"$nulls":4},218,{"$nulls":4},0]
[{"$nulls":4},219,{"$nulls":4},0]
[{"$nulls":4},220,{"$nulls":4},0]
[{"$nulls":4},221,{"$nulls":4},0]
[{"$nulls":4},222,{"$nulls":4},0]
[{"$nulls":4},223,{"$nulls":4},0]
[{"$nulls":4},224,{"$nulls":4},0]
[{"$nulls":4},225,{"$nulls":4},0]
[{"$nulls":4},226,{"$nulls":4},0]
[{"$nulls":4},227,{"$nulls":4},0]
[{"$nulls":4},228,{"$nulls":4},0]
[{"$nulls":4},229,{"$nulls":4},0]
[{"$nulls":4},230,{"$nulls":4},0]
[{"$nulls":4},231,{"$nulls":4},{"$f":"IF(OR(H232=5,H232=10, H232=15, H232=\"BP\",H232=\"SCR\"),\"NT\",I232)","v":0}]
[{"$nulls":4},232,{"$nulls":4},0]
[{"$nulls":4},233,{"$nulls":4},0]
[{"$nulls":4},234,{"$nulls":4},0]
[{"$nulls":4},235,{"$nulls":4},0]
[{"$nulls":4},236,{"$nulls":4},0]
[{"$nulls":4},237,{"$nulls":4},0]
[{"$nulls":4},238,{"$nulls":4},0]
[{"$nulls":4},239,{"$nulls":4},0]
[{"$nulls":4},240,{"$nulls":4},0]
[{"$nulls":4},241,{"$nulls":4},0]
[{"$nulls":4},242,{"$nulls":4},0]
[{"$nulls":4},243,{"$nulls":4},0]
[{"$nulls":4},244,{"$nulls":4},0]
[{"$nulls":4},245,{"$nulls":4},0]
[{"$nulls":4},246,{"$nulls":4},0]
[{"$nulls":4},247,{"$nulls":4},0]
[{"$nulls":4},248,{"$nulls":4},0]
[{"$nulls":4},249,{"$nulls":4},0]
[{"$nulls":4},250,{"$nulls":4},0]
[{"$nulls":4},251,{"$nulls":4},0]
[{"$nulls":4},252,{"$nulls":4},0]
[{"$nulls":4},253,{"$nulls":4},0]
[{"$nulls":4},254,{"$nulls":4},0]
[{"$nulls":4},255,{"$nulls":4},0]
[{"$nulls":4},256,{"$nulls":4},0]
[{"$nulls":4},257,{"$nulls":4},0]
[{"$nulls":4},258,{"$nulls":4},0]
[{"$nulls":4},259,{"$nulls":4},0]
[{"$nulls":4},260,{"$nulls":4},0]
[{"$nulls":4},261,{"$nulls":4},0]
[{"$nulls":4},262,{"$nulls":4},0]
[{"$nulls":4},263,{"$nulls":4},0]
[{"$nulls":4},264,{"$nulls":4},0]
[{"$nulls":4},265,{"$nulls":4},0]
[{"$nulls":4},266,{"$nulls":4},0]
[{"$nulls":4},267,{"$nulls":4},0]
[{"$nulls":4},268,{"$nulls":4},0]
[{"$nulls":4},269,{"$nulls":4},0]
[{"$nulls":4},270,{"$nulls":4},0]
[{"$nulls":4},271,{"$nulls":4},0]
[{"$nulls":4},272,{"$nulls":4},0]
[{"$nulls":4},273,{"$nulls":4},0]
[{"$nulls":4},274,{"$nulls":4},0]
[{"$nulls":4},275,{"$nulls":4},0]
[{"$nulls":4},276,{"$nulls":4},0]
[{"$nulls":4},277,{"$nulls":4},0]
[{"$nulls":4},278,{"$nulls":4},0]
[{"$nulls":4},279,{"$nulls":4},0]
[{"$nulls":4},280,{"$nulls":4},0]
[{"$nulls":4},281,{"$nulls":4},0]
[{"$nulls":4},282,{"$nulls":4},0]
[{"$nulls":4},283,{"$nulls":4},0]
[{"$nulls":4},284,{"$nulls":4},0]
[{"$nulls":4},285,{"$nulls":4},0]
[{"$nulls":4},286,{"$nulls":4},0]
[{"$nulls":4},287,{"$nulls":4},0]
[{"$nulls":4},288,{"$nulls":4},0]
[{"$nulls":4},289,{"$nulls":4},0]
[{"$nulls":4},290,{"$nulls":4},0]
[{"$nulls":4},291,{"$nulls":4},0]
[{"$nulls":4},292,{"$nulls":4},0]
[{"$nulls":4},293,{"$nulls":4},0]
[{"$nulls":4},294,{"$nulls":4},0]
[{"$nulls":4},295,{"$nulls":4},{"$f":"IF(OR(H296=5,H296=10, H296=15, H296=\"BP\",H296=\"SCR\"),\"NT\",I296)","v":0}]
[{"$nulls":4},296,{"$nulls":4},0]
[{"$nulls":4},297,{"$nulls":4},0]
[{"$nulls":4},298,{"$nulls":4},0]
[{"$nulls":4},299,{"$nulls":4},0]
[{"$nulls":4},300,{"$nulls":4},0]

{"sheet":"Futurity","index":6,"n_rows":301,"n_cols":12,"rows_kept":301,"cut":false,"hidden":false,"merged":[]}
["Futurity","Der","Age Inct.","BBR","Draw","Rider Name","Horse Name","c/o","Time","Final Time","Placing","Money Earned"]
[{"$nulls":4},1,"Billie Ann Harmon","Famous Disco Bugs",null,15.885,null,"1D 1st",522]
[{"$nulls":4},2,"Kelsey Treharne (Treehorn)","VQ Nonstop Stinson",null,16.096,null,"1D 2nd",435]
[{"$nulls":4},3,"Joy Wargo","Wildchildsgotcashuno",null,16.187999999999999,null,"1D 3rd",348]
[{"$nulls":4},4,"Kelsey Treharne (Treehorn)","Aintgotnothinonme",null,16.189,null,"1D 4th",261]
[{"$nulls":4},5,"Stormi Pittman","Shake It Frenchman",null,16.2,null,"1D 5th",174]
[{"$nulls":4},6,"Wyatt Paul","MJ Condo Cowboy",null,16.350000000000001]
[{"$nulls":4},7,"Kelsey Treharne (Treehorn)","Firewater Streakin",null,16.382000000000001]
[{"$nulls":4},8,"Abigail Plants","Playing In Traffic",null,16.428000000000001]
[{"$nulls":4},9,"Kelsey Treharne (Treehorn)","VF Rosie Stinson",null,16.503]
[{"$nulls":4},10,"Kylie Bowles","Slick A Lena",null,16.518999999999998]
[{"$nulls":4},11,"Ben McDonnell","AJ Shakeitlike Elvis",null,16.518999999999998]
[{"$nulls":4},12,"Billie Ann Harmon","Zero Judgement",null,16.527999999999999]
[{"$nulls":4},13,"Ryann Pedone","Kool Rocket Man",null,16.539000000000001]
[{"$nulls":4},14,"Kelsey Treharne (Treehorn)","VF Silver Design",null,16.541]
[{"$nulls":4},15,"Whitney Godinez","Chilla On The Rocks",null,16.577999999999999]
[{"$nulls":4},16,"Stormi Pittman","Bar S Streaking Taz",null,16.623000000000001]
[{"$nulls":4},17,"Wendy Suhn","Jess B Gone",null,16.628]
[{"$nulls":4},18,"Haley Thorne","Superflyandfamous",null,16.652999999999999]
[{"$nulls":4},19,"Kelsey Treharne (Treehorn)","The First Lady",null,16.673999999999999]
[{"$nulls":4},20,"Kelsey Treharne (Treehorn)","VF Wheely Cool",null,16.718]
[{"$nulls":4},21,"Joy Wargo","Starrin Baby Rose",null,16.847999999999999]
[{"$nulls":4},22,"Lauren Strough","Drifting For Dineros",null,16.853000000000002]
[{"$nulls":4},23,"Abigail Plants","KN Baileys Sidecar",null,16.861000000000001]
[{"$nulls":4},24,"Abigail Plants","KN Stopbuginmebailey",null,17.036999999999999,null,"2D 1st",348]
[{"$nulls":4},25,"Ryann Pedone","Sweet Steven",null,17.102,null,"2D 2nd",290]
[{"$nulls":4},26,"Louis Paradis","All U Need Is Speed",null,17.346,null,"2D 3rd",232]
[{"$nulls":4},27,"Kaylyn Smith","Bet She Can Fly",null,17.366,null,"2D 4th",174]
[{"$nulls":4},28,"Riley Fountain","Dixee Land Delight",null,17.411999999999999,null,"2D 5th",116]
[{"$nulls":4},29,"Lauren Strough","Marthas Slick Moons",null,17.489999999999998]
[{"$nulls":4},30,"Jackie Hartt","RP Dashin Star",null,17.606000000000002]
[{"$nulls":4},31,"Shelby Scott","RJ Miss Gracie Gal",null,17.984999999999999]
[{"$nulls":4},32,"Jade Crago","Trust Your Journey",null,18.129000000000001]
[{"$nulls":4},33,"Kelsey Treharne (Treehorn)","A Legendary Fling",null,18.234000000000002]
[{"$nulls":4},34,"Jolene Jones","Perks Fame Aint Easy",null,"nt"]
[{"$nulls":4},35,"Kelsey Treharne (Treehorn)","VF Wishbone Red",null,"nt"]
[{"$nulls":4},36,"Kelsey Treharne (Treehorn)","TR Lying Badger",null,"nt16.339"]
[{"$nulls":4},37,"Joy Wargo","JL Hot Rocs",null,"nt16.869"]
[{"$nulls":4},38,"Emma Wildiesen","I Got Your Seis",null,"nt17.145"]
[{"$nulls":4},39,"Tallaney Clark","Perks Hickory Cat",null,"nt17.308"]
[{"$nulls":4},40,"Ryann Pedone","Money Beea Blaizin",null,"nt17.332"]
[{"$nulls":4},41]
[{"$nulls":4},42]
[{"$nulls":4},43]
[{"$nulls":4},44]
[{"$nulls":4},45]
[{"$nulls":4},46]
[{"$nulls":4},47]
[{"$nulls":4},48]
[{"$nulls":4},49]
[{"$nulls":4},50]
[{"$nulls":4},51]
[{"$nulls":4},52]
[{"$nulls":4},53]
[{"$nulls":4},54]
[{"$nulls":4},55]
[{"$nulls":4},56]
[{"$nulls":4},57]
[{"$nulls":4},58]
[{"$nulls":4},59]
[{"$nulls":4},60]
[{"$nulls":4},61]
[{"$nulls":4},62]
[{"$nulls":4},63]
[{"$nulls":4},64]
[{"$nulls":4},65]
[{"$nulls":4},66]
[{"$nulls":4},67]
[{"$nulls":4},68]
[{"$nulls":4},69]
[{"$nulls":4},70]
[{"$nulls":4},71]
[{"$nulls":4},72]
[{"$nulls":4},73]
[{"$nulls":4},74]
[{"$nulls":4},75]
[{"$nulls":4},76,{"$nulls":4},{"$f":"IF(OR(H77=5,H77=10, H77=15, H77=\"BP\",H77=\"SCR\"),\"NT\",I77)","v":0}]
[{"$nulls":4},77,{"$nulls":4},0]
[{"$nulls":4},78,{"$nulls":4},0]
[{"$nulls":4},79,{"$nulls":4},0]
[{"$nulls":4},80,{"$nulls":4},0]
[{"$nulls":4},81,{"$nulls":4},0]
[{"$nulls":4},82,{"$nulls":4},0]
[{"$nulls":4},83,{"$nulls":4},0]
[{"$nulls":4},84,{"$nulls":4},0]
[{"$nulls":4},85,{"$nulls":4},0]
[{"$nulls":4},86,{"$nulls":4},0]
[{"$nulls":4},87,{"$nulls":4},0]
[{"$nulls":4},88,{"$nulls":4},0]
[{"$nulls":4},89,{"$nulls":4},0]
[{"$nulls":4},90,{"$nulls":4},0]
[{"$nulls":4},91,{"$nulls":4},0]
[{"$nulls":4},92,{"$nulls":4},0]
[{"$nulls":4},93,{"$nulls":4},0]
[{"$nulls":4},94,{"$nulls":4},0]
[{"$nulls":4},95,{"$nulls":4},{"$f":"IF(OR(H96=5,H96=10, H96=15, H96=\"BP\",H96=\"SCR\"),\"NT\",I96)","v":0}]
[{"$nulls":4},96,{"$nulls":4},0]
[{"$nulls":4},97,{"$nulls":4},0]
[{"$nulls":4},98,{"$nulls":4},0]
[{"$nulls":4},99,{"$nulls":4},0]
[{"$nulls":4},100,{"$nulls":4},0]
[{"$nulls":4},101,{"$nulls":4},0]
[{"$nulls":4},102,{"$nulls":4},0]
[{"$nulls":4},103,{"$nulls":4},0]
[{"$nulls":4},104,{"$nulls":4},0]
[{"$nulls":4},105,{"$nulls":4},0]
[{"$nulls":4},106,{"$nulls":4},0]
[{"$nulls":4},107,{"$nulls":4},0]
[{"$nulls":4},108,{"$nulls":4},0]
[{"$nulls":4},109,{"$nulls":4},0]
[{"$nulls":4},110,{"$nulls":4},0]
[{"$nulls":4},111,{"$nulls":4},0]
[{"$nulls":4},112,{"$nulls":4},0]
[{"$nulls":4},113,{"$nulls":4},0]
[{"$nulls":4},114,{"$nulls":4},0]
[{"$nulls":4},115,{"$nulls":4},0]
[{"$nulls":4},116,{"$nulls":4},0]
[{"$nulls":4},117,{"$nulls":4},0]
[{"$nulls":4},118,{"$nulls":4},0]
[{"$nulls":4},119,{"$nulls":4},0]
[{"$nulls":4},120,{"$nulls":4},0]
[{"$nulls":4},121,{"$nulls":4},0]
[{"$nulls":4},122,{"$nulls":4},0]
[{"$nulls":4},123,{"$nulls":4},0]
[{"$nulls":4},124,{"$nulls":4},0]
[{"$nulls":4},125,{"$nulls":4},0]
[{"$nulls":4},126,{"$nulls":4},0]
[{"$nulls":4},127,{"$nulls":4},0]
[{"$nulls":4},128,{"$nulls":4},0]
[{"$nulls":4},129,{"$nulls":4},0]
[{"$nulls":4},130,{"$nulls":4},0]
[{"$nulls":4},131,{"$nulls":4},0]
[{"$nulls":4},132,{"$nulls":4},0]
[{"$nulls":4},133,{"$nulls":4},0]
[{"$nulls":4},134,{"$nulls":4},0]
[{"$nulls":4},135,{"$nulls":4},0]
[{"$nulls":4},136,{"$nulls":4},0]
[{"$nulls":4},137,{"$nulls":4},0]
[{"$nulls":4},138,{"$nulls":4},0]
[{"$nulls":4},139,{"$nulls":4},0]
[{"$nulls":4},140,{"$nulls":4},0]
[{"$nulls":4},141,{"$nulls":4},0]
[{"$nulls":4},142,{"$nulls":4},0]
[{"$nulls":4},143,{"$nulls":4},0]
[{"$nulls":4},144,{"$nulls":4},0]
[{"$nulls":4},145,{"$nulls":4},0]
[{"$nulls":4},146,{"$nulls":4},0]
[{"$nulls":4},147,{"$nulls":4},0]
[{"$nulls":4},148,{"$nulls":4},0]
[{"$nulls":4},149,{"$nulls":4},0]
[{"$nulls":4},150,{"$nulls":4},0]
[{"$nulls":4},151,{"$nulls":4},0]
[{"$nulls":4},152,{"$nulls":4},0]
[{"$nulls":4},153,{"$nulls":4},0]
[{"$nulls":4},154,{"$nulls":4},0]
[{"$nulls":4},155,{"$nulls":4},0]
[{"$nulls":4},156,{"$nulls":4},0]
[{"$nulls":4},157,{"$nulls":4},0]
[{"$nulls":4},158,{"$nulls":4},0]
[{"$nulls":4},159,{"$nulls":4},{"$f":"IF(OR(H160=5,H160=10, H160=15, H160=\"BP\",H160=\"SCR\"),\"NT\",I160)","v":0}]
[{"$nulls":4},160,{"$nulls":4},0]
[{"$nulls":4},161,{"$nulls":4},0]
[{"$nulls":4},162,{"$nulls":4},0]
[{"$nulls":4},163,{"$nulls":4},0]
[{"$nulls":4},164,{"$nulls":4},0]
[{"$nulls":4},165,{"$nulls":4},0]
[{"$nulls":4},166,{"$nulls":4},0]
[{"$nulls":4},167,{"$nulls":4},0]
[{"$nulls":4},168,{"$nulls":4},0]
[{"$nulls":4},169,{"$nulls":4},0]
[{"$nulls":4},170,{"$nulls":4},0]
[{"$nulls":4},171,{"$nulls":4},0]
[{"$nulls":4},172,{"$nulls":4},0]
[{"$nulls":4},173,{"$nulls":4},0]
[{"$nulls":4},174,{"$nulls":4},0]
[{"$nulls":4},175,{"$nulls":4},0]
[{"$nulls":4},176,{"$nulls":4},0]
[{"$nulls":4},177,{"$nulls":4},0]
[{"$nulls":4},178,{"$nulls":4},0]
[{"$nulls":4},179,{"$nulls":4},0]
[{"$nulls":4},180,{"$nulls":4},0]
[{"$nulls":4},181,{"$nulls":4},0]
[{"$nulls":4},182,{"$nulls":4},0]
[{"$nulls":4},183,{"$nulls":4},0]
[{"$nulls":4},184,{"$nulls":4},0]
[{"$nulls":4},185,{"$nulls":4},0]
[{"$nulls":4},186,{"$nulls":4},0]
[{"$nulls":4},187,{"$nulls":4},0]
[{"$nulls":4},188,{"$nulls":4},0]
[{"$nulls":4},189,{"$nulls":4},0]
[{"$nulls":4},190,{"$nulls":4},0]
[{"$nulls":4},191,{"$nulls":4},0]
[{"$nulls":4},192,{"$nulls":4},0]
[{"$nulls":4},193,{"$nulls":4},0]
[{"$nulls":4},194,{"$nulls":4},0]
[{"$nulls":4},195,{"$nulls":4},0]
[{"$nulls":4},196,{"$nulls":4},0]
[{"$nulls":4},197,{"$nulls":4},0]
[{"$nulls":4},198,{"$nulls":4},0]
[{"$nulls":4},199,{"$nulls":4},0]
[{"$nulls":4},200,{"$nulls":4},0]
[{"$nulls":4},201,{"$nulls":4},0]
[{"$nulls":4},202,{"$nulls":4},0]
[{"$nulls":4},203,{"$nulls":4},0]
[{"$nulls":4},204,{"$nulls":4},0]
[{"$nulls":4},205,{"$nulls":4},0]
[{"$nulls":4},206,{"$nulls":4},0]
[{"$nulls":4},207,{"$nulls":4},0]
[{"$nulls":4},208,{"$nulls":4},0]
[{"$nulls":4},209,{"$nulls":4},0]
[{"$nulls":4},210,{"$nulls":4},0]
[{"$nulls":4},211,{"$nulls":4},0]
[{"$nulls":4},212,{"$nulls":4},0]
[{"$nulls":4},213,{"$nulls":4},0]
[{"$nulls":4},214,{"$nulls":4},0]
[{"$nulls":4},215,{"$nulls":4},0]
[{"$nulls":4},216,{"$nulls":4},0]
[{"$nulls":4},217,{"$nulls":4},0]
[{"$nulls":4},218,{"$nulls":4},0]
[{"$nulls":4},219,{"$nulls":4},0]
[{"$nulls":4},220,{"$nulls":4},0]
[{"$nulls":4},221,{"$nulls":4},0]
[{"$nulls":4},222,{"$nulls":4},0]
[{"$nulls":4},223,{"$nulls":4},{"$f":"IF(OR(H224=5,H224=10, H224=15, H224=\"BP\",H224=\"SCR\"),\"NT\",I224)","v":0}]
[{"$nulls":4},224,{"$nulls":4},0]
[{"$nulls":4},225,{"$nulls":4},0]
[{"$nulls":4},226,{"$nulls":4},0]
[{"$nulls":4},227,{"$nulls":4},0]
[{"$nulls":4},228,{"$nulls":4},0]
[{"$nulls":4},229,{"$nulls":4},0]
[{"$nulls":4},230,{"$nulls":4},0]
[{"$nulls":4},231,{"$nulls":4},0]
[{"$nulls":4},232,{"$nulls":4},0]
[{"$nulls":4},233,{"$nulls":4},0]
[{"$nulls":4},234,{"$nulls":4},0]
[{"$nulls":4},235,{"$nulls":4},0]
[{"$nulls":4},236,{"$nulls":4},0]
[{"$nulls":4},237,{"$nulls":4},0]
[{"$nulls":4},238,{"$nulls":4},0]
[{"$nulls":4},239,{"$nulls":4},0]
[{"$nulls":4},240,{"$nulls":4},0]
[{"$nulls":4},241,{"$nulls":4},0]
[{"$nulls":4},242,{"$nulls":4},0]
[{"$nulls":4},243,{"$nulls":4},0]
[{"$nulls":4},244,{"$nulls":4},0]
[{"$nulls":4},245,{"$nulls":4},0]
[{"$nulls":4},246,{"$nulls":4},0]
[{"$nulls":4},247,{"$nulls":4},0]
[{"$nulls":4},248,{"$nulls":4},0]
[{"$nulls":4},249,{"$nulls":4},0]
[{"$nulls":4},250,{"$nulls":4},0]
[{"$nulls":4},251,{"$nulls":4},0]
[{"$nulls":4},252,{"$nulls":4},0]
[{"$nulls":4},253,{"$nulls":4},0]
[{"$nulls":4},254,{"$nulls":4},0]
[{"$nulls":4},255,{"$nulls":4},0]
[{"$nulls":4},256,{"$nulls":4},0]
[{"$nulls":4},257,{"$nulls":4},0]
[{"$nulls":4},258,{"$nulls":4},0]
[{"$nulls":4},259,{"$nulls":4},0]
[{"$nulls":4},260,{"$nulls":4},0]
[{"$nulls":4},261,{"$nulls":4},0]
[{"$nulls":4},262,{"$nulls":4},0]
[{"$nulls":4},263,{"$nulls":4},0]
[{"$nulls":4},264,{"$nulls":4},0]
[{"$nulls":4},265,{"$nulls":4},0]
[{"$nulls":4},266,{"$nulls":4},0]
[{"$nulls":4},267,{"$nulls":4},0]
[{"$nulls":4},268,{"$nulls":4},0]
[{"$nulls":4},269,{"$nulls":4},0]
[{"$nulls":4},270,{"$nulls":4},0]
[{"$nulls":4},271,{"$nulls":4},0]
[{"$nulls":4},272,{"$nulls":4},0]
[{"$nulls":4},273,{"$nulls":4},0]
[{"$nulls":4},274,{"$nulls":4},0]
[{"$nulls":4},275,{"$nulls":4},0]
[{"$nulls":4},276,{"$nulls":4},0]
[{"$nulls":4},277,{"$nulls":4},0]
[{"$nulls":4},278,{"$nulls":4},0]
[{"$nulls":4},279,{"$nulls":4},0]
[{"$nulls":4},280,{"$nulls":4},0]
[{"$nulls":4},281,{"$nulls":4},0]
[{"$nulls":4},282,{"$nulls":4},0]
[{"$nulls":4},283,{"$nulls":4},0]
[{"$nulls":4},284,{"$nulls":4},0]
[{"$nulls":4},285,{"$nulls":4},0]
[{"$nulls":4},286,{"$nulls":4},0]
[{"$nulls":4},287,{"$nulls":4},{"$f":"IF(OR(H288=5,H288=10, H288=15, H288=\"BP\",H288=\"SCR\"),\"NT\",I288)","v":0}]
[{"$nulls":4},288,{"$nulls":4},0]
[{"$nulls":4},289,{"$nulls":4},0]
[{"$nulls":4},290,{"$nulls":4},0]
[{"$nulls":4},291,{"$nulls":4},0]
[{"$nulls":4},292,{"$nulls":4},0]
[{"$nulls":4},293,{"$nulls":4},0]
[{"$nulls":4},294,{"$nulls":4},0]
[{"$nulls":4},295,{"$nulls":4},0]
[{"$nulls":4},296,{"$nulls":4},0]
[{"$nulls":4},297,{"$nulls":4},0]
[{"$nulls":4},298,{"$nulls":4},0]
[{"$nulls":4},299,{"$nulls":4},0]
[{"$nulls":4},300,{"$nulls":4},0]

{"sheet":"12 & Under","index":7,"n_rows":301,"n_cols":11,"rows_kept":301,"cut":false,"hidden":true,"merged":[]}
["Futurity","Der","Age Inct.","R/O","Draw","Rider Name","Horse Name","Time","Final Time","Placing","Money Earned"]
{"$rows_empty":31}
[{"$nulls":4},32]
[{"$nulls":4},33]
[{"$nulls":4},34]
[{"$nulls":4},35]
[{"$nulls":4},36]
[{"$nulls":4},37]
[{"$nulls":4},38]
[{"$nulls":4},39]
[{"$nulls":4},40]
[{"$nulls":4},41]
[{"$nulls":4},42]
[{"$nulls":4},43]
[{"$nulls":4},44]
[{"$nulls":4},45]
[{"$nulls":4},46]
[{"$nulls":4},47]
[{"$nulls":4},48]
[{"$nulls":4},49]
[{"$nulls":4},50]
[{"$nulls":4},51]
[{"$nulls":4},52]
[{"$nulls":4},53]
[{"$nulls":4},54]
[{"$nulls":4},55]
[{"$nulls":4},56]
[{"$nulls":4},57]
[{"$nulls":4},58]
[{"$nulls":4},59]
[{"$nulls":4},60]
[{"$nulls":4},61]
[{"$nulls":4},62]
[{"$nulls":4},63]
[{"$nulls":4},64]
[{"$nulls":4},65]
[{"$nulls":4},66]
[{"$nulls":4},67]
[{"$nulls":4},68]
[{"$nulls":4},69]
[{"$nulls":4},70]
[{"$nulls":4},71]
[{"$nulls":4},72]
[{"$nulls":4},73]
[{"$nulls":4},74]
[{"$nulls":4},75]
[{"$nulls":4},76]
[{"$nulls":4},77]
[{"$nulls":4},78]
[{"$nulls":4},79]
[{"$nulls":4},80]
[{"$nulls":4},81]
[{"$nulls":4},82]
[{"$nulls":4},83]
[{"$nulls":4},84]
[{"$nulls":4},85]
[{"$nulls":4},86]
[{"$nulls":4},87]
[{"$nulls":4},88]
[{"$nulls":4},89]
[{"$nulls":4},90]
[{"$nulls":4},91]
[{"$nulls":4},92]
[{"$nulls":4},93]
[{"$nulls":4},94]
[{"$nulls":4},95]
[{"$nulls":4},96]
[{"$nulls":4},97]
[{"$nulls":4},98]
[{"$nulls":4},99]
[{"$nulls":4},100]
[{"$nulls":4},101]
[{"$nulls":4},102]
[{"$nulls":4},103]
[{"$nulls":4},104]
[{"$nulls":4},105]
[{"$nulls":4},106]
[{"$nulls":4},107]
[{"$nulls":4},108]
[{"$nulls":4},109]
[{"$nulls":4},110]
[{"$nulls":4},111]
[{"$nulls":4},112]
[{"$nulls":4},113]
[{"$nulls":4},114]
[{"$nulls":4},115]
[{"$nulls":4},116]
[{"$nulls":4},117]
[{"$nulls":4},118]
[{"$nulls":4},119]
[{"$nulls":4},120]
[{"$nulls":4},121]
[{"$nulls":4},122]
[{"$nulls":4},123]
[{"$nulls":4},124]
[{"$nulls":4},125]
[{"$nulls":4},126]
[{"$nulls":4},127]
[{"$nulls":4},128]
[{"$nulls":4},129]
[{"$nulls":4},130]
[{"$nulls":4},131]
[{"$nulls":4},132]
[{"$nulls":4},133]
[{"$nulls":4},134]
[{"$nulls":4},135]
[{"$nulls":4},136]
[{"$nulls":4},137]
[{"$nulls":4},138]
[{"$nulls":4},139]
[{"$nulls":4},140]
[{"$nulls":4},141]
[{"$nulls":4},142]
[{"$nulls":4},143]
[{"$nulls":4},144]
[{"$nulls":4},145]
[{"$nulls":4},146]
[{"$nulls":4},147]
[{"$nulls":4},148]
[{"$nulls":4},149]
[{"$nulls":4},150]
[{"$nulls":4},151]
[{"$nulls":4},152]
[{"$nulls":4},153]
[{"$nulls":4},154]
[{"$nulls":4},155]
[{"$nulls":4},156]
[{"$nulls":4},157]
[{"$nulls":4},158]
[{"$nulls":4},159]
[{"$nulls":4},160]
[{"$nulls":4},161]
[{"$nulls":4},162]
[{"$nulls":4},163]
[{"$nulls":4},164]
[{"$nulls":4},165]
[{"$nulls":4},166]
[{"$nulls":4},167]
[{"$nulls":4},168]
[{"$nulls":4},169]
[{"$nulls":4},170]
[{"$nulls":4},171]
[{"$nulls":4},172]
[{"$nulls":4},173]
[{"$nulls":4},174]
[{"$nulls":4},175]
[{"$nulls":4},176]
[{"$nulls":4},177]
[{"$nulls":4},178]
[{"$nulls":4},179]
[{"$nulls":4},180]
[{"$nulls":4},181]
[{"$nulls":4},182]
[{"$nulls":4},183]
[{"$nulls":4},184]
[{"$nulls":4},185]
[{"$nulls":4},186]
[{"$nulls":4},187]
[{"$nulls":4},188]
[{"$nulls":4},189]
[{"$nulls":4},190]
[{"$nulls":4},191]
[{"$nulls":4},192]
[{"$nulls":4},193]
[{"$nulls":4},194]
[{"$nulls":4},195]
[{"$nulls":4},196]
[{"$nulls":4},197]
[{"$nulls":4},198]
[{"$nulls":4},199]
[{"$nulls":4},200]
[{"$nulls":4},201]
[{"$nulls":4},202]
[{"$nulls":4},203]
[{"$nulls":4},204]
[{"$nulls":4},205]
[{"$nulls":4},206]
[{"$nulls":4},207]
[{"$nulls":4},208]
[{"$nulls":4},209]
[{"$nulls":4},210]
[{"$nulls":4},211]
[{"$nulls":4},212]
[{"$nulls":4},213]
[{"$nulls":4},214]
[{"$nulls":4},215]
[{"$nulls":4},216]
[{"$nulls":4},217]
[{"$nulls":4},218]
[{"$nulls":4},219]
[{"$nulls":4},220]
[{"$nulls":4},221]
[{"$nulls":4},222]
[{"$nulls":4},223]
[{"$nulls":4},224]
[{"$nulls":4},225]
[{"$nulls":4},226]
[{"$nulls":4},227]
[{"$nulls":4},228]
[{"$nulls":4},229]
[{"$nulls":4},230]
[{"$nulls":4},231]
[{"$nulls":4},232]
[{"$nulls":4},233]
[{"$nulls":4},234]
[{"$nulls":4},235]
[{"$nulls":4},236]
[{"$nulls":4},237]
[{"$nulls":4},238]
[{"$nulls":4},239]
[{"$nulls":4},240]
[{"$nulls":4},241]
[{"$nulls":4},242]
[{"$nulls":4},243]
[{"$nulls":4},244]
[{"$nulls":4},245]
[{"$nulls":4},246]
[{"$nulls":4},247]
[{"$nulls":4},248]
[{"$nulls":4},249]
[{"$nulls":4},250]
[{"$nulls":4},251]
[{"$nulls":4},252]
[{"$nulls":4},253]
[{"$nulls":4},254]
[{"$nulls":4},255]
[{"$nulls":4},256]
[{"$nulls":4},257]
[{"$nulls":4},258]
[{"$nulls":4},259]
[{"$nulls":4},260]
[{"$nulls":4},261]
[{"$nulls":4},262]
[{"$nulls":4},263]
[{"$nulls":4},264]
[{"$nulls":4},265]
[{"$nulls":4},266]
[{"$nulls":4},267]
[{"$nulls":4},268]
[{"$nulls":4},269]
[{"$nulls":4},270]
[{"$nulls":4},271]
[{"$nulls":4},272]
[{"$nulls":4},273]
[{"$nulls":4},274]
[{"$nulls":4},275]
[{"$nulls":4},276]
[{"$nulls":4},277]
[{"$nulls":4},278]
[{"$nulls":4},279]
[{"$nulls":4},280]
[{"$nulls":4},281]
[{"$nulls":4},282]
[{"$nulls":4},283]
[{"$nulls":4},284]
[{"$nulls":4},285]
[{"$nulls":4},286]
[{"$nulls":4},287]
[{"$nulls":4},288]
[{"$nulls":4},289]
[{"$nulls":4},290]
[{"$nulls":4},291]
[{"$nulls":4},292]
[{"$nulls":4},293]
[{"$nulls":4},294]
[{"$nulls":4},295]
[{"$nulls":4},296]
[{"$nulls":4},297]
[{"$nulls":4},298]
[{"$nulls":4},299]
[{"$nulls":4},300]

{"sheet":"10&under","index":8,"n_rows":25,"n_cols":7,"rows_kept":25,"cut":false,"hidden":false,"merged":[]}
["Draw","Rider Name","Horse Name","Time","Final Time","Placing","Money Earned"]
[1,"RuthAnn Hutchison","Winnie",18.018000000000001]
[2,"Peyton King",null,18.498000000000001]
[3,"Coralee Williams","Chip",20.14]
[4,"Bryson Rawson",null,"nt19.321"]
[5,"Brynlee DeWynter","Angel","broken"]
[6,"Veilleux?"]
[7,"Wyatt Williams","Dennis",35.106999999999999]
[8,"Breelyn Black ","Poptart","broken"]
[9,"Hayley King","Vanity"]
[10,"Kaley Steffen","Cookie",22.25]
[10,"RuthAnn Hutchison","Daffy","broken"]
[11,"Peyton Smith","Tater","scratch"]
[12]
[13]
[14]
[15]
[16]
[17]
[18]
[19]
[20]
[21]
[22]
[23]

{"sheet":"BFA 2D Payout","index":9,"n_rows":52,"n_cols":6,"rows_kept":52,"cut":false,"hidden":true,"merged":[[51,0,51,4],[20,0,20,4],[28,0,28,4],[29,0,29,4],[39,0,39,4],[40,0,40,4],[25,3,26,4],[35,3,37,4],[46,3,49,4],[19,0,19,4],[0,0,0,4],[3,0,3,4],[4,0,4,4],[11,0,11,4],[12,0,12,4],[7,3,9,4],[16,3,17,4]]}
["BFA 2D Payout"]
["Entry Fee","# Entries","% Payback","Added $","  Total Payout","Each Go"]
[25,19,0.8,200,{"$f":"(A3*$C$3)*B3+D3","v":580},0.3]
[{"$nulls":5},{"$f":"$E$3*$F$3","v":174}]
["$5,000-7,500 Pays 5 Places         4 to 1D 1 to 2D"]
["Placings","1D",null,"2D"]
["1st",{"$f":"($F$4*$C$7)","v":57.42},0.33,{"$f":"$F$4*$E$7","v":12.180000000000001},7.0000000000000007E-2]
["2nd",{"$f":"$F$4*$C$8","v":46.980000000000004},0.27]
["3rd",{"$f":"$F$4*$C$9","v":34.800000000000004},0.2]
["4th",{"$f":"$F$4*$C$10","v":22.62},0.13]
["Totals",{"$f":"SUM(B7:B10)","v":161.82000000000002},null,{"$f":"SUM(D7:D10)","v":12.180000000000001},{"$f":"(C7+C8+C9+C10+E7+E8)","v":1}]
[{"$f":"B11+D11","v":174.00000000000003}]
["$7,501 - 10,000 Pays 6 Places        4 to 1D,  2 to 2D"]
["Placings","1D",null,"2D"]
["1st",{"$f":"$F$4*$C$15","v":50.459999999999994},0.28999999999999998,{"$f":"$F$4*$E$15","v":15.66},0.09]
["2nd",{"$f":"+$F$4*$C$16","v":41.76},0.24,{"$f":"F4*E16","v":8.7000000000000011},0.05]
["3rd",{"$f":"$F$4*$C$17","v":33.06},0.19]
["4th",{"$f":"$F$4*$C$18","v":24.360000000000003},0.14000000000000001]
["Totals",{"$f":"SUM(B15:B18)","v":149.64000000000001},null,{"$f":"D16+D15","v":24.36},{"$f":"SUM(C15+C16+C17+C18+E15+E16)","v":1}]
[{"$f":"D19+B19","v":174}]
["   $10,001 - $15,000 Payes 8 Places        5 to 1D, 3 to 2D"]
["Placings","1D",null,"2D"]
["1st",{"$f":"F4*C23","v":41.76},0.24,{"$f":"F4*E23","v":12.180000000000001},7.0000000000000007E-2]
["2nd",{"$f":"F4*C24","v":34.800000000000004},0.2,{"$f":"F4*E24","v":8.7000000000000011},0.05]
["3rd",{"$f":"F4*C25","v":29.580000000000002},0.17,{"$f":"F4*E25","v":6.96},0.04]
["4th",{"$f":"F4*C26","v":22.62},0.13]
["5th",{"$f":"F4*C27","v":17.400000000000002},0.1]
["Totals",{"$f":"SUM(B23:B27)","v":146.16},null,{"$f":"SUM(D23:D27)","v":27.840000000000003},{"$f":"C23+C24+C25+C26+C27+E23+E24+E25","v":1}]
[{"$f":"B28+D28","v":174}]
["$15,001 - $25,000 Payes 11 Places        7 to 1D, 4 to 2D"]
["Placings","1D",null,"2D"]
["1st",{"$f":"$F$4*C32","v":36.54},0.21,{"$f":"$F$4*E32","v":8.7000000000000011},0.05]
["2nd",{"$f":"$F$4*C33","v":31.32},0.18,{"$f":"$F$4*E33","v":6.96},0.04]
["3rd",26.099999999999998,0.15,5.22,0.03]
["4th",19.14,0.11,3.48,0.02]
["5th",13.92,0.08]
["6th",12.180000000000001,7.0000000000000007E-2]
["7th",10.44,0.06]
["Totals",{"$f":"SUM(B32:B38)","v":149.63999999999999},null,{"$f":"SUM(D32:D38)","v":24.36},{"$f":"C32+C33+C34+C35+C36+C37+C38+E32+E33+E34+E35","v":1.0000000000000002}]
[{"$f":"SUM(B39+D39)","v":174}]
["$25,001 - $35,000 Payes 12 Places          8 to 1D, 4 to 2D"]
["Placings","1D",null,"2D"]
["1st",{"$f":"$F$4*C43","v":33.06},0.19,{"$f":"$F$4*E43","v":8.7000000000000011},0.05]
["2nd",{"$f":"$F$4*C44","v":26.099999999999998},0.15,{"$f":"$F$4*E44","v":6.96},0.04]
["3rd",20.88,0.12,5.22,0.03]
["4th",17.400000000000002,0.1,3.48,0.02]
["5th",15.66,0.09]
["6th",13.92,0.08]
["7th",12.180000000000001,7.0000000000000007E-2]
["8th",10.44,0.06]
["Totals",{"$f":"SUM(B43:B50)","v":149.63999999999999},null,{"$f":"SUM(D43:D46)","v":24.36},{"$f":"C43+C44+C45+C46+C47+C48+C49+C50+E43+E44+E45+E46","v":1}]
[{"$f":"D51+B51","v":174}]

{"sheet":"2D Payout","index":10,"n_rows":76,"n_cols":5,"rows_kept":76,"cut":false,"hidden":false,"merged":[[35,0,35,4],[34,0,34,4],[28,3,28,4],[19,0,19,4],[26,0,26,4],[21,3,21,4],[13,0,13,4],[14,0,14,4],[20,0,20,4],[15,3,15,4],[27,0,27,4],[0,0,0,4],[8,0,8,4],[9,0,9,4],[3,0,3,4],[10,3,10,4],[5,3,6,3],[5,4,7,4],[36,3,36,4],[76,0,76,4],[43,0,43,4],[53,0,53,4],[65,0,65,4],[44,0,44,4],[54,0,54,4],[64,0,64,4],[45,3,45,4],[55,3,55,4],[66,3,66,4]]}
["2D Payout"]
["Entry Fee","# Entries","% Payback","Added $","  Total Payout"]
[75,40,0.8,500,{"$f":"(A3*$C$3)*B3+D3","v":2900}]
[]
["% in each D",0.6,0.4,"Total % =",{"$f":"SUM(B5:C5)","v":1}]
[null,"1D","2D"]
[null,{"$f":"(($A$3*$B$3*$C$3*$B$5)+($D$3*$B$5))","v":1740},{"$f":"(($A$3*$B$3*$C$3*$C$5)+($D$3*$C$5))","v":1160}]
["Totals",{"$f":"SUM(B7)","v":1740},{"$f":"SUM(C7)","v":1160},{"$f":"SUM(B8:C8)","v":2900}]
[]
["For 1-7 riders 1 place"]
["Placings","1D","2D"]
["1st",{"$f":"$B$7*$E$12","v":1740},{"$f":"$C$7*$E$5","v":1160},"è",1]
["Totals",{"$f":"SUM(B12:B12)","v":1740},{"$f":"SUM(C12:C12)","v":1160},{"$f":"SUM(B13:C13)","v":2900},{"$f":"SUM(E12)","v":1}]
[]
["For 8-11 riders 2 places"]
["Placings","1D","2D"]
["1st",{"$f":"$B$7*$E$17","v":1044},{"$f":"$C$7*$E$17","v":696},"è",0.6]
["2nd",{"$f":"$B$7*$E$18","v":696},{"$f":"$C$7*$E$18","v":464},"è",0.4]
["Totals",{"$f":"SUM(B17:B18)","v":1740},{"$f":"SUM(C17:C18)","v":1160},{"$f":"SUM(B19:C19)","v":2900},{"$f":"SUM(E17:E18)","v":1}]
[]
["For 12-15 riders 3 places"]
["Placings","1D","2D"]
["1st",{"$f":"$B$7*$E$23","v":870},{"$f":"$C$7*$E$23","v":580},"è",0.5]
["2nd",{"$f":"$B$7*$E$24","v":522},{"$f":"$C$7*$E$24","v":348},"è",0.3]
["3rd",{"$f":"$B$7*$E$25","v":348},{"$f":"$C$7*$E$25","v":232},"è",0.2]
["Totals",{"$f":"SUM(B23:B25)","v":1740},{"$f":"SUM(C23:C25)","v":1160},{"$f":"SUM(B26:C26)","v":2900},{"$f":"SUM(E23:E25)","v":1}]
[]
["For 16-19 riders 4 places"]
["Placings","1D","2D"]
["1st",{"$f":"$B$7*$E$30","v":696},{"$f":"$C$7*$E$30","v":464},"è",0.4]
["2nd",{"$f":"$B$7*$E$31","v":522},{"$f":"$C$7*$E$31","v":348},"è",0.3]
["3rd",{"$f":"$B$7*$E$32","v":348},{"$f":"$C$7*$E$32","v":232},"è",0.2]
["4th",{"$f":"$B$7*$E$33","v":174},{"$f":"$C$7*$E$33","v":116},"è",0.1]
["Totals",{"$f":"SUM(B30:B33)","v":1740},{"$f":"SUM(C30:C33)","v":1160},{"$f":"SUM(B34:C34)","v":2900},{"$f":"SUM(E30:E33)","v":0.99999999999999989}]
[]
["For 20-23 riders 5 places"]
["Placings","1D","2D"]
["1st",{"$f":"$B$7*$E$38","v":522},{"$f":"$C$7*$E$38","v":348},"è",0.3]
["2nd",{"$f":"$B$7*$E$39","v":435},{"$f":"$C$7*$E$39","v":290},"è",0.25]
["3rd",{"$f":"$B$7*$E$40","v":348},{"$f":"$C$7*$E$40","v":232},"è",0.2]
["4th",{"$f":"$B$7*$E$41","v":261},{"$f":"$C$7*$E$41","v":174},"è",0.15]
["5th",{"$f":"$B$7*$E$42","v":174},{"$f":"$C$7*$E$42","v":116},"è",0.1]
["Totals",{"$f":"SUM(B38:B42)","v":1740},{"$f":"SUM(C38:C42)","v":1160},{"$f":"SUM(B43:C43)","v":2900},{"$f":"SUM(E38:E42)","v":1}]
[]
["For 24-27 riders 6 places"]
["Placings","1D","2D"]
["1st",{"$f":"$B$7*$E$47","v":435},{"$f":"$C$7*$E$47","v":290},"è",0.25]
["2nd",{"$f":"$B$7*$E$48","v":348},{"$f":"$C$7*$E$48","v":232},"è",0.2]
["3rd",{"$f":"$B$7*$E$49","v":313.2},{"$f":"$C$7*$E$49","v":208.79999999999998},"è",0.18]
["4th",{"$f":"$B$7*$E$50","v":261},{"$f":"$C$7*$E$50","v":174},"è",0.15]
["5th",{"$f":"$B$7*$E$51","v":208.79999999999998},{"$f":"$C$7*$E$51","v":139.19999999999999},"è",0.12]
["6th",{"$f":"$B$7*$E$52","v":174},{"$f":"$C$7*$E$52","v":116},"è",0.1]
["Totals",{"$f":"SUM(B47:B52)","v":1740},{"$f":"SUM(C47:C52)","v":1160},{"$f":"SUM(B53:C53)","v":2900},{"$f":"SUM(E47:E52)","v":1}]
[]
["For 28-31 riders 7 places"]
["Placings","1D","2D"]
["1st",{"$f":"$B$7*$E$57","v":382.8},{"$f":"$C$7*$E$57","v":255.2},"è",0.22]
["2nd",{"$f":"$B$7*$E$58","v":313.2},{"$f":"$C$7*$E$58","v":208.79999999999998},"è",0.18]
["3rd",{"$f":"$B$7*$E$59","v":278.40000000000003},{"$f":"$C$7*$E$59","v":185.6},"è",0.16]
["4th",{"$f":"$B$7*$E$60","v":243.60000000000002},{"$f":"$C$7*$E$60","v":162.4},"è",0.14000000000000001]
["5th",{"$f":"$B$7*$E$61","v":208.79999999999998},{"$f":"$C$7*$E$61","v":139.19999999999999},"è",0.12]
["6th",{"$f":"$B$7*$E$62","v":174},{"$f":"$C$7*$E$62","v":116},"è",0.1]
["7th",{"$f":"$B$7*$E$63","v":139.20000000000002},{"$f":"$C$7*$E$63","v":92.8},"è",0.08]
["Totals",{"$f":"SUM(B57:B63)","v":1740},{"$f":"SUM(C57:C63)","v":1160},{"$f":"SUM(B64:C64)","v":2900},{"$f":"SUM(E57:E63)","v":1}]
[]
["For 32 or more riders 8 places"]
["Placings","1D","2D"]
["1st",{"$f":"$B$7*$E$68","v":400.20000000000005},{"$f":"$C$7*$E$68","v":266.8},"è",0.23]
["2nd",{"$f":"$B$7*$E$69","v":348},{"$f":"$C$7*$E$69","v":232},"è",0.2]
["3rd",{"$f":"$B$7*$E$70","v":295.8},{"$f":"$C$7*$E$70","v":197.20000000000002},"è",0.17]
["4th",{"$f":"$B$7*$E$71","v":243.60000000000002},{"$f":"$C$7*$E$71","v":162.4},"è",0.14000000000000001]
["5th",{"$f":"$B$7*$E$72","v":191.4},{"$f":"$C$7*$E$72","v":127.6},"è",0.11]
["6th",{"$f":"$B$7*$E$73","v":139.20000000000002},{"$f":"$C$7*$E$73","v":92.8},"è",0.08]
["7th",{"$f":"$B$7*$E$74","v":87},{"$f":"$C$7*$E$74","v":58},"è",0.05]
["8th",{"$f":"$B$7*$E$75","v":34.800000000000004},{"$f":"$C$7*$E$75","v":23.2},"è",0.02]
["Totals",{"$f":"SUM(B68:B75)","v":1740},{"$f":"SUM(C68:C75)","v":1160},{"$f":"SUM(B76:C76)","v":2900},{"$f":"SUM(E68:E75)","v":1}]

{"sheet":"3D Payout","index":11,"n_rows":76,"n_cols":6,"rows_kept":76,"cut":false,"hidden":true,"merged":[[20,0,20,5],[26,0,26,5],[65,0,65,5],[44,0,44,5],[54,0,54,5],[27,0,27,5],[35,0,35,5],[21,4,21,5],[55,4,55,5],[45,4,45,5],[36,4,36,5],[28,4,28,5],[34,0,34,5],[0,0,0,5],[3,0,3,5],[8,0,8,5],[9,0,9,5],[5,5,7,5],[5,4,6,4],[13,0,13,5],[19,0,19,5],[14,0,14,5],[15,4,15,5],[10,4,10,5],[76,0,76,5],[43,0,43,5],[53,0,53,5],[64,0,64,5],[66,4,66,5]]}
["3D Payout"]
["Entry Fee","# Entries","% Payback","$ From Entry","Added $","  Total Payout"]
[10,3,0.8,{"$f":"$A$3*$C$3*$B$3","v":24},null,{"$f":"$D$3+$E$3","v":24}]
[]
["% in each D",0.5,0.3,0.2,"Total % =",{"$f":"SUM(B5:D5)","v":1}]
[null,"1D","2D","3D"]
[null,{"$f":"(($A$3*$B$3*$C$3*$B$5)+($E$3*$B$5))","v":12},{"$f":"(($A$3*$B$3*$C$3*$C$5)+($E$3*$C$5))","v":7.1999999999999993},{"$f":"(($A$3*$B$3*$C$3*$D$5)+($E$3*$D$5))","v":4.8000000000000007}]
["Totals",{"$f":"SUM(B7)","v":12},{"$f":"SUM(C7)","v":7.1999999999999993},4.8000000000000007,{"$f":"SUM(B8:D8)","v":24}]
[]
["For 1-10 riders 1 place"]
["Placings","1D","2D","3D"]
["1st",{"$f":"$B$7*$F$12","v":12},{"$f":"$C$7*$F$12","v":7.1999999999999993},{"$f":"$D$7*$F$12","v":4.8000000000000007},"è",1]
["Totals",{"$f":"SUM(B12:B12)","v":12},{"$f":"SUM(C12:C12)","v":7.1999999999999993},{"$f":"SUM(D12:D12)","v":4.8000000000000007},{"$f":"SUM(B13:D13)","v":24},{"$f":"SUM(F12)","v":1}]
[]
["For 11-15 riders 2 places"]
["Placings","1D","2D","3D"]
["1st",{"$f":"$B$7*$F$17","v":7.1999999999999993},{"$f":"$C$7*$F$17","v":4.3199999999999994},{"$f":"$D$7*$F$17","v":2.8800000000000003},"è",0.6]
["2nd",{"$f":"$B$7*$F$18","v":4.8000000000000007},{"$f":"$C$7*$F$18","v":2.88},{"$f":"$D$7*$F$18","v":1.9200000000000004},"è",0.4]
["Totals",{"$f":"SUM(B17:B18)","v":12},{"$f":"SUM(C17:C18)","v":7.1999999999999993},{"$f":"SUM(D17:D18)","v":4.8000000000000007},{"$f":"SUM(B19:D19)","v":24},{"$f":"SUM(F17:F18)","v":1}]
[]
["For 16-30 riders 3 places"]
["Placings","1D","2D","3D"]
["1st",{"$f":"$B$7*$F$23","v":6},{"$f":"$C$7*$F$23","v":3.5999999999999996},{"$f":"$D$7*$F$23","v":2.4000000000000004},"è",0.5]
["2nd",{"$f":"$B$7*$F$24","v":3.5999999999999996},{"$f":"$C$7*$F$24","v":2.1599999999999997},{"$f":"$D$7*$F$24","v":1.4400000000000002},"è",0.3]
["3rd",{"$f":"$B$7*$F$25","v":2.4000000000000004},{"$f":"$C$7*$F$25","v":1.44},{"$f":"$D$7*$F$25","v":0.96000000000000019},"è",0.2]
["Totals",{"$f":"SUM(B23:B25)","v":12},{"$f":"SUM(C23:C25)","v":7.1999999999999993},{"$f":"SUM(D22:D25)","v":4.8000000000000007},{"$f":"SUM(B26:D26)","v":24},{"$f":"SUM(F23:F25)","v":1}]
[]
["For 31-60 riders 4 places"]
["Placings","1D","2D","3D"]
["1st",{"$f":"$B$7*$F$30","v":5.04},{"$f":"$C$7*$F$30","v":3.0239999999999996},{"$f":"$D$7*$F$30","v":2.016},"è",0.42]
["2nd",{"$f":"$B$7*$F$31","v":3.4799999999999995},{"$f":"$C$7*$F$31","v":2.0879999999999996},{"$f":"$D$7*$F$31","v":1.3920000000000001},"è",0.28999999999999998]
["3rd",{"$f":"$B$7*$F$32","v":2.2800000000000002},{"$f":"$C$7*$F$32","v":1.3679999999999999},{"$f":"$D$7*$F$32","v":0.91200000000000014},"è",0.19]
["4th",{"$f":"$B$7*$F$33","v":1.2000000000000002},{"$f":"$C$7*$F$33","v":0.72},{"$f":"$D$7*$F$33","v":0.48000000000000009},"è",0.1]
["Totals",{"$f":"SUM(B30:B33)","v":12},{"$f":"SUM(C30:C33)","v":7.1999999999999984},{"$f":"SUM(D30:D33)","v":4.8000000000000007},{"$f":"SUM(B34:D34)","v":24},{"$f":"SUM(F30:F33)","v":0.99999999999999989}]
[]
["For 61-90 riders 5 places"]
["Placings","1D","2D","3D"]
["1st",{"$f":"$B$7*$F$38","v":4.5600000000000005},{"$f":"$C$7*$F$38","v":2.7359999999999998},{"$f":"$D$7*$F$38","v":1.8240000000000003},"è",0.38]
["2nd",{"$f":"$B$7*$F$39","v":3.3600000000000003},{"$f":"$C$7*$F$39","v":2.016},{"$f":"$D$7*$F$39","v":1.3440000000000003},"è",0.28000000000000003]
["3rd",{"$f":"$B$7*$F$40","v":2.16},{"$f":"$C$7*$F$40","v":1.2959999999999998},{"$f":"$D$7*$F$40","v":0.8640000000000001},"è",0.18]
["4th",{"$f":"$B$7*$F$41","v":1.2000000000000002},{"$f":"$C$7*$F$41","v":0.72},{"$f":"$D$7*$F$41","v":0.48000000000000009},"è",0.1]
["5th",{"$f":"$B$7*$F$42","v":0.72},{"$f":"$C$7*$F$42","v":0.43199999999999994},{"$f":"$D$7*$F$42","v":0.28800000000000003},"è",0.06]
["Totals",{"$f":"SUM(B38:B42)","v":12.000000000000002},{"$f":"SUM(C38:C42)","v":7.1999999999999993},{"$f":"SUM(D38:D42)","v":4.8000000000000016},{"$f":"SUM(B43:D43)","v":24.000000000000004},{"$f":"SUM(F38:F42)","v":1}]
[]
["For 91-120 riders 6 places"]
["Placings","1D","2D","3D"]
["1st",{"$f":"$B$7*$F$47","v":4.32},{"$f":"$C$7*$F$47","v":2.5919999999999996},{"$f":"$D$7*$F$47","v":1.7280000000000002},"è",0.36]
["2nd",{"$f":"$B$7*$F$48","v":3.12},{"$f":"$C$7*$F$48","v":1.8719999999999999},{"$f":"$D$7*$F$48","v":1.2480000000000002},"è",0.26]
["3rd",{"$f":"$B$7*$F$49","v":1.92},{"$f":"$C$7*$F$49","v":1.1519999999999999},{"$f":"$D$7*$F$49","v":0.76800000000000013},"è",0.16]
["4th",{"$f":"$B$7*$F$50","v":1.2000000000000002},{"$f":"$C$7*$F$50","v":0.72},{"$f":"$D$7*$F$50","v":0.48000000000000009},"è",0.1]
["5th",{"$f":"$B$7*$F$51","v":0.84000000000000008},{"$f":"$C$7*$F$51","v":0.504},{"$f":"$D$7*$F$51","v":0.33600000000000008},"è",7.0000000000000007E-2]
["6th",{"$f":"$B$7*$F$52","v":0.60000000000000009},{"$f":"$C$7*$F$52","v":0.36},{"$f":"$D$7*$F$52","v":0.24000000000000005},"è",0.05]
["Totals",{"$f":"SUM(B47:B52)","v":11.999999999999998},{"$f":"SUM(C47:C52)","v":7.2},{"$f":"SUM(D47:D52)","v":4.8000000000000016},{"$f":"SUM(B53:D53)","v":24},{"$f":"SUM(F47:F52)","v":1}]
[]
["For 121-200 riders 7 places"]
["Placings","1D","2D","3D"]
["1st",{"$f":"$B$7*$F$57","v":3.12},{"$f":"$C$7*$F$57","v":1.8719999999999999},{"$f":"$D$7*$F$57","v":1.2480000000000002},"è",0.26]
["2nd",{"$f":"$B$7*$F$58","v":2.4000000000000004},{"$f":"$C$7*$F$58","v":1.44},{"$f":"$D$7*$F$58","v":0.96000000000000019},"è",0.2]
["3rd",{"$f":"$B$7*$F$59","v":1.7999999999999998},{"$f":"$C$7*$F$59","v":1.0799999999999998},{"$f":"$D$7*$F$59","v":0.72000000000000008},"è",0.15]
["4th",{"$f":"$B$7*$F$60","v":1.44},{"$f":"$C$7*$F$60","v":0.86399999999999988},{"$f":"$D$7*$F$60","v":0.57600000000000007},"è",0.12]
["5th",{"$f":"$B$7*$F$61","v":1.2000000000000002},{"$f":"$C$7*$F$61","v":0.72},{"$f":"$D$7*$F$61","v":0.48000000000000009},"è",0.1]
["6th",{"$f":"$B$7*$F$62","v":1.08},{"$f":"$C$7*$F$62","v":0.64799999999999991},{"$f":"$D$7*$F$62","v":0.43200000000000005},"è",0.09]
["7th",{"$f":"$B$7*$F$63","v":0.96},{"$f":"$C$7*$F$63","v":0.57599999999999996},{"$f":"$D$7*$F$63","v":0.38400000000000006},"è",0.08]
["Totals",{"$f":"SUM(B57:B63)","v":12},{"$f":"SUM(C57:C63)","v":7.1999999999999984},{"$f":"SUM(D57:D63)","v":4.8000000000000007},{"$f":"SUM(B64:D64)","v":24},{"$f":"SUM(F57:F63)","v":0.99999999999999989}]
[]
["For 201 or more riders 8 places"]
["Placings","1D","2D","3D"]
["1st",{"$f":"$B$7*0.24","v":2.88},{"$f":"$C$7*0.24","v":1.7279999999999998},{"$f":"$D$7*0.24","v":1.1520000000000001},"è",0.24]
["2nd",{"$f":"$B$7*0.18","v":2.16},{"$f":"$C$7*0.18","v":1.2959999999999998},{"$f":"$D$7*0.18","v":0.8640000000000001},"è",0.18]
["3rd",{"$f":"$B$7*0.15","v":1.7999999999999998},{"$f":"$C$7*0.15","v":1.0799999999999998},{"$f":"$D$7*0.15","v":0.72000000000000008},"è",0.15]
["4th",{"$f":"$B$7*0.12","v":1.44},{"$f":"$C$7*0.12","v":0.86399999999999988},{"$f":"$D$7*0.12","v":0.57600000000000007},"è",0.12]
["5th",{"$f":"$B$7*0.1","v":1.2000000000000002},{"$f":"$C$7*0.1","v":0.72},{"$f":"$D$7*0.1","v":0.48000000000000009},"è",0.1]
["6th",{"$f":"$B$7*0.08","v":0.96},{"$f":"$C$7*0.08","v":0.57599999999999996},{"$f":"$D$7*0.08","v":0.38400000000000006},"è",0.08]
["7th",{"$f":"$B$7*0.07","v":0.84000000000000008},{"$f":"$C$7*0.07","v":0.504},{"$f":"$D$7*0.07","v":0.33600000000000008},"è",7.0000000000000007E-2]
["8th",{"$f":"$B$7*0.06","v":0.72},{"$f":"$C$7*0.06","v":0.43199999999999994},{"$f":"$D$7*0.06","v":0.28800000000000003},"è",0.06]
["Totals",{"$f":"SUM(B68:B75)","v":12.000000000000002},{"$f":"SUM(C68:C75)","v":7.1999999999999993},{"$f":"SUM(D68:D75)","v":4.8000000000000007},{"$f":"SUM(B76:D76)","v":24.000000000000004},{"$f":"SUM(F68:F75)","v":1}]

{"sheet":"4D Payout BBR","index":12,"n_rows":172,"n_cols":7,"rows_kept":172,"cut":false,"hidden":true,"merged":[[139,0,139,6],[140,5,140,6],[79,0,79,6],[80,0,80,6],[81,5,81,6],[96,0,96,6],[97,5,97,6],[95,0,95,6],[114,0,114,6],[115,0,115,6],[55,5,55,6],[65,0,65,6],[66,0,66,6],[116,5,116,6],[138,0,138,6],[0,0,0,6],[3,0,3,6],[5,5,6,5],[5,6,7,6],[8,0,8,6],[9,0,9,6],[10,5,10,6],[13,0,13,6],[14,0,14,6],[20,0,20,6],[172,0,172,5],[21,5,21,6],[15,5,15,6],[27,0,27,6],[45,5,45,6],[54,0,54,6],[28,5,28,6],[35,0,35,6],[36,5,36,6],[44,0,44,6],[19,0,19,6],[67,5,67,6],[53,0,53,6],[43,0,43,6],[34,0,34,6],[26,0,26,6]]}
["4D Payout BBR"]
["Entry Fee","# Entries","% Payback","$ From Entry","Added $","Total Payout"]
[40,200,0.8,{"$f":"$A$3*$C$3*$B$3","v":6400},1100,{"$f":"($A$3*$C$3)*$B$3+$E$3","v":7500}]
[]
["% in each D",0.35,0.3,0.2,0.15,"Total % Payout",{"$f":"SUM(B5:E5)","v":0.99999999999999989}]
[null,"1D","2D","3D","4D"]
[null,{"$f":"(($A$3*$B$3*$C$3*0.35)+($E$3/4))","v":2515},{"$f":"(($A$3*$B$3*$C$3*0.3)+($E$3/4))","v":2195},{"$f":"(($A$3*$B$3*$C$3*0.2)+($E$3/4))","v":1555},{"$f":"(($A$3*$B$3*$C$3*0.15)+($E$3/4))","v":1235}]
["Totals",{"$f":"SUM(B7)","v":2515},{"$f":"SUM(C7)","v":2195},1555,1235,{"$f":"SUM(B8:E8)","v":7500}]
[]
["For 1-16 riders 1 place"]
["Placings","1D","2D","3D","4D"]
["1st",{"$f":"$B$7*$G$12","v":2515},{"$f":"$C$7*$G$12","v":2195},{"$f":"$D$7*$G$12","v":1555},{"$f":"$E$7*$G$12","v":1235},"è",1]
["Totals",{"$f":"SUM(B12:B12)","v":2515},{"$f":"SUM(C12:C12)","v":2195},{"$f":"SUM(D12:D12)","v":1555},{"$f":"SUM(E12:E12)","v":1235},{"$f":"SUM(B13:E13)","v":7500},{"$f":"SUM(G12)","v":1}]
[]
["For 17-33 riders 2 places"]
["Placings","1D","2D","3D","4D"]
["1st",{"$f":"$B$7*$G$17","v":1509},{"$f":"$C$7*$G$17","v":1317},{"$f":"$D$7*$G$17","v":933},{"$f":"$E$7*$G$17","v":741},"è",0.6]
["2nd",{"$f":"$B$7*$G$18","v":1006},{"$f":"$C$7*$G$18","v":878},{"$f":"$D$7*$G$18","v":622},{"$f":"$E$7*$G$18","v":494},"è",0.4]
["Totals",{"$f":"SUM(B17:B18)","v":2515},{"$f":"SUM(C17:C18)","v":2195},{"$f":"SUM(D17:D18)","v":1555},{"$f":"SUM(E17:E18)","v":1235},{"$f":"SUM(B19:E19)","v":7500},{"$f":"SUM(G17:G18)","v":1}]
[]
["For 34-66 riders 3 places"]
["Placings","1D","2D","3D","4D"]
["1st",{"$f":"$B$7*$G$23","v":1257.5},{"$f":"$C$7*$G$23","v":1097.5},{"$f":"$D$7*$G$23","v":777.5},{"$f":"$E$7*$G$23","v":617.5},"è",0.5]
["2nd",{"$f":"$B$7*$G$24","v":754.5},{"$f":"$C$7*$G$24","v":658.5},{"$f":"$D$7*$G$24","v":466.5},{"$f":"$E$7*$G$24","v":370.5},"è",0.3]
["3rd",{"$f":"$B$7*$G$25","v":503},{"$f":"$C$7*$G$25","v":439},{"$f":"$D$7*$G$25","v":311},{"$f":"$E$7*$G$25","v":247},"è",0.2]
["Totals",{"$f":"SUM(B23:B25)","v":2515},{"$f":"SUM(C23:C25)","v":2195},{"$f":"SUM(D23:D25)","v":1555},{"$f":"SUM(E23:E25)","v":1235},{"$f":"SUM(B26:E26)","v":7500},{"$f":"SUM(G23:G25)","v":1}]
[]
["For 97-95 riders 4 places"]
["Placings","1D","2D","3D","4D"]
["1st",{"$f":"$B$7*$G$30","v":1006},{"$f":"$C$7*$G$30","v":878},{"$f":"$D$7*$G$30","v":622},{"$f":"$E$7*$G$30","v":494},"è",0.4]
["2nd",{"$f":"$B$7*$G$31","v":754.5},{"$f":"$C$7*$G$31","v":658.5},{"$f":"$D$7*$G$31","v":466.5},{"$f":"$E$7*$G$31","v":370.5},"è",0.3]
["3rd",{"$f":"$B$7*$G$32","v":503},{"$f":"$C$7*$G$32","v":439},{"$f":"$D$7*$G$32","v":311},{"$f":"$E$7*$G$32","v":247},"è",0.2]
["4th",{"$f":"$B$7*$G$33","v":251.5},{"$f":"$C$7*$G$33","v":219.5},{"$f":"$D$7*$G$33","v":155.5},{"$f":"$E$7*$G$33","v":123.5},"è",0.1]
["Totals",{"$f":"SUM(B30:B33)","v":2515},{"$f":"SUM(C30:C33)","v":2195},{"$f":"SUM(D30:D33)","v":1555},{"$f":"SUM(E30:E33)","v":1235},{"$f":"SUM(B34:E34)","v":7500},{"$f":"SUM(G30:G33)","v":0.99999999999999989}]
[]
["For 96-133 riders 5 places"]
["Placings","1D","2D","3D","4D"]
["1st",{"$f":"$B$7*$G$38","v":829.95},{"$f":"$C$7*$G$38","v":724.35},{"$f":"$D$7*G38","v":513.15},{"$f":"$E$7*$G$38","v":407.55},"è",0.33]
["2nd",{"$f":"$B$7*$G$39","v":679.05000000000007},{"$f":"$C$7*$G$39","v":592.65000000000009},{"$f":"$D$7*$G$39","v":419.85},{"$f":"$E$7*$G$39","v":333.45000000000005},"è",0.27]
["3rd",{"$f":"$B$7*$G$40","v":503},{"$f":"$C$7*$G$40","v":439},{"$f":"$D$7*$G$40","v":311},{"$f":"$E$7*$G$40","v":247},"è",0.2]
["4th",{"$f":"$B$7*$G$41","v":326.95},{"$f":"$C$7*$G$41","v":285.35000000000002},{"$f":"$D$7*$G$41","v":202.15},{"$f":"$E$7*$G$41","v":160.55000000000001},"è",0.13]
["5th",{"$f":"$B$7*$G$42","v":176.05},{"$f":"$C$7*$G$42","v":153.65},{"$f":"$D$7*$G$42","v":108.85000000000001},{"$f":"$E$7*$G$42","v":86.45},"è",7.0000000000000007E-2]
["Totals",{"$f":"SUM(B38:B42)","v":2515},{"$f":"SUM(C38:C42)","v":2195},{"$f":"SUM(D38:D42)","v":1555},{"$f":"SUM(E38:E42)","v":1235},{"$f":"SUM(B43:E43)","v":7500},{"$f":"SUM(G38:G42)","v":1}]
[]
["For 134-166 riders 6 places"]
["Placings","1D","2D","3D","4D"]
["1st",{"$f":"$B$7*$G$47","v":729.34999999999991},{"$f":"$C$7*$G$47","v":636.54999999999995},{"$f":"$D$7*$G$47","v":450.95},{"$f":"$E$7*$G$47","v":358.15},"è",0.28999999999999998]
["2nd",{"$f":"$B$7*$G$48","v":603.6},{"$f":"$C$7*$G$48","v":526.79999999999995},{"$f":"$D$7*$G$48","v":373.2},{"$f":"$E$7*$G$48","v":296.39999999999998},"è",0.24]
["3rd",{"$f":"$B$7*$G$49","v":477.85},{"$f":"$C$7*$G$49","v":417.05},{"$f":"$D$7*$G$49","v":295.45},{"$f":"$E$7*$G$49","v":234.65},"è",0.19]
["4th",{"$f":"$B$7*$G$50","v":352.1},{"$f":"$C$7*$G$50","v":307.3},{"$f":"$D$7*$G$50","v":217.70000000000002},{"$f":"$E$7*$G$50","v":172.9},"è",0.14000000000000001]
["5th",{"$f":"$B$7*$G$51","v":226.35},{"$f":"$C$7*$G$51","v":197.54999999999998},{"$f":"$D$7*$G$51","v":139.94999999999999},{"$f":"$E$7*$G$51","v":111.14999999999999},"è",0.09]
["6th",{"$f":"$B$7*$G$52","v":125.75},{"$f":"$C$7*$G$52","v":109.75},{"$f":"$D$7*$G$52","v":77.75},{"$f":"$E$7*$G$52","v":61.75},"è",0.05]
["Totals",{"$f":"SUM(B47:B52)","v":2514.9999999999995},{"$f":"SUM(C47:C52)","v":2195},{"$f":"SUM(D47:D52)","v":1555},{"$f":"SUM(E47:E52)","v":1235},{"$f":"SUM(B53:E53)","v":7500},{"$f":"SUM(G47:G52)","v":1}]
[]
["For 167-222 riders 8 places"]
["Placings","1D","2D","3D","4D"]
["1st",{"$f":"$B$7*$G$57","v":603.6},{"$f":"$C$7*$G$57","v":526.79999999999995},{"$f":"$D$7*$G$57","v":373.2},{"$f":"$E$7*$G$57","v":296.39999999999998},"è",0.24]
["2nd",{"$f":"$B$7*$G$58","v":503},{"$f":"$C$7*$G$58","v":439},{"$f":"$D$7*$G$58","v":311},{"$f":"$E$7*$G$58","v":247},"è",0.2]
["3rd",{"$f":"$B$7*$G$59","v":427.55},{"$f":"$C$7*$G$59","v":373.15000000000003},{"$f":"$D$7*$G$59","v":264.35000000000002},{"$f":"$E$7*$G$59","v":209.95000000000002},"è",0.17]
["4th",{"$f":"$B$7*$G$60","v":326.95},{"$f":"$C$7*$G$60","v":285.35000000000002},{"$f":"$D$7*$G$60","v":202.15},{"$f":"$E$7*$G$60","v":160.55000000000001},"è",0.13]
["5th",{"$f":"$B$7*$G$61","v":251.5},{"$f":"$C$7*$G$61","v":219.5},{"$f":"$D$7*$G$61","v":155.5},{"$f":"$E$7*$G$61","v":123.5},"è",0.1]
["6th",{"$f":"$B$7*$G$62","v":176.05},{"$f":"$C$7*$G$62","v":153.65},{"$f":"$D$7*$G$62","v":108.85000000000001},{"$f":"$E$7*$G$62","v":86.45},"è",7.0000000000000007E-2]
["7th",{"$f":"$B$7*$G$63","v":125.75},{"$f":"$C$7*$G$63","v":109.75},{"$f":"$D$7*$G$63","v":77.75},{"$f":"$E$7*$G$63","v":61.75},"è",0.05]
["8th",{"$f":"$B$7*$G$64","v":100.60000000000001},{"$f":"$C$7*$G$64","v":87.8},{"$f":"$D$7*$G$64","v":62.2},{"$f":"$E$7*$G$64","v":49.4},"è",0.04]
["Totals",{"$f":"SUM(B57:B64)","v":2515},{"$f":"SUM(C57:C64)","v":2195.0000000000005},{"$f":"SUM(D57:D64)","v":1555},{"$f":"SUM(E57:E64)","v":1235.0000000000002},{"$f":"SUM(B65:E65)","v":7500},{"$f":"SUM(G57:G64)","v":1}]
[]
["For 223-333 riders 10 places"]
["Placings","1D","2D","3D","4D"]
["1st",{"$f":"$B$7*$G$69","v":528.15},{"$f":"$C$7*$G$69","v":460.95},{"$f":"$D$7*$G$69","v":326.55},{"$f":"$E$7*$G$69","v":259.34999999999997},"è",0.21]
["2nd",{"$f":"$B$7*$G$70","v":452.7},{"$f":"$C$7*$G$70","v":395.09999999999997},{"$f":"$D$7*$G$70","v":279.89999999999998},{"$f":"$E$7*$G$70","v":222.29999999999998},"è",0.18]
["3rd",{"$f":"$B$7*$G$71","v":377.25},{"$f":"$C$7*$G$71","v":329.25},{"$f":"$D$7*$G$71","v":233.25},{"$f":"$E$7*$G$71","v":185.25},"è",0.15]
["4th",{"$f":"$B$7*$G$72","v":301.8},{"$f":"$C$7*$G$72","v":263.39999999999998},{"$f":"$D$7*$G$72","v":186.6},{"$f":"$E$7*$G$72","v":148.19999999999999},"è",0.12]
["5th",{"$f":"$B$7*$G$73","v":226.35},{"$f":"$C$7*$G$73","v":197.54999999999998},{"$f":"$D$7*$G$73","v":139.94999999999999},{"$f":"$E$7*$G$73","v":111.14999999999999},"è",0.09]
["6th",{"$f":"$B$7*$G$74","v":176.05},{"$f":"$C$7*$G$74","v":153.65},{"$f":"$D$7*$G$74","v":108.85000000000001},{"$f":"$E$7*$G$74","v":86.45},"è",7.0000000000000007E-2]
["7th",{"$f":"$B$7*$G$75","v":150.9},{"$f":"$C$7*$G$75","v":131.69999999999999},{"$f":"$D$7*$G$75","v":93.3},{"$f":"$E$7*$G$75","v":74.099999999999994},"è",0.06]
["8th",{"$f":"$B$7*$G$76","v":125.75},{"$f":"$C$7*$G$76","v":109.75},{"$f":"$D$7*$G$76","v":77.75},{"$f":"$E$7*$G$76","v":61.75},"è",0.05]
["9th",{"$f":"$B$7*$G$77","v":100.60000000000001},{"$f":"$C$7*$G$77","v":87.8},{"$f":"$D$7*$G$77","v":62.2},{"$f":"$E$7*$G$77","v":49.4},"è",0.04]
["10th",{"$f":"$B$7*$G$78","v":75.45},{"$f":"$C$7*$G$78","v":65.849999999999994},{"$f":"$D$7*$G$78","v":46.65},{"$f":"$E$7*$G$78","v":37.049999999999997},"è",0.03]
["Totals",{"$f":"SUM(B69:B78)","v":2514.9999999999995},{"$f":"SUM(C69:C78)","v":2195},{"$f":"SUM(D69:D78)","v":1555},{"$f":"SUM(E69:E78)","v":1235},{"$f":"B79+C79+D79+E79","v":7500},{"$f":"SUM(G69:G78)","v":1.0000000000000002}]
[]
["For 334-500 riders 12 places"]
["Placings","1D","2D","3D","4D"]
["1st",{"$f":"$B$7*$G$83","v":477.85},{"$f":"$C$7*$G$83","v":417.05},{"$f":"$D$7*$G$83","v":295.45},{"$f":"$E$7*$G$83","v":234.65},"è",0.19]
["2nd",{"$f":"$B$7*$G$84","v":377.25},{"$f":"$C$7*$G$84","v":329.25},{"$f":"$D$7*$G$84","v":233.25},{"$f":"$E$7*$G$84","v":185.25},"è",0.15]
["3rd",{"$f":"$B$7*$G$85","v":301.8},{"$f":"$C$7*$G$85","v":263.39999999999998},{"$f":"$D$7*$G$85","v":186.6},{"$f":"$E$7*$G$85","v":148.19999999999999},"è",0.12]
["4th",{"$f":"$B$7*$G$86","v":251.5},{"$f":"$C$7*$G$86","v":219.5},{"$f":"$D$7*$G$86","v":155.5},{"$f":"$E$7*$G$86","v":123.5},"è",0.1]
["5th",{"$f":"$B$7*$G$87","v":226.35},{"$f":"$C$7*$G$87","v":197.54999999999998},{"$f":"$D$7*$G$87","v":139.94999999999999},{"$f":"$E$7*$G$87","v":111.14999999999999},"è",0.09]
["6th",{"$f":"$B$7*$G$88","v":201.20000000000002},{"$f":"$C$7*$G$88","v":175.6},{"$f":"$D$7*$G$88","v":124.4},{"$f":"$E$7*$G$88","v":98.8},"è",0.08]
["7th",{"$f":"$B$7*$G$89","v":176.05},{"$f":"$C$7*$G$89","v":153.65},{"$f":"$D$7*$G$89","v":108.85000000000001},{"$f":"$E$7*$G$89","v":86.45},"è",7.0000000000000007E-2]
["8th",{"$f":"$B$7*$G$90","v":150.9},{"$f":"$C$7*$G$90","v":131.69999999999999},{"$f":"$D$7*$G$90","v":93.3},{"$f":"$E$7*$G$90","v":74.099999999999994},"è",0.06]
["9th",{"$f":"$B$7*$G$91","v":125.75},{"$f":"$C$7*$G$91","v":109.75},{"$f":"$D$7*$G$91","v":77.75},{"$f":"$E$7*$G$91","v":61.75},"è",0.05]
["10th",{"$f":"$B$7*$G$92","v":100.60000000000001},{"$f":"$C$7*$G$92","v":87.8},{"$f":"$D$7*$G$92","v":62.2},{"$f":"$E$7*$G$92","v":49.4},"è",0.04]
["11th",{"$f":"$B$7*$G$93","v":75.45},{"$f":"$C$7*$G$93","v":65.849999999999994},{"$f":"$D$7*$G$93","v":46.65},{"$f":"$E$7*$G$93","v":37.049999999999997},"è",0.03]
["12th",{"$f":"$B$7*$G$94","v":50.300000000000004},{"$f":"$C$7*$G$94","v":43.9},{"$f":"$D$7*$G$94","v":31.1},{"$f":"$E$7*$G$94","v":24.7},"è",0.02]
["Totals",{"$f":"SUM(B83:B94)","v":2515},{"$f":"SUM(C83:C94)","v":2195},1555,1235,{"$f":"B95+C95+D95+E95","v":7500},{"$f":"SUM(G83:G94)","v":1}]
[]
["For 501-750 riders 15 places"]
["Placings","1D","2D","3D","4D"]
["1st",{"$f":"$B$7*$G$99","v":452.7},{"$f":"$C$7*$G$99","v":395.09999999999997},{"$f":"$D$7*$G$99","v":279.89999999999998},{"$f":"$E$7*$G$99","v":222.29999999999998},"è",0.18]
["2nd",{"$f":"$B$7*$G$100","v":377.25},{"$f":"$C$7*$G$100","v":329.25},{"$f":"$D$7*$G$100","v":233.25},{"$f":"$E$7*$G$100","v":185.25},"è",0.15]
["3rd",{"$f":"$B$7*$G$101","v":301.8},{"$f":"$C$7*$G$101","v":263.39999999999998},{"$f":"$D$7*$G$101","v":186.6},{"$f":"$E$7*$G$101","v":148.19999999999999},"è",0.12]
["4th",{"$f":"$B$7*$G$102","v":251.5},{"$f":"$C$7*$G$102","v":219.5},{"$f":"$D$7*$G$102","v":155.5},{"$f":"$E$7*$G$102","v":123.5},"è",0.1]
["5th",{"$f":"$B$7*$G$103","v":213.77500000000001},{"$f":"$C$7*$G$103","v":186.57500000000002},{"$f":"$D$7*$G$103","v":132.17500000000001},{"$f":"$E$7*$G$103","v":104.97500000000001},"è",8.5000000000000006E-2]
["6th",{"$f":"$B$7*$G$104","v":176.05},{"$f":"$C$7*$G$104","v":153.65},{"$f":"$D$7*$G$104","v":108.85000000000001},{"$f":"$E$7*$G$104","v":86.45},"è",7.0000000000000007E-2]
["7th",{"$f":"$B$7*$G$105","v":150.9},{"$f":"$C$7*$G$105","v":131.69999999999999},{"$f":"$D$7*$G$105","v":93.3},{"$f":"$E$7*$G$105","v":74.099999999999994},"è",0.06]
["8th",{"$f":"$B$7*$G$106","v":125.75},{"$f":"$C$7*$G$106","v":109.75},{"$f":"$D$7*$G$106","v":77.75},{"$f":"$E$7*$G$106","v":61.75},"è",0.05]
["9th",{"$f":"$B$7*$G$107","v":106.8875},{"$f":"$C$7*$G$107","v":93.287500000000009},{"$f":"$D$7*$G$107","v":66.087500000000006},{"$f":"$E$7*$G$107","v":52.487500000000004},"è",4.2500000000000003E-2]
["10th",{"$f":"$B$7*$G$108","v":88.025000000000006},{"$f":"$C$7*$G$108","v":76.825000000000003},{"$f":"$D$7*$G$108","v":54.425000000000004},{"$f":"$E$7*$G$108","v":43.225000000000001},"è",3.5000000000000003E-2]
["11th",{"$f":"$B$7*$G$109","v":75.45},{"$f":"$C$7*$G$109","v":65.849999999999994},{"$f":"$D$7*$G$109","v":46.65},{"$f":"$E$7*$G$109","v":37.049999999999997},"è",0.03]
["12th",{"$f":"$B$7*$G$110","v":62.875},{"$f":"$C$7*$G$110","v":54.875},{"$f":"$D$7*$G$110","v":38.875},{"$f":"$E$7*$G$110","v":30.875},"è",2.5000000000000001E-2]
["13th",{"$f":"$B$7*$G$111","v":50.300000000000004},{"$f":"$C$7*$G$111","v":43.9},{"$f":"$D$7*$G$111","v":31.1},{"$f":"$E$7*$G$111","v":24.7},"è",0.02]
["14th",{"$f":"$B$7*$G$112","v":44.012500000000003},{"$f":"$C$7*$G$112","v":38.412500000000001},{"$f":"$D$7*$G$112","v":27.212500000000002},{"$f":"$E$7*$G$112","v":21.612500000000001},"è",1.7500000000000002E-2]
["15th",{"$f":"$B$7*$G$113","v":37.725000000000001},{"$f":"$C$7*$G$113","v":32.924999999999997},{"$f":"$D$7*$G$113","v":23.324999999999999},{"$f":"$E$7*$G$113","v":18.524999999999999},"è",1.4999999999999999E-2]
["Totals",{"$f":"SUM(B99:B113)","v":2515},{"$f":"SUM(C99:C113)","v":2195},1555,1235,{"$f":"B114+C114+D114+E114","v":7500},{"$f":"SUM(G99:G113)","v":1}]
[]
["For 751-1200 riders 20 places"]
["Placings","1D","2D","3D","4D"]
["1st",{"$f":"$B$7*$G$118","v":352.1},{"$f":"$C$7*$G$118","v":307.3},{"$f":"$D$7*$G$118","v":217.70000000000002},{"$f":"$E$7*$G$118","v":172.9},"è",0.14000000000000001]
["2nd",{"$f":"$B$7*$G$119","v":276.64999999999998},{"$f":"$C$7*$G$119","v":241.45},{"$f":"$D$7*$G$119","v":171.05},{"$f":"$E$7*$G$119","v":135.85},"è",0.11]
["3rd",{"$f":"$B$7*$G$120","v":226.35},{"$f":"$C$7*$G$120","v":197.54999999999998},{"$f":"$D$7*$G$120","v":139.94999999999999},{"$f":"$E$7*$G$120","v":111.14999999999999},"è",0.09]
["4th",{"$f":"$B$7*$G$121","v":193.655},{"$f":"$C$7*$G$121","v":169.01499999999999},{"$f":"$D$7*$G$121","v":119.735},{"$f":"$E$7*$G$121","v":95.094999999999999},"è",7.6999999999999999E-2]
["5th",{"$f":"$B$7*$G$122","v":176.05},{"$f":"$C$7*$G$122","v":153.65},{"$f":"$D$7*$G$122","v":108.85000000000001},{"$f":"$E$7*$G$122","v":86.45},"è",7.0000000000000007E-2]
["6th",{"$f":"$B$7*$G$123","v":163.47499999999999},{"$f":"$C$7*$G$123","v":142.67500000000001},{"$f":"$D$7*$G$123","v":101.075},{"$f":"$E$7*$G$123","v":80.275000000000006},"è",6.5000000000000002E-2]
["7th",{"$f":"$B$7*$G$124","v":150.9},{"$f":"$C$7*$G$124","v":131.69999999999999},{"$f":"$D$7*$G$124","v":93.3},{"$f":"$E$7*$G$124","v":74.099999999999994},"è",0.06]
["8th",{"$f":"$B$7*$G$125","v":138.32499999999999},{"$f":"$C$7*$G$125","v":120.72499999999999},{"$f":"$D$7*$G$125","v":85.525000000000006},{"$f":"$E$7*$G$125","v":67.924999999999997},"è",5.5E-2]
["9th",{"$f":"$B$7*$G$126","v":125.75},{"$f":"$C$7*$G$126","v":109.75},{"$f":"$D$7*$G$126","v":77.75},{"$f":"$E$7*$G$126","v":61.75},"è",0.05]
["10th",{"$f":"$B$7*$G$127","v":113.175},{"$f":"$C$7*$G$127","v":98.774999999999991},{"$f":"$D$7*$G$127","v":69.974999999999994},{"$f":"$E$7*$G$127","v":55.574999999999996},"è",4.4999999999999998E-2]
["11th",{"$f":"$B$7*$G$128","v":100.60000000000001},{"$f":"$C$7*$G$128","v":87.8},{"$f":"$D$7*$G$128","v":62.2},{"$f":"$E$7*$G$128","v":49.4},"è",0.04]
["12th",{"$f":"$B$7*$G$129","v":93.054999999999993},{"$f":"$C$7*$G$129","v":81.214999999999989},{"$f":"$D$7*$G$129","v":57.534999999999997},{"$f":"$E$7*$G$129","v":45.695},"è",3.6999999999999998E-2]
["13th",{"$f":"$B$7*$G$130","v":82.995000000000005},{"$f":"$C$7*$G$130","v":72.435000000000002},{"$f":"$D$7*$G$130","v":51.315000000000005},{"$f":"$E$7*$G$130","v":40.755000000000003},"è",3.3000000000000002E-2]
["14th",{"$f":"$B$7*$G$131","v":72.935000000000002},{"$f":"$C$7*$G$131","v":63.655000000000001},{"$f":"$D$7*$G$131","v":45.094999999999999},{"$f":"$E$7*$G$131","v":35.815000000000005},"è",2.9000000000000001E-2]
["15th",{"$f":"$B$7*$G$132","v":62.875},{"$f":"$C$7*$G$132","v":54.875},{"$f":"$D$7*$G$132","v":38.875},{"$f":"$E$7*$G$132","v":30.875},"è",2.5000000000000001E-2]
["16th",{"$f":"$B$7*$G$133","v":52.815000000000005},{"$f":"$C$7*$G$133","v":46.095000000000006},{"$f":"$D$7*$G$133","v":32.655000000000001},{"$f":"$E$7*$G$133","v":25.935000000000002},"è",2.1000000000000001E-2]
["17th",{"$f":"$B$7*$G$134","v":42.755000000000003},{"$f":"$C$7*$G$134","v":37.315000000000005},{"$f":"$D$7*$G$134","v":26.435000000000002},{"$f":"$E$7*$G$134","v":20.995000000000001},"è",1.7000000000000001E-2]
["18th",{"$f":"$B$7*$G$135","v":35.21},{"$f":"$C$7*$G$135","v":30.73},{"$f":"$D$7*$G$135","v":21.77},{"$f":"$E$7*$G$135","v":17.29},"è",1.4E-2]
["19th",{"$f":"$B$7*$G$136","v":30.18},{"$f":"$C$7*$G$136","v":26.34},{"$f":"$D$7*$G$136","v":18.66},{"$f":"$E$7*$G$136","v":14.82},"è",1.2E-2]
["20th",{"$f":"$B$7*$G$137","v":25.150000000000002},{"$f":"$C$7*$G$137","v":21.95},{"$f":"$D$7*$G$137","v":15.55},{"$f":"$E$7*$G$137","v":12.35},"è",0.01]
["Totals",{"$f":"SUM(B118:B137)","v":2515},{"$f":"SUM(C118:C137)","v":2194.9999999999995},1555.0000000000002,1234.9999999999998,{"$f":"B138+C138+D138+E138","v":7500},{"$f":"SUM(G118:G137)","v":1.0000000000000004}]
[]
["For 1201 or More riders 30 places"]
["Placings","1D","2D","3D","4D"]
["1st",{"$f":"$B$7*$G$142","v":301.8},{"$f":"$C$7*$G$142","v":263.39999999999998},{"$f":"$D$7*$G$142","v":186.6},{"$f":"$E$7*$G$142","v":148.19999999999999},"è",0.12]
["2nd",{"$f":"$B$7*$G$143","v":238.92500000000001},{"$f":"$C$7*$G$143","v":208.52500000000001},{"$f":"$D$7*$G$143","v":147.72499999999999},{"$f":"$E$7*$G$143","v":117.325},"è",9.5000000000000001E-2]
["3rd",{"$f":"$B$7*$G$144","v":183.595},{"$f":"$C$7*$G$144","v":160.23499999999999},{"$f":"$D$7*$G$144","v":113.51499999999999},{"$f":"$E$7*$G$144","v":90.155000000000001},"è",7.2999999999999995E-2]
["4th",{"$f":"$B$7*$G$145","v":155.93},{"$f":"$C$7*$G$145","v":136.09},{"$f":"$D$7*$G$145","v":96.41},{"$f":"$E$7*$G$145","v":76.569999999999993},"è",6.2E-2]
["5th",{"$f":"$B$7*$G$146","v":125.75},{"$f":"$C$7*$G$146","v":109.75},{"$f":"$D$7*$G$146","v":77.75},{"$f":"$E$7*$G$146","v":61.75},"è",0.05]
["6th",{"$f":"$B$7*$G$147","v":113.175},{"$f":"$C$7*$G$147","v":98.774999999999991},{"$f":"$D$7*$G$147","v":69.974999999999994},{"$f":"$E$7*$G$147","v":55.574999999999996},"è",4.4999999999999998E-2]
["7th",{"$f":"$B$7*$G$148","v":108.145},{"$f":"$C$7*$G$148","v":94.384999999999991},{"$f":"$D$7*$G$148","v":66.864999999999995},{"$f":"$E$7*$G$148","v":53.104999999999997},"è",4.2999999999999997E-2]
["8th",{"$f":"$B$7*$G$149","v":100.60000000000001},{"$f":"$C$7*$G$149","v":87.8},{"$f":"$D$7*$G$149","v":62.2},{"$f":"$E$7*$G$149","v":49.4},"è",0.04]
["9th",{"$f":"$B$7*$G$150","v":93.054999999999993},{"$f":"$C$7*$G$150","v":81.214999999999989},{"$f":"$D$7*$G$150","v":57.534999999999997},{"$f":"$E$7*$G$150","v":45.695},"è",3.6999999999999998E-2]
["10th",{"$f":"$B$7*$G$151","v":88.025000000000006},{"$f":"$C$7*$G$151","v":76.825000000000003},{"$f":"$D$7*$G$151","v":54.425000000000004},{"$f":"$E$7*$G$151","v":43.225000000000001},"è",3.5000000000000003E-2]
["11th",{"$f":"$B$7*$G$152","v":82.995000000000005},{"$f":"$C$7*$G$152","v":72.435000000000002},{"$f":"$D$7*$G$152","v":51.315000000000005},{"$f":"$E$7*$G$152","v":40.755000000000003},"è",3.3000000000000002E-2]
["12th",{"$f":"$B$7*$G$153","v":77.965000000000003},{"$f":"$C$7*$G$153","v":68.045000000000002},{"$f":"$D$7*$G$153","v":48.204999999999998},{"$f":"$E$7*$G$153","v":38.284999999999997},"è",3.1E-2]
["13th",{"$f":"$B$7*$G$154","v":72.935000000000002},{"$f":"$C$7*$G$154","v":63.655000000000001},{"$f":"$D$7*$G$154","v":45.094999999999999},{"$f":"$E$7*$G$154","v":35.815000000000005},"è",2.9000000000000001E-2]
["14th",{"$f":"$B$7*$G$155","v":67.905000000000001},{"$f":"$C$7*$G$155","v":59.265000000000001},{"$f":"$D$7*$G$155","v":41.984999999999999},{"$f":"$E$7*$G$155","v":33.344999999999999},"è",2.7E-2]
["15th",{"$f":"$B$7*$G$156","v":62.875},{"$f":"$C$7*$G$156","v":54.875},{"$f":"$D$7*$G$156","v":38.875},{"$f":"$E$7*$G$156","v":30.875},"è",2.5000000000000001E-2]
["16th",{"$f":"$B$7*$G$157","v":60.36},{"$f":"$C$7*$G$157","v":52.68},{"$f":"$D$7*$G$157","v":37.32},{"$f":"$E$7*$G$157","v":29.64},"è",2.4E-2]
["17th",{"$f":"$B$7*$G$158","v":57.844999999999999},{"$f":"$C$7*$G$158","v":50.484999999999999},{"$f":"$D$7*$G$158","v":35.765000000000001},{"$f":"$E$7*$G$158","v":28.405000000000001},"è",2.3E-2]
["18th",{"$f":"$B$7*$G$159","v":55.33},{"$f":"$C$7*$G$159","v":48.29},{"$f":"$D$7*$G$159","v":34.21},{"$f":"$E$7*$G$159","v":27.169999999999998},"è",2.1999999999999999E-2]
["19th",{"$f":"$B$7*$G$160","v":52.815000000000005},{"$f":"$C$7*$G$160","v":46.095000000000006},{"$f":"$D$7*$G$160","v":32.655000000000001},{"$f":"$E$7*$G$160","v":25.935000000000002},"è",2.1000000000000001E-2]
["20th",{"$f":"$B$7*$G$161","v":50.300000000000004},{"$f":"$C$7*$G$161","v":43.9},{"$f":"$D$7*$G$161","v":31.1},{"$f":"$E$7*$G$161","v":24.7},"è",0.02]
["21st",{"$f":"$B$7*$G$162","v":47.784999999999997},{"$f":"$C$7*$G$162","v":41.704999999999998},{"$f":"$D$7*$G$162","v":29.544999999999998},{"$f":"$E$7*$G$162","v":23.465},"è",1.9E-2]
["22nd",{"$f":"$B$7*$G$163","v":45.269999999999996},{"$f":"$C$7*$G$163","v":39.51},{"$f":"$D$7*$G$163","v":27.99},{"$f":"$E$7*$G$163","v":22.229999999999997},"è",1.7999999999999999E-2]
["23rd",{"$f":"$B$7*$G$164","v":42.755000000000003},{"$f":"$C$7*$G$164","v":37.315000000000005},{"$f":"$D$7*$G$164","v":26.435000000000002},{"$f":"$E$7*$G$164","v":20.995000000000001},"è",1.7000000000000001E-2]
["24th",{"$f":"$B$7*$G$165","v":40.24},{"$f":"$C$7*$G$165","v":35.119999999999997},{"$f":"$D$7*$G$165","v":24.88},{"$f":"$E$7*$G$165","v":19.760000000000002},"è",1.6E-2]
["25th",{"$f":"$B$7*$G$166","v":37.725000000000001},{"$f":"$C$7*$G$166","v":32.924999999999997},{"$f":"$D$7*$G$166","v":23.324999999999999},{"$f":"$E$7*$G$166","v":18.524999999999999},"è",1.4999999999999999E-2]
["26th",{"$f":"$B$7*$G$167","v":35.21},{"$f":"$C$7*$G$167","v":30.73},{"$f":"$D$7*$G$167","v":21.77},{"$f":"$E$7*$G$167","v":17.29},"è",1.4E-2]
["27th",{"$f":"$B$7*$G$168","v":32.695},{"$f":"$C$7*$G$168","v":28.535},{"$f":"$D$7*$G$168","v":20.215},{"$f":"$E$7*$G$168","v":16.055},"è",1.2999999999999999E-2]
["28th",{"$f":"$B$7*$G$169","v":30.18},{"$f":"$C$7*$G$169","v":26.34},{"$f":"$D$7*$G$169","v":18.66},{"$f":"$E$7*$G$169","v":14.82},"è",1.2E-2]
["29th",{"$f":"$B$7*$G$170","v":27.664999999999999},{"$f":"$C$7*$G$170","v":24.145},{"$f":"$D$7*$G$170","v":17.105},{"$f":"$E$7*$G$170","v":13.584999999999999},"è",1.0999999999999999E-2]
["30th",{"$f":"$B$7*$G$171","v":25.150000000000002},{"$f":"$C$7*$G$171","v":21.95},{"$f":"$D$7*$G$171","v":15.55},{"$f":"$E$7*$G$171","v":12.35},"è",0.01]
["Totals",{"$f":"SUM(B142:B171)","v":2514.9999999999995},{"$f":"SUM(C142:C171)","v":2194.9999999999995},{"$f":"SUM(D142:D171)","v":1555},{"$f":"SUM(E142:E171)","v":1234.9999999999998},{"$f":"B172+C172+D172+E172","v":7499.9999999999991},{"$f":"SUM(G142:G171)","v":1.0000000000000002}]

{"sheet":"5D Payout BBR","index":13,"n_rows":172,"n_cols":8,"rows_kept":172,"cut":false,"hidden":false,"merged":[[139,0,139,7],[80,0,80,7],[95,0,95,7],[96,0,96,7],[81,6,81,7],[97,6,97,7],[116,6,116,7],[114,0,114,7],[115,0,115,7],[65,0,65,7],[66,0,66,7],[79,0,79,7],[67,6,67,7],[138,0,138,7],[44,0,44,7],[45,6,45,7],[53,0,53,7],[54,0,54,7],[55,6,55,7],[0,0,0,7],[3,0,3,7],[8,0,8,7],[9,0,9,7],[5,6,6,6],[10,6,10,7],[13,0,13,7],[14,0,14,7],[140,6,140,7],[5,7,7,7],[15,6,15,7],[19,0,19,7],[20,0,20,7],[21,6,21,7],[26,0,26,7],[27,0,27,7],[28,6,28,7],[34,0,34,7],[35,0,35,7],[36,6,36,7],[43,0,43,7]]}
["5D Payout BBR"]
["Entry Fee","# Entries","% Payback","$ From Entry","Added $","Total Payout","Total $ Held"]
[50,26,0.8,{"$f":"$A$3*$C$3*$B$3","v":1040},null,{"$f":"($A$3*$C$3)*$B$3+$E$3","v":1040},{"$f":"$A$3*(100%-$C$3)*$B$3","v":259.99999999999994}]
[]
["% in each D",0.3,0.25,0.2,0.15,0.1,"Total % Payout",{"$f":"SUM(B5:F5)","v":1}]
[null,"1D","2D","3D","4D","5D"]
[null,{"$f":"(($A$3*$B$3*$C$3*$B$5)+($E$3*$B$5))","v":312},{"$f":"(($A$3*$B$3*$C$3*$C$5)+($E$3*$C$5))","v":260},{"$f":"(($A$3*$B$3*$C$3*$D$5)+($E$3*$D$5))","v":208},{"$f":"(($A$3*$B$3*$C$3*$E$5)+($E$3*$E$5))","v":156},{"$f":"(($A$3*$B$3*$C$3*$F$5)+($E$3*$F$5))","v":104}]
["Totals",{"$f":"SUM(B7)","v":312},{"$f":"SUM(C7)","v":260},208,156,104,{"$f":"SUM(B8:F8)","v":1040}]
[]
["For 1-25 riders 1 place"]
["Placings","1D","2D","3D","4D","5D"]
["1st",{"$f":"$B$7*$H$12","v":312},{"$f":"$C$7*$H$12","v":260},{"$f":"$D$7*$H$12","v":208},{"$f":"$E$7*$H$12","v":156},{"$f":"$F$7*$H$12","v":104},"è",1]
["Totals",{"$f":"SUM(B12:B12)","v":312},{"$f":"SUM(C12:C12)","v":260},{"$f":"SUM(D12:D12)","v":208},{"$f":"SUM(E12:E12)","v":156},{"$f":"SUM(F12)","v":104},{"$f":"SUM(B13:F13)","v":1040},{"$f":"SUM(H12)","v":1}]
[]
["For 26-50 riders 2 places"]
["Placings","1D","2D","3D","4D","5D"]
["1st",{"$f":"$B$7*$H$17","v":187.2},{"$f":"$C$7*$H$17","v":156},{"$f":"$D$7*$H$17","v":124.8},{"$f":"$E$7*$H$17","v":93.6},{"$f":"$F$7*$H$17","v":62.4},"è",0.6]
["2nd",{"$f":"$B$7*$H$18","v":124.80000000000001},{"$f":"$C$7*$H$18","v":104},{"$f":"$D$7*$H$18","v":83.2},{"$f":"$E$7*$H$18","v":62.400000000000006},{"$f":"$F$7*$H$18","v":41.6},"è",0.4]
["Totals",{"$f":"SUM(B17:B18)","v":312},{"$f":"SUM(C17:C18)","v":260},{"$f":"SUM(D17:D18)","v":208},{"$f":"SUM(E17:E18)","v":156},{"$f":"SUM(F17:F18)","v":104},{"$f":"SUM(B19:F19)","v":1040},{"$f":"SUM(H17:H18)","v":1}]
[]
["For 51-100 riders 3 places"]
["Placings","1D","2D","3D","4D","5D"]
["1st",{"$f":"$B$7*$H$23","v":156},{"$f":"$C$7*$H$23","v":130},{"$f":"$D$7*$H$23","v":104},{"$f":"$E$7*$H$23","v":78},{"$f":"$F$7*$H$23","v":52},"è",0.5]
["2nd",{"$f":"$B$7*$H$24","v":93.6},{"$f":"$C$7*$H$24","v":78},{"$f":"$D$7*$H$24","v":62.4},{"$f":"$E$7*$H$24","v":46.8},{"$f":"$F$7*$H$24","v":31.2},"è",0.3]
["3rd",{"$f":"$B$7*$H$25","v":62.400000000000006},{"$f":"$C$7*$H$25","v":52},{"$f":"$D$7*$H$25","v":41.6},{"$f":"$E$7*$H$25","v":31.200000000000003},{"$f":"$F$7*$H$25","v":20.8},"è",0.2]
["Totals",{"$f":"SUM(B23:B25)","v":312},{"$f":"SUM(C23:C25)","v":260},{"$f":"SUM(D23:D25)","v":208},{"$f":"SUM(E23:E25)","v":156},{"$f":"SUM(F23:F25)","v":104},{"$f":"SUM(B26:F26)","v":1040},{"$f":"SUM(H23:H25)","v":1}]
[]
["For 101-143 riders 4 places"]
["Placings","1D","2D","3D","4D","5D"]
["1st",{"$f":"$B$7*$H$30","v":124.80000000000001},{"$f":"$C$7*$H$30","v":104},{"$f":"$D$7*$H$30","v":83.2},{"$f":"$E$7*$H$30","v":62.400000000000006},{"$f":"$F$7*$H$30","v":41.6},"è",0.4]
["2nd",{"$f":"$B$7*$H$31","v":93.6},{"$f":"$C$7*$H$31","v":78},{"$f":"$D$7*$H$31","v":62.4},{"$f":"$E$7*$H$31","v":46.8},{"$f":"$F$7*$H$31","v":31.2},"è",0.3]
["3rd",{"$f":"$B$7*$H$32","v":62.400000000000006},{"$f":"$C$7*$H$32","v":52},{"$f":"$D$7*$H$32","v":41.6},{"$f":"$E$7*$H$32","v":31.200000000000003},{"$f":"$F$7*$H$32","v":20.8},"è",0.2]
["4th",{"$f":"$B$7*$H$33","v":31.200000000000003},{"$f":"$C$7*$H$33","v":26},{"$f":"$D$7*$H$33","v":20.8},{"$f":"$E$7*$H$33","v":15.600000000000001},{"$f":"$F$7*$H$33","v":10.4},"è",0.1]
["Totals",{"$f":"SUM(B30:B33)","v":312},{"$f":"SUM(C30:C33)","v":260},{"$f":"SUM(D30:D33)","v":208},{"$f":"SUM(E30:E33)","v":156},{"$f":"SUM(F30:F33)","v":104},{"$f":"SUM(B34:F34)","v":1040},{"$f":"SUM(H30:H33)","v":0.99999999999999989}]
[]
["For 144-200 riders 5 places"]
["Placings","1D","2D","3D","4D","5D"]
["1st",{"$f":"$B$7*$H$38","v":102.96000000000001},{"$f":"$C$7*$H$38","v":85.8},709.5,{"$f":"$E$7*$H$38","v":51.480000000000004},{"$f":"$F$7*$H$38","v":34.32},"è",0.33]
["2nd",{"$f":"$B$7*$H$39","v":84.240000000000009},{"$f":"$C$7*$H$39","v":70.2},580.5,{"$f":"$E$7*$H$39","v":42.120000000000005},{"$f":"$F$7*$H$39","v":28.080000000000002},"è",0.27]
["3rd",{"$f":"$B$7*$H$40","v":62.400000000000006},{"$f":"$C$7*$H$40","v":52},430,{"$f":"$E$7*$H$40","v":31.200000000000003},{"$f":"$F$7*$H$40","v":20.8},"è",0.2]
["4th",{"$f":"$B$7*$H$41","v":40.56},{"$f":"$C$7*$H$41","v":33.800000000000004},279.5,{"$f":"$E$7*$H$41","v":20.28},{"$f":"$F$7*$H$41","v":13.52},"è",0.13]
["5th",{"$f":"$B$7*$H$42","v":21.840000000000003},{"$f":"$C$7*$H$42","v":18.200000000000003},150.50000000000003,{"$f":"$E$7*$H$42","v":10.920000000000002},{"$f":"$F$7*$H$42","v":7.2800000000000011},"è",7.0000000000000007E-2]
["Totals",{"$f":"SUM(B38:B42)","v":312},{"$f":"SUM(C38:C42)","v":260},{"$f":"SUM(D38:D42)","v":2150},{"$f":"SUM(E38:E42)","v":156},{"$f":"SUM(F38:F42)","v":104},{"$f":"SUM(B43:F43)","v":2982},{"$f":"SUM(H38:H42)","v":1}]
[]
["For 201-250 riders 6 places"]
["Placings","1D","2D","3D","4D","5D"]
["1st",{"$f":"$B$7*$H$47","v":90.47999999999999},{"$f":"$C$7*$H$47","v":75.399999999999991},{"$f":"$D$7*$H$47","v":60.319999999999993},{"$f":"$E$7*$H$47","v":45.239999999999995},{"$f":"$F$7*$H$47","v":30.159999999999997},"è",0.28999999999999998]
["2nd",{"$f":"$B$7*$H$48","v":74.88},{"$f":"$C$7*$H$48","v":62.4},{"$f":"$D$7*$H$48","v":49.92},{"$f":"$E$7*$H$48","v":37.44},{"$f":"$F$7*$H$48","v":24.96},"è",0.24]
["3rd",{"$f":"$B$7*$H$49","v":59.28},{"$f":"$C$7*$H$49","v":49.4},{"$f":"$D$7*$H$49","v":39.520000000000003},{"$f":"$E$7*$H$49","v":29.64},{"$f":"$F$7*$H$49","v":19.760000000000002},"è",0.19]
["4th",{"$f":"$B$7*$H$50","v":43.680000000000007},{"$f":"$C$7*$H$50","v":36.400000000000006},{"$f":"$D$7*$H$50","v":29.120000000000005},{"$f":"$E$7*$H$50","v":21.840000000000003},{"$f":"$F$7*$H$50","v":14.560000000000002},"è",0.14000000000000001]
["5th",{"$f":"$B$7*$H$51","v":28.08},{"$f":"$C$7*$H$51","v":23.4},{"$f":"$D$7*$H$51","v":18.72},{"$f":"$E$7*$H$51","v":14.04},{"$f":"$F$7*$H$51","v":9.36},"è",0.09]
["6th",{"$f":"$B$7*$H$52","v":15.600000000000001},{"$f":"$C$7*$H$52","v":13},{"$f":"$D$7*$H$52","v":10.4},{"$f":"$E$7*$H$52","v":7.8000000000000007},{"$f":"$F$7*$H$52","v":5.2},"è",0.05]
["Totals",{"$f":"SUM(B47:B52)","v":312},{"$f":"SUM(C47:C52)","v":260},{"$f":"SUM(D47:D52)","v":208},{"$f":"SUM(E47:E52)","v":156},{"$f":"SUM(F47:F52)","v":104},{"$f":"SUM(B53:F53)","v":1040},{"$f":"SUM(H47:H52)","v":1}]
[]
["For 251-333 riders 8 places"]
["Placings","1D","2D","3D","4D","5D"]
["1st",{"$f":"$B$7*$H$57","v":74.88},{"$f":"$C$7*$H$57","v":62.4},{"$f":"$D$7*$H$57","v":49.92},{"$f":"$E$7*$H$57","v":37.44},{"$f":"$F$7*$H$57","v":24.96},"è",0.24]
["2nd",{"$f":"$B$7*$H$58","v":62.400000000000006},{"$f":"$C$7*$H$58","v":52},{"$f":"$D$7*$H$58","v":41.6},{"$f":"$E$7*$H$58","v":31.200000000000003},{"$f":"$F$7*$H$58","v":20.8},"è",0.2]
["3rd",{"$f":"$B$7*$H$59","v":53.040000000000006},{"$f":"$C$7*$H$59","v":44.2},{"$f":"$D$7*$H$59","v":35.36},{"$f":"$E$7*$H$59","v":26.520000000000003},{"$f":"$F$7*$H$59","v":17.68},"è",0.17]
["4th",{"$f":"$B$7*$H$60","v":40.56},{"$f":"$C$7*$H$60","v":33.800000000000004},{"$f":"$D$7*$H$60","v":27.04},{"$f":"$E$7*$H$60","v":20.28},{"$f":"$F$7*$H$60","v":13.52},"è",0.13]
["5th",{"$f":"$B$7*$H$61","v":31.200000000000003},{"$f":"$C$7*$H$61","v":26},{"$f":"$D$7*$H$61","v":20.8},{"$f":"$E$7*$H$61","v":15.600000000000001},{"$f":"$F$7*$H$61","v":10.4},"è",0.1]
["6th",{"$f":"$B$7*$H$62","v":21.840000000000003},{"$f":"$C$7*$H$62","v":18.200000000000003},{"$f":"$D$7*$H$62","v":14.560000000000002},{"$f":"$E$7*$H$62","v":10.920000000000002},{"$f":"$F$7*$H$62","v":7.2800000000000011},"è",7.0000000000000007E-2]
["7th",{"$f":"$B$7*$H$63","v":15.600000000000001},{"$f":"$C$7*$H$63","v":13},{"$f":"$D$7*$H$63","v":10.4},{"$f":"$E$7*$H$63","v":7.8000000000000007},{"$f":"$F$7*$H$63","v":5.2},"è",0.05]
["8th",{"$f":"$B$7*$H$64","v":12.48},{"$f":"$C$7*$H$64","v":10.4},{"$f":"$D$7*$H$64","v":8.32},{"$f":"$E$7*$H$64","v":6.24},{"$f":"$F$7*$H$64","v":4.16},"è",0.04]
["Totals",{"$f":"SUM(B57:B64)","v":312},{"$f":"SUM(C57:C64)","v":260},{"$f":"SUM(D57:D64)","v":208.00000000000003},{"$f":"SUM(E57:E64)","v":156},{"$f":"SUM(F57:F64)","v":104.00000000000001},{"$f":"SUM(B65:F65)","v":1040},{"$f":"SUM(H57:H64)","v":1}]
[]
["For 334-500 riders 10 places"]
["Placings","1D","2D","3D","4D","5D"]
["1st",{"$f":"$B$7*$H$69","v":65.52},{"$f":"$C$7*$H$69","v":54.6},{"$f":"$D$7*$H$69","v":43.68},{"$f":"$E$7*$H$69","v":32.76},{"$f":"$F$7*$H$69","v":21.84},"è",0.21]
["2nd",{"$f":"$B$7*$H$70","v":56.16},{"$f":"$C$7*$H$70","v":46.8},{"$f":"$D$7*$H$70","v":37.44},{"$f":"$E$7*$H$70","v":28.08},{"$f":"$F$7*$H$70","v":18.72},"è",0.18]
["3rd",{"$f":"$B$7*$H$71","v":46.8},{"$f":"$C$7*$H$71","v":39},{"$f":"$D$7*$H$71","v":31.2},{"$f":"$E$7*$H$71","v":23.4},{"$f":"$F$7*$H$71","v":15.6},"è",0.15]
["4th",{"$f":"$B$7*$H$72","v":37.44},{"$f":"$C$7*$H$72","v":31.2},{"$f":"$D$7*$H$72","v":24.96},{"$f":"$E$7*$H$72","v":18.72},{"$f":"$F$7*$H$72","v":12.48},"è",0.12]
["5th",{"$f":"$B$7*$H$73","v":28.08},{"$f":"$C$7*$H$73","v":23.4},{"$f":"$D$7*$H$73","v":18.72},{"$f":"$E$7*$H$73","v":14.04},{"$f":"$F$7*$H$73","v":9.36},"è",0.09]
["6th",{"$f":"$B$7*$H$74","v":21.840000000000003},{"$f":"$C$7*$H$74","v":18.200000000000003},{"$f":"$D$7*$H$74","v":14.560000000000002},{"$f":"$E$7*$H$74","v":10.920000000000002},{"$f":"$F$7*$H$74","v":7.2800000000000011},"è",7.0000000000000007E-2]
["7th",{"$f":"$B$7*$H$75","v":18.72},{"$f":"$C$7*$H$75","v":15.6},{"$f":"$D$7*$H$75","v":12.48},{"$f":"$E$7*$H$75","v":9.36},{"$f":"$F$7*$H$75","v":6.24},"è",0.06]
["8th",{"$f":"$B$7*$H$76","v":15.600000000000001},{"$f":"$C$7*$H$76","v":13},{"$f":"$D$7*$H$76","v":10.4},{"$f":"$E$7*$H$76","v":7.8000000000000007},{"$f":"$F$7*$H$76","v":5.2},"è",0.05]
["9th",{"$f":"$B$7*$H$77","v":12.48},{"$f":"$C$7*$H$77","v":10.4},{"$f":"$D$7*$H$77","v":8.32},{"$f":"$E$7*$H$77","v":6.24},{"$f":"$F$7*$H$77","v":4.16},"è",0.04]
["10th",{"$f":"$B$7*$H$78","v":9.36},{"$f":"$C$7*$H$78","v":7.8},{"$f":"$D$7*$H$78","v":6.24},{"$f":"$E$7*$H$78","v":4.68},{"$f":"$F$7*$H$78","v":3.12},"è",0.03]
["Totals",{"$f":"SUM(B69:B78)","v":312.00000000000006},{"$f":"SUM(C69:C78)","v":260},208,156.00000000000003,104,{"$f":"SUM(B79:F79)","v":1040},{"$f":"SUM(H69:H78)","v":1.0000000000000002}]
[]
["For 501-666 riders 12 places"]
["Placings","1D","2D","3D","4D","5D"]
["1st",{"$f":"$B$7*$H$83","v":59.28},{"$f":"$C$7*$H$83","v":49.4},{"$f":"$D$7*$H$83","v":39.520000000000003},{"$f":"$E$7*$H$83","v":29.64},{"$f":"$F$7*$H$83","v":19.760000000000002},"è",0.19]
["2nd",{"$f":"$B$7*$H$84","v":46.8},{"$f":"$C$7*$H$84","v":39},{"$f":"$D$7*$H$84","v":31.2},{"$f":"$E$7*$H$84","v":23.4},{"$f":"$F$7*$H$84","v":15.6},"è",0.15]
["3rd",{"$f":"$B$7*$H$85","v":37.44},{"$f":"$C$7*$H$85","v":31.2},{"$f":"$D$7*$H$85","v":24.96},{"$f":"$E$7*$H$85","v":18.72},{"$f":"$F$7*$H$85","v":12.48},"è",0.12]
["4th",{"$f":"$B$7*$H$86","v":31.200000000000003},{"$f":"$C$7*$H$86","v":26},{"$f":"$D$7*$H$86","v":20.8},{"$f":"$E$7*$H$86","v":15.600000000000001},{"$f":"$F$7*$H$86","v":10.4},"è",0.1]
["5th",{"$f":"$B$7*$H$87","v":28.08},{"$f":"$C$7*$H$87","v":23.4},{"$f":"$D$7*$H$87","v":18.72},{"$f":"$E$7*$H$87","v":14.04},{"$f":"$F$7*$H$87","v":9.36},"è",0.09]
["6th",{"$f":"$B$7*$H$88","v":24.96},{"$f":"$C$7*$H$88","v":20.8},{"$f":"$D$7*$H$88","v":16.64},{"$f":"$E$7*$H$88","v":12.48},{"$f":"$F$7*$H$88","v":8.32},"è",0.08]
["7th",{"$f":"$B$7*$H$89","v":21.840000000000003},{"$f":"$C$7*$H$89","v":18.200000000000003},{"$f":"$D$7*$H$89","v":14.560000000000002},{"$f":"$E$7*$H$89","v":10.920000000000002},{"$f":"$F$7*$H$89","v":7.2800000000000011},"è",7.0000000000000007E-2]
["8th",{"$f":"$B$7*$H$90","v":18.72},{"$f":"$C$7*$H$90","v":15.6},{"$f":"$D$7*$H$90","v":12.48},{"$f":"$E$7*$H$90","v":9.36},{"$f":"$F$7*$H$90","v":6.24},"è",0.06]
["9th",{"$f":"$B$7*$H$91","v":15.600000000000001},{"$f":"$C$7*$H$91","v":13},{"$f":"$D$7*$H$91","v":10.4},{"$f":"$E$7*$H$91","v":7.8000000000000007},{"$f":"$F$7*$H$91","v":5.2},"è",0.05]
["10th",{"$f":"$B$7*$H$92","v":12.48},{"$f":"$C$7*$H$92","v":10.4},{"$f":"$D$7*$H$92","v":8.32},{"$f":"$E$7*$H$92","v":6.24},{"$f":"$F$7*$H$92","v":4.16},"è",0.04]
["11th",{"$f":"$B$7*$H$93","v":9.36},{"$f":"$C$7*$H$93","v":7.8},{"$f":"$D$7*$H$93","v":6.24},{"$f":"$E$7*$H$93","v":4.68},{"$f":"$F$7*$H$93","v":3.12},"è",0.03]
["12th",{"$f":"$B$7*$H$94","v":6.24},{"$f":"$C$7*$H$94","v":5.2},{"$f":"$D$7*$H$94","v":4.16},{"$f":"$E$7*$H$94","v":3.12},{"$f":"$F$7*$H$94","v":2.08},"è",0.02]
["Totals",{"$f":"SUM(B83:B94)","v":312},{"$f":"SUM(C83:C94)","v":260.00000000000006},{"$f":"SUM(D83:D94)","v":207.99999999999997},{"$f":"SUM(E83:E94)","v":156},{"$f":"SUM(F83:F94)","v":103.99999999999999},{"$f":"SUM(B95:F95)","v":1040},{"$f":"SUM(H83:H94)","v":1}]
[]
["For 667-1000 riders 15 places"]
["Placings","1D","2D","3D","4D","5D"]
["1st",{"$f":"$B$7*$H$99","v":56.16},{"$f":"$C$7*$H$99","v":46.8},{"$f":"$D$7*$H$99","v":37.44},{"$f":"$E$7*$H$99","v":28.08},{"$f":"$F$7*$H$99","v":18.72},"è",0.18]
["2nd",{"$f":"$B$7*$H$100","v":46.8},{"$f":"$C$7*$H$100","v":39},{"$f":"$D$7*$H$100","v":31.2},{"$f":"$E$7*$H$100","v":23.4},{"$f":"$F$7*$H$100","v":15.6},"è",0.15]
["3rd",{"$f":"$B$7*$H$101","v":37.44},{"$f":"$C$7*$H$101","v":31.2},{"$f":"$D$7*$H$101","v":24.96},{"$f":"$E$7*$H$101","v":18.72},{"$f":"$F$7*$H$101","v":12.48},"è",0.12]
["4th",{"$f":"$B$7*$H$102","v":31.200000000000003},{"$f":"$C$7*$H$102","v":26},{"$f":"$D$7*$H$102","v":20.8},{"$f":"$E$7*$H$102","v":15.600000000000001},{"$f":"$F$7*$H$102","v":10.4},"è",0.1]
["5th",{"$f":"$B$7*$H$103","v":26.520000000000003},{"$f":"$C$7*$H$103","v":22.1},{"$f":"$D$7*$H$103","v":17.68},{"$f":"$E$7*$H$103","v":13.260000000000002},{"$f":"$F$7*$H$103","v":8.84},"è",8.5000000000000006E-2]
["6th",{"$f":"$B$7*$H$104","v":21.840000000000003},{"$f":"$C$7*$H$104","v":18.200000000000003},{"$f":"$D$7*$H$104","v":14.560000000000002},{"$f":"$E$7*$H$104","v":10.920000000000002},{"$f":"$F$7*$H$104","v":7.2800000000000011},"è",7.0000000000000007E-2]
["7th",{"$f":"$B$7*$H$105","v":18.72},{"$f":"$C$7*$H$105","v":15.6},{"$f":"$D$7*$H$105","v":12.48},{"$f":"$E$7*$H$105","v":9.36},{"$f":"$F$7*$H$105","v":6.24},"è",0.06]
["8th",{"$f":"$B$7*$H$106","v":15.600000000000001},{"$f":"$C$7*$H$106","v":13},{"$f":"$D$7*$H$106","v":10.4},{"$f":"$E$7*$H$106","v":7.8000000000000007},{"$f":"$F$7*$H$106","v":5.2},"è",0.05]
["9th",{"$f":"$B$7*$H$107","v":13.260000000000002},{"$f":"$C$7*$H$107","v":11.05},{"$f":"$D$7*$H$107","v":8.84},{"$f":"$E$7*$H$107","v":6.6300000000000008},{"$f":"$F$7*$H$107","v":4.42},"è",4.2500000000000003E-2]
["10th",{"$f":"$B$7*$H$108","v":10.920000000000002},{"$f":"$C$7*$H$108","v":9.1000000000000014},{"$f":"$D$7*$H$108","v":7.2800000000000011},{"$f":"$E$7*$H$108","v":5.4600000000000009},{"$f":"$F$7*$H$108","v":3.6400000000000006},"è",3.5000000000000003E-2]
["11th",{"$f":"$B$7*$H$109","v":9.36},{"$f":"$C$7*$H$109","v":7.8},{"$f":"$D$7*$H$109","v":6.24},{"$f":"$E$7*$H$109","v":4.68},{"$f":"$F$7*$H$109","v":3.12},"è",0.03]
["12th",{"$f":"$B$7*$H$110","v":7.8000000000000007},{"$f":"$C$7*$H$110","v":6.5},{"$f":"$D$7*$H$110","v":5.2},{"$f":"$E$7*$H$110","v":3.9000000000000004},{"$f":"$F$7*$H$110","v":2.6},"è",2.5000000000000001E-2]
["13th",{"$f":"$B$7*$H$111","v":6.24},{"$f":"$C$7*$H$111","v":5.2},{"$f":"$D$7*$H$111","v":4.16},{"$f":"$E$7*$H$111","v":3.12},{"$f":"$F$7*$H$111","v":2.08},"è",0.02]
["14th",{"$f":"$B$7*$H$112","v":5.4600000000000009},{"$f":"$C$7*$H$112","v":4.5500000000000007},{"$f":"$D$7*$H$112","v":3.6400000000000006},{"$f":"$E$7*$H$112","v":2.7300000000000004},{"$f":"$F$7*$H$112","v":1.8200000000000003},"è",1.7500000000000002E-2]
["15th",{"$f":"$B$7*$H$113","v":4.68},{"$f":"$C$7*$H$113","v":3.9},{"$f":"$D$7*$H$113","v":3.12},{"$f":"$E$7*$H$113","v":2.34},{"$f":"$F$7*$H$113","v":1.56},"è",1.4999999999999999E-2]
["Totals",{"$f":"SUM(B99:B113)","v":312},{"$f":"SUM(C99:C113)","v":260},{"$f":"SUM(D99:D113)","v":208},{"$f":"SUM(E99:E113)","v":156},{"$f":"SUM(F99:F113)","v":104},{"$f":"SUM(B114:F114)","v":1040},{"$f":"SUM(H99:H113)","v":1}]
[]
["For 1001-1500 riders 20 places"]
["Placings","1D","2D","3D","4D","5D"]
["1st",{"$f":"$B$7*$H$118","v":43.680000000000007},{"$f":"$C$7*$H$118","v":36.400000000000006},{"$f":"$D$7*$H$118","v":29.120000000000005},{"$f":"$E$7*$H$118","v":21.840000000000003},{"$f":"$F$7*$H$118","v":14.560000000000002},"è",0.14000000000000001]
["2nd",{"$f":"$B$7*$H$119","v":34.32},{"$f":"$C$7*$H$119","v":28.6},{"$f":"$D$7*$H$119","v":22.88},{"$f":"$E$7*$H$119","v":17.16},{"$f":"$F$7*$H$119","v":11.44},"è",0.11]
["3rd",{"$f":"$B$7*$H$120","v":28.08},{"$f":"$C$7*$H$120","v":23.4},{"$f":"$D$7*$H$120","v":18.72},{"$f":"$E$7*$H$120","v":14.04},{"$f":"$F$7*$H$120","v":9.36},"è",0.09]
["4th",{"$f":"$B$7*$H$121","v":24.024000000000001},{"$f":"$C$7*$H$121","v":20.02},{"$f":"$D$7*$H$121","v":16.015999999999998},{"$f":"$E$7*$H$121","v":12.012},{"$f":"$F$7*$H$121","v":8.0079999999999991},"è",7.6999999999999999E-2]
["5th",{"$f":"$B$7*$H$122","v":21.840000000000003},{"$f":"$C$7*$H$122","v":18.200000000000003},{"$f":"$D$7*$H$122","v":14.560000000000002},{"$f":"$E$7*$H$122","v":10.920000000000002},{"$f":"$F$7*$H$122","v":7.2800000000000011},"è",7.0000000000000007E-2]
["6th",{"$f":"$B$7*$H$123","v":20.28},{"$f":"$C$7*$H$123","v":16.900000000000002},{"$f":"$D$7*$H$123","v":13.52},{"$f":"$E$7*$H$123","v":10.14},{"$f":"$F$7*$H$123","v":6.76},"è",6.5000000000000002E-2]
["7th",{"$f":"$B$7*$H$124","v":18.72},{"$f":"$C$7*$H$124","v":15.6},{"$f":"$D$7*$H$124","v":12.48},{"$f":"$E$7*$H$124","v":9.36},{"$f":"$F$7*$H$124","v":6.24},"è",0.06]
["8th",{"$f":"$B$7*$H$125","v":17.16},{"$f":"$C$7*$H$125","v":14.3},{"$f":"$D$7*$H$125","v":11.44},{"$f":"$E$7*$H$125","v":8.58},{"$f":"$F$7*$H$125","v":5.72},"è",5.5E-2]
["9th",{"$f":"$B$7*$H$126","v":15.600000000000001},{"$f":"$C$7*$H$126","v":13},{"$f":"$D$7*$H$126","v":10.4},{"$f":"$E$7*$H$126","v":7.8000000000000007},{"$f":"$F$7*$H$126","v":5.2},"è",0.05]
["10th",{"$f":"$B$7*$H$127","v":14.04},{"$f":"$C$7*$H$127","v":11.7},{"$f":"$D$7*$H$127","v":9.36},{"$f":"$E$7*$H$127","v":7.02},{"$f":"$F$7*$H$127","v":4.68},"è",4.4999999999999998E-2]
["11th",{"$f":"$B$7*$H$128","v":12.48},{"$f":"$C$7*$H$128","v":10.4},{"$f":"$D$7*$H$128","v":8.32},{"$f":"$E$7*$H$128","v":6.24},{"$f":"$F$7*$H$128","v":4.16},"è",0.04]
["12th",{"$f":"$B$7*$H$129","v":11.543999999999999},{"$f":"$C$7*$H$129","v":9.6199999999999992},{"$f":"$D$7*$H$129","v":7.6959999999999997},{"$f":"$E$7*$H$129","v":5.7719999999999994},{"$f":"$F$7*$H$129","v":3.8479999999999999},"è",3.6999999999999998E-2]
["13th",{"$f":"$B$7*$H$130","v":10.296000000000001},{"$f":"$C$7*$H$130","v":8.58},{"$f":"$D$7*$H$130","v":6.8640000000000008},{"$f":"$E$7*$H$130","v":5.1480000000000006},{"$f":"$F$7*$H$130","v":3.4320000000000004},"è",3.3000000000000002E-2]
["14th",{"$f":"$B$7*$H$131","v":9.048},{"$f":"$C$7*$H$131","v":7.54},{"$f":"$D$7*$H$131","v":6.032},{"$f":"$E$7*$H$131","v":4.524},{"$f":"$F$7*$H$131","v":3.016},"è",2.9000000000000001E-2]
["15th",{"$f":"$B$7*$H$132","v":7.8000000000000007},{"$f":"$C$7*$H$132","v":6.5},{"$f":"$D$7*$H$132","v":5.2},{"$f":"$E$7*$H$132","v":3.9000000000000004},{"$f":"$F$7*$H$132","v":2.6},"è",2.5000000000000001E-2]
["16th",{"$f":"$B$7*$H$133","v":6.5520000000000005},{"$f":"$C$7*$H$133","v":5.46},{"$f":"$D$7*$H$133","v":4.3680000000000003},{"$f":"$E$7*$H$133","v":3.2760000000000002},{"$f":"$F$7*$H$133","v":2.1840000000000002},"è",2.1000000000000001E-2]
["17th",{"$f":"$B$7*$H$134","v":5.3040000000000003},{"$f":"$C$7*$H$134","v":4.42},{"$f":"$D$7*$H$134","v":3.5360000000000005},{"$f":"$E$7*$H$134","v":2.6520000000000001},{"$f":"$F$7*$H$134","v":1.7680000000000002},"è",1.7000000000000001E-2]
["18th",{"$f":"$B$7*$H$135","v":4.3680000000000003},{"$f":"$C$7*$H$135","v":3.64},{"$f":"$D$7*$H$135","v":2.9119999999999999},{"$f":"$E$7*$H$135","v":2.1840000000000002},{"$f":"$F$7*$H$135","v":1.456},"è",1.4E-2]
["19th",{"$f":"$B$7*$H$136","v":3.7440000000000002},{"$f":"$C$7*$H$136","v":3.12},{"$f":"$D$7*$H$136","v":2.496},{"$f":"$E$7*$H$136","v":1.8720000000000001},{"$f":"$F$7*$H$136","v":1.248},"è",1.2E-2]
["20th",{"$f":"$B$7*$H$137","v":3.12},{"$f":"$C$7*$H$137","v":2.6},{"$f":"$D$7*$H$137","v":2.08},{"$f":"$E$7*$H$137","v":1.56},{"$f":"$F$7*$H$137","v":1.04},"è",0.01]
["Totals",{"$f":"SUM(B118:B137)","v":312},{"$f":"SUM(C118:C137)","v":260},208,156,104,{"$f":"SUM(B138:F138)","v":1040},{"$f":"SUM(H118:H137)","v":1.0000000000000004}]
[]
["For 1501 or More riders 30 places"]
["Placings","1D","2D","3D","4D","5D"]
["1st",{"$f":"$B$7*$H142","v":37.44},{"$f":"$C$7*$H142","v":31.2},{"$f":"$D$7*$H142","v":24.96},{"$f":"$E$7*$H142","v":18.72},{"$f":"$F$7*$H142","v":12.48},"è",0.12]
["2nd",{"$f":"$B$7*$H143","v":29.64},24.7,19.760000000000002,14.82,9.8800000000000008,"è",9.5000000000000001E-2]
["3rd",{"$f":"$B$7*$H144","v":22.776},18.98,15.183999999999999,11.388,7.5919999999999996,"è",7.2999999999999995E-2]
["4th",{"$f":"$B$7*$H145","v":19.344000000000001},16.12,12.896000000000001,9.6720000000000006,6.4480000000000004,"è",6.2E-2]
["5th",15.600000000000001,13,10.4,7.8000000000000007,5.2,"è",0.05]
["6th",14.04,11.7,9.36,7.02,4.68,"è",4.4999999999999998E-2]
["7th",13.415999999999999,11.18,8.9439999999999991,6.7079999999999993,4.4719999999999995,"è",4.2999999999999997E-2]
["8th",12.48,10.4,8.32,6.24,4.16,"è",0.04]
["9th",11.543999999999999,9.6199999999999992,7.6959999999999997,5.7719999999999994,3.8479999999999999,"è",3.6999999999999998E-2]
["10th",10.920000000000002,9.1000000000000014,7.2800000000000011,5.4600000000000009,3.6400000000000006,"è",3.5000000000000003E-2]
["11th",10.296000000000001,8.58,6.8640000000000008,5.1480000000000006,3.4320000000000004,"è",3.3000000000000002E-2]
["12th",9.6720000000000006,8.06,6.4480000000000004,4.8360000000000003,3.2240000000000002,"è",3.1E-2]
["13th",9.048,7.54,6.032,4.524,3.016,"è",2.9000000000000001E-2]
["14th",8.4239999999999995,7.02,5.6159999999999997,4.2119999999999997,2.8079999999999998,"è",2.7E-2]
["15th",7.8000000000000007,6.5,5.2,3.9000000000000004,2.6,"è",2.5000000000000001E-2]
["16th",7.4880000000000004,6.24,4.992,3.7440000000000002,2.496,"è",2.4E-2]
["17th",7.1760000000000002,5.9799999999999995,4.7839999999999998,3.5880000000000001,2.3919999999999999,"è",2.3E-2]
["18th",6.8639999999999999,5.72,4.5759999999999996,3.4319999999999999,2.2879999999999998,"è",2.1999999999999999E-2]
["19th",6.5520000000000005,5.46,4.3680000000000003,3.2760000000000002,2.1840000000000002,"è",2.1000000000000001E-2]
["20th",6.24,5.2,4.16,3.12,2.08,"è",0.02]
["21st",5.9279999999999999,4.9399999999999995,3.952,2.964,1.976,"è",1.9E-2]
["22nd",5.6159999999999997,4.68,3.7439999999999998,2.8079999999999998,1.8719999999999999,"è",1.7999999999999999E-2]
["23rd",5.3040000000000003,4.42,3.5360000000000005,2.6520000000000001,1.7680000000000002,"è",1.7000000000000001E-2]
["24th",4.992,4.16,3.3280000000000003,2.496,1.6640000000000001,"è",1.6E-2]
["25th",4.68,3.9,3.12,2.34,1.56,"è",1.4999999999999999E-2]
["26th",4.3680000000000003,3.64,2.9119999999999999,2.1840000000000002,1.456,"è",1.4E-2]
["27th",4.056,3.38,2.7039999999999997,2.028,1.3519999999999999,"è",1.2999999999999999E-2]
["28th",3.7440000000000002,3.12,2.496,1.8720000000000001,1.248,"è",1.2E-2]
["29th",3.4319999999999999,2.86,2.2879999999999998,1.716,1.1439999999999999,"è",1.0999999999999999E-2]
["30th",3.12,2.6,2.08,1.56,1.04,"è",0.01]
["Totals",{"$f":"SUM(B142:B171)","v":312},{"$f":"SUM(C142:C171)","v":260},208.00000000000006,156,104.00000000000003,{"$f":"SUM(B172:F172)","v":1040},{"$f":"SUM(H142:H171)","v":1.0000000000000002}]

{"sheet":"DON'T TOUCH","index":14,"n_rows":6,"n_cols":5,"rows_kept":6,"cut":false,"hidden":true,"merged":[]}
[]
["Yes",null,"S",5,"X"]
[null,null,"A",10]
[null,null,"Y",15]
[null,null,"P","BP"]
[null,null,null,"SCR"]