{"text_format":"2","workbook":"xlsx","n_sheets":17,"sheets":["Open","Senior","Adult","Youth","Derby","Revolution","Highstakes","Futurity","12 & Under","8&under","Average","BFA 2D Payout","2D Payout","3D Payout","4D Payout BBR","5D Payout BBR","DON'T TOUCH"],"not_rendered":{"charts":0,"images":0,"macros":0,"external_links":0,"defined_names":7,"comments":0,"pivot_tables":0},"unopened":[],"bounds":{"document_bytes":16777216,"sheet_cells":100000,"run_cost":"one","rows_first":2000,"rows_last":500,"rows_between":2000,"halvings":0,"cell_chars":16384,"cell_head_chars":4096},"cells_cut":0,"cells_raw":0,"read":"whole","date_system":"1900"}

{"sheet":"Open","index":0,"n_rows":503,"n_cols":19,"rows_kept":503,"cut":false,"hidden":false,"merged":[[1,0,1,14],[0,0,0,14],[13,16,13,17],[15,16,15,17],[16,16,16,17],[2,16,2,17],[9,16,9,17],[10,16,10,17],[12,16,12,17]]}
[]
["Clark Real Estate Open"]
["Futurity","Der","HS","Age Inct.","Nom","Av","REV","Draw","Rider Name","Horse Name","Pen","Time","Final Time","Placing","Money Earned",null,"D Placing",null,"Split"]
[{"$nulls":7},284,"Sierra Shields","HighSPeedtaheaven",null,15.541,null,"1D 1st",1171.8,null,"1D"]
[{"$nulls":7},294,"Ashley Schafer","Jetts Letter Ta Abby",null,15.555,null,"1D 2nd",1004.4,null,"2D",null,0.5]
[{"$nulls":7},126,"Andrea Busby","Buckwyld",null,15.611000000000001,null,"1D 3rd",837,null,"3D",null,0.5]
[null,null,null,"A",null,null,null,123,"Cierra Chapman","Sun In Fun",null,15.632,null,"1D 4th",669.6,null,"4D",null,0.5]
[null,"X",{"$nulls":5},84,"Stephanie Fryar","The Red Maserati",null,15.667999999999999,null,"1D 5th",502.2,null,"5D",null,0.5]
[null,null,null,"S",null,null,null,418,"Carmel Wright","Fortunes Last Xtrem",null,15.686,{"$f":"IF(OR(K9=5,K9=10, K9=15, K9=\"BP\",K9=\"SCR\"),\"NT\",L9)","v":15.686},"1D 6th",390.6]
[{"$nulls":7},411,"Stevi Hillman","Truck",null,15.692,{"$f":"IF(OR(K10=5,K10=10, K10=15, K10=\"BP\",K10=\"SCR\"),\"NT\",L10)","v":15.692},"1D 7th",334.8,null,"# Entered"]
[null,"X","X",{"$nulls":4},351,"Wenda Johnson","Macgyver Moonflash",null,15.704000000000001,null,"1D 8th",279,null,415]
["X",{"$nulls":6},12,"Stephanie Fryar","RR LaJollas Roll",null,15.739000000000001,null,"1D 9th",223.20000000000002]
[{"$nulls":7},388,"Shaylee Hindman","Oscar",null,15.784000000000001,null,"1D 10th",167.4,null,"# Ran"]
["X",{"$nulls":5},"X",46,"Kassie Mowry","Famous Ladies Man",null,15.815,{"$nulls":4},415]
[null,null,"X","A",null,null,null,7,"Jolene Montgomery","Streakin Easily",null,15.818]
[{"$nulls":7},266,"Tandi Remy","Cool Ta Fame",null,15.83,{"$nulls":4},"# Left"]
[null,null,null,"S",null,null,null,21,"Sherri Barnes","Famous Little Jet",null,15.842000000000001,{"$nulls":4},{"$f":"$Q$11-$Q$14","v":0}]
["X",null,null,"A",null,null,null,32,"Kelly Allen","Moons Fire Ta Fame",null,15.843]
[null,"X","X","Y",null,null,"X",364,"Emily Becker","MR Elegant Shawne",null,15.849]
["X",null,null,"A",null,null,null,71,"Jolene Montgomery","Flits Khamacasse",null,15.86]
["X",{"$nulls":6},170,"Kassie Mowry","Dashing Canelo",null,15.87]
["X",{"$nulls":6},185,"Jessie Domann","Ima Perry N Famous",null,15.895]
[null,null,null,"Y",null,null,null,238,"Emma Smith","Double O Daryl",null,15.9]
[null,"X",null,"Y",null,null,null,355,"Shannon Jensen","Frenchmans Dashnista",null,15.932]
["X",{"$nulls":5},"X",108,"Kassie Mowry","CP He Will Be Epic",null,15.938000000000001]
["X",{"$nulls":5},"X",72,"Kassie Mowry","Epic Guy",null,15.942]
["X",{"$nulls":6},173,"Kelsey Lutjen","KN Luna",null,15.958]
["X",null,"X","A",null,null,null,103,"Jolene Montgomery","Firin Ta Heaven",null,15.959]
[{"$nulls":7},200,"Brian Ramirez","Holly",null,15.965999999999999]
[{"$nulls":7},373,"Phillip Kenyon","Tillies Hayday",null,15.981]
[null,null,null,"S",null,null,null,69,"Sherri Barnes","Racing For Perks",null,15.989000000000001]
[null,null,null,"A",null,null,null,271,"Cassidy Kruse","Guys Six Pack",null,15.99]
[{"$nulls":7},188,"Andrea Busby","Taylor",null,15.991]
[null,null,null,"S",null,null,null,49,"Jaque Woolman","Another Bug",null,16]
[null,null,null,"S",null,null,"X",299,"Lisa Wernli","Flashs Fine Effort",null,16.004999999999999]
[{"$nulls":7},60,"Kim Ferguson","Three Smashed Bugs",null,16.023]
[null,null,null,"Y",null,null,"X",342,"Riley Cook",null,null,16.030999999999999]
[null,null,null,"A",null,null,null,156,"Kaylee Gallino","W Q Bar Socks",null,16.036000000000001]
[{"$nulls":7},155,"Andrea Busby","Newly",null,16.036999999999999]
[{"$nulls":7},58,"Lisa Flores","Make Me Macho",null,16.039000000000001]
[{"$nulls":7},142,"Nicole RIggle","Famous Desire",null,16.062000000000001,null,"2D 1st",976.5]
[null,null,null,"A",null,null,null,119,"Kaylee Gallino","JC Baldy Frost",null,16.065999999999999,null,"2D 2nd",837]
["X",{"$nulls":6},372,"Lacey Harmon","Mitey Man",null,16.077999999999999,null,"2D 3rd",697.5]
["X",{"$nulls":6},104,"Kelsey Lutjen","TS Dash Dang It",null,16.081,null,"2D 4th",558]
[null,null,null,"S",null,null,"X",153,"Teresa McClendon","Striking Poses",null,16.106000000000002,null,"2D 5th",418.5]
[{"$nulls":7},384,"Paige Wiseman","Eye Rule",null,16.116,null,"2D 6th",325.50000000000006]
["X",{"$nulls":6},390,"James Barnes","Flamin Flicka",null,16.132000000000001,null,"2D 7th",279]
[null,null,null,"Y",null,null,null,262,"Kalli McCall","Dr Nicks Cash",null,16.140999999999998,null,"2D 8th",232.5]
[{"$nulls":6},"X",241,"Chancie Rogers","One Third Sugar",null,16.141999999999999,null,"2D 9th",186]
["X",{"$nulls":6},139,"Andrea Cline","Cruz N Ta Fame",null,16.146999999999998,null,"2D 10th",139.5]
[{"$nulls":7},221,"Hanna Forbes","Eye Jess Zoomed Bye",null,16.152000000000001]
[null,null,null,"A",null,null,null,280,"Brandy Vogue","Dmac Hypnotize",null,16.155999999999999]
[{"$nulls":7},339,"Nicki Zimmerman","Prime Gold",null,16.164000000000001]
["X",{"$nulls":6},349,"Kim Squires","Ima Diva Red Dasher",null,16.172000000000001]
["X",{"$nulls":6},141,"Kassie Mowry","Back The Blue",null,16.172999999999998]
[{"$nulls":7},252,"Wendy Suhn","HLH Streakin A Fling",null,16.172999999999998]
[null,null,null,"A",null,null,null,322,"Denny Ralls","Whiskey",null,16.177]
["X",{"$nulls":6},421,"James Barnes","Slicks Sweet Legacy",null,16.184000000000001,{"$f":"IF(OR(K58=5,K58=10, K58=15, K58=\"BP\",K58=\"SCR\"),\"NT\",L58)","v":16.184000000000001}]
[null,null,null,"S",null,null,null,194,"Mary Carter","Bullys Tiger Eye",null,16.190999999999999]
[null,"X",{"$nulls":5},111,"Joy Wargo","Run Leo Run",null,16.193999999999999]
[{"$nulls":7},279,"Laynee Massey","Chula",null,16.196000000000002]
[null,null,null,"Y",null,null,"X",145,"Haley Hunt","Hoops",null,16.202000000000002]
["X",{"$nulls":6},256,"Rachel Arms","RY Wyatt Earl",null,16.204999999999998]
[{"$nulls":7},239,"Sarah Rau","Shes SO Fuel",null,16.204999999999998]
[{"$nulls":7},115,"Chelsea Young","Bogies French Hen",null,16.216000000000001]
[{"$nulls":7},161,"Hannah Sharon","JL Redwood",null,16.216999999999999]
[{"$nulls":7},308,"Sadie Weldon","Boots Classy Perks",null,16.22]
[null,null,null,"Y",null,null,null,117,"Rhese Brough","Wildcard Money",null,16.221]
[{"$nulls":6},"X",244,"Jamie Wilson","Check Your Bet",null,16.221]
[{"$nulls":7},303,"Phillip Kenyon","Contagious Charm",null,16.224]
[{"$nulls":7},203,"Lindsey Hoffman","First Down Deception",null,16.225000000000001]
["X",null,null,"A",null,null,null,30,"Pete Oen","HGF Flinging Frosted",null,16.227]
[{"$nulls":7},354,"Savannah Mantooth","Feature Me French",null,16.238]
["X",{"$nulls":6},402,"Jade Crago","CM Sierras Fire Frost",null,16.239000000000001,{"$f":"IF(OR(K74=5,K74=10, K74=15, K74=\"BP\",K74=\"SCR\"),\"NT\",L74)","v":16.239000000000001}]
[null,null,null,"Y",null,null,null,135,"Faith Ross","Cash",null,16.245000000000001]
[{"$nulls":7},94,"Casey Hammons","BH Trip Ta Fame",null,16.247]
[{"$nulls":7},52,"Lea Baze","A Guy With Try",null,16.263999999999999]
[{"$nulls":7},251,"Shelby Shackelford","RTF A Natural Stoli",null,16.28]
[{"$nulls":7},105,"Andrea Cline","C3 Illegitimate Fame",null,16.282]
[null,null,null,"Y",null,null,"X",345,"Josie Hartmann","TR Illumniater Cash",null,16.289000000000001]
["X",null,null,"S",null,null,null,387,"Carmel Wright","PG Eye Bully Fame",null,16.298999999999999]
[{"$nulls":7},157,"Sophie Nolen","Guys Special Show",null,16.298999999999999]
[null,null,null,"S",null,null,null,92,"Martha Smith","Firewatermakemehappy",null,16.3]
["X",{"$nulls":6},386,"Ryan Reynolds","Kick of Fame",null,16.306000000000001]
[{"$nulls":7},259,"Shaylee Self","Frio",null,16.318000000000001]
[{"$nulls":7},100,"Kacey Kirby","VVR Corona Dash",null,16.32]
["X",{"$nulls":6},243,"Brooke Kelley","Nu Bueno Karma",null,16.327000000000002]
[{"$nulls":7},295,"Wendy Suhn","She B Astreakin",null,16.329999999999998]
["X",{"$nulls":6},70,"Danyelle Campbell","Primrose Fame",null,16.332000000000001]
[{"$nulls":7},254,"Shannon Pearson","Reds Roany Pony",null,16.335000000000001]
["X",{"$nulls":6},78,"Kelsey Lutjen","Blazin X's N Oh's",null,16.337]
[{"$nulls":7},395,"Kristen Hendewerk","Sevens",null,16.338000000000001]
[{"$nulls":7},297,"Jolene Jones","Streakin Louie",null,16.338999999999999]
["X",null,null,"A",null,null,null,172,"Jolene Montgomery","Famously Perkin",null,16.34]
[{"$nulls":7},168,"Jo Kirby","Heavenly Joak",null,16.341000000000001]
[{"$nulls":7},177,"Ashley Schafer","Bailys Streakinchick",null,16.344000000000001]
[{"$nulls":7},337,"Madison Reich","Pie",null,16.356999999999999]
[{"$nulls":7},310,"Kelly Bruner","Tempting Teaser",null,16.363]
["X",null,null,"S",null,null,null,3,"Jaque Woolman","Bugs A Boo",null,16.369]
[{"$nulls":7},323,"Sadie Holloway","Sheeza Witty Lynx",null,16.378]
[{"$nulls":7},328,"Davie King","Jessie",null,16.378]
[{"$nulls":7},242,"Lylan Cory",null,null,16.399000000000001]
[{"$nulls":7},363,"Emma Wildeisen","It Is What It Is Guys",null,16.402999999999999]
[null,null,null,"A",null,null,null,107,"Pete Oen","Corona Four Fiesta",null,16.405999999999999]
["X",{"$nulls":6},128,"Kelsey Lutjen","TS Queens Shakem",null,16.408000000000001]
["X",{"$nulls":6},208,"Nicole RIggle","Moonshinesgotmefiren",null,16.408000000000001]
[{"$nulls":7},112,"Billie Ann Harmon","Fire and Shake",null,16.41]
[null,null,null,"S",null,null,null,130,"Debbie Rabb","VF Famous Fooster",null,16.411000000000001]
["X",{"$nulls":6},101,"Danyelle Campbell","CP Winnie",null,16.416]
[null,null,null,"A",null,null,null,274,"Kathy Vazquez","Sail On Ta Fame",null,16.420999999999999]
[{"$nulls":7},389,"Misty Peek","Amos",null,16.420999999999999]
[{"$nulls":7},214,"Megan Boone","USS Bu Mercedes",null,16.43]
[{"$nulls":7},45,"Lacy Billingsley","VF High N Famous",null,16.439]
[{"$nulls":7},396,"Kristi Tuinei","Zippys Cash Ta Fame",null,16.442]
["X",{"$nulls":6},144,"Joy Wargo","Dash Ta Mirage",null,16.446999999999999]
["x",{"$nulls":6},159,"Ryann Pedone","Dash Ta Perfection",null,16.448]
[null,null,null,"Y",null,null,null,300,"Kalli McCall","Showdown San Man",null,16.466999999999999]
[{"$nulls":7},23,"Molli Montgomery","Kindafeelinheavenly",null,16.472000000000001]
["X",{"$nulls":6},309,"Cassidy Kruse","Lost Creek Widow",null,16.481000000000002]
["X",{"$nulls":6},51,"Kari Brough","Hot French Lady",null,16.481999999999999]
[null,null,null,"A",null,null,null,228,"Pete Oen","Deans Terror",null,16.484000000000002]
["X",{"$nulls":6},391,"Wyatt Paul","Paparazzi Love Me",null,16.484000000000002]
[null,null,null,"S",null,null,"X",245,"Terry Vogel","BB Boogyingfrenchman",null,16.492999999999999]
[null,"X",null,"A",null,null,null,131,"Cassidy Rabb","VF Temptations",null,16.506]
[{"$nulls":7},67,"Nisa Berry","Oscar",null,16.521999999999998]
[{"$nulls":7},110,"Nicole Riggle","Desire To Be Famous",null,16.533000000000001]
["X",{"$nulls":6},127,"Tasha Welch","Victorious Firewater",null,16.542999999999999,null,"3D 1st",781.19999999999993]
[{"$nulls":7},47,"Sally Preston","Cee U Later Gator",null,16.544,null,"3D 2nd",669.6]
[null,null,null,"Y",null,null,null,270,"Emma Smith","Pocket Fulla Pozzi",null,16.545000000000002,null,"3D 3rd",558]
[null,null,null,"A",null,null,null,88,"Kendall Jordan","Guns On Fire",null,16.553000000000001,null,"3D 4th/5th",391]
[{"$nulls":7},257,"Ryann Pedone","Frosty",null,16.553000000000001,null,"3D 4th/5th",391]
[{"$nulls":7},314,"Kim Otwell","BootcJustalena",null,16.555,null,"3D 6th",260.40000000000003]
[{"$nulls":7},98,"Shelby Scott","Perty Biankus Chrome",null,16.556000000000001,null,"3D 7th",223.2]
[null,null,null,"Y",null,null,"X",376,"Josie Hartmann","Hes Honor",null,16.559999999999999,null,"3D 8th",186]
[{"$nulls":7},403,"Mindy Holloway","H1",null,16.562000000000001,{"$f":"IF(OR(K135=5,K135=10, K135=15, K135=\"BP\",K135=\"SCR\"),\"NT\",L135)","v":16.562000000000001},"3D 9th",148.80000000000001]
[{"$nulls":7},383,"Danielle Wright","Passngosmoothly",null,16.562999999999999,null,"3D 10th",111.6]
[null,null,null,"Y",null,null,"X",273,"Stormi Branch","Demon",null,16.565000000000001]
[{"$nulls":7},346,"Phillip Kenyon","SV Sun Kinda Wonder",null,16.565000000000001]
[null,null,null,"A",null,null,null,180,"Gayle Jones","Credit Me For Hollan",null,16.567]
[null,null,null,"Y",null,null,null,335,"Alex Stokes","Mo Sugar Bars Bee",null,16.582000000000001]
[{"$nulls":7},106,"Sharin Hall","Lillyliveninthesun",null,16.584]
["X",{"$nulls":6},218,"Jessie Domann","IRoseSuchAStinson",null,16.588000000000001]
["X",null,null,"A",null,null,"X",36,"Debbie Bloxom","Bad Firing Rising",null,16.597000000000001]
["X",null,null,"A",null,null,null,166,"Pete Oen","FC Black Firewater",null,16.617000000000001]
[null,null,null,"A",null,null,null,182,"Kelsey Howard","Midnight DJ",null,16.62]
[{"$nulls":7},422,"Blake Myers","Swampy",null,16.626000000000001,{"$f":"IF(OR(K146=5,K146=10, K146=15, K146=\"BP\",K146=\"SCR\"),\"NT\",L146)","v":16.626000000000001}]
[{"$nulls":7},20,"Andrea Sewell","Frenchmans Bellarose",null,16.641999999999999]
["X",{"$nulls":6},102,"Andrea Sewell","Uptown Fame",null,16.649999999999999]
[{"$nulls":7},423,"Makala Pierce","Hasta",null,16.652999999999999,{"$f":"IF(OR(K149=5,K149=10, K149=15, K149=\"BP\",K149=\"SCR\"),\"NT\",L149)","v":16.652999999999999}]
["X",{"$nulls":6},204,"Madison Merrill","RS Forever Famous",null,16.657]
[null,null,null,"S",null,null,null,292,"Lynn Saunders","Chumly",null,16.667999999999999]
[{"$nulls":7},312,"Tasha Welch","Rummy",null,16.669]
[null,null,null,"A",null,null,null,400,"Jess Lewis","Francy Streak",null,16.678000000000001,{"$f":"IF(OR(K153=5,K153=10, K153=15, K153=\"BP\",K153=\"SCR\"),\"NT\",L153)","v":16.678000000000001}]
[{"$nulls":7},232,"Ashley Schafer","One Blazin Fire",null,16.678000000000001]
[{"$nulls":7},44,"Amber Green","Twister",null,16.686]
[{"$nulls":7},186,"Fallon Forbes","Latte To Go",null,16.695]
[{"$nulls":7},196,"McKinley Goodger","Fame Us First Lady",null,16.695]
[{"$nulls":7},152,"Kelsey Lutjen","MS Tres Perks",null,16.71]
[null,"X","X",{"$nulls":4},329,"Haley Bowen","Sadies Superman",null,16.710999999999999]
[{"$nulls":7},223,"Meredith Minoletti","Maseratis Fourtune",null,16.713000000000001]
[{"$nulls":6},"X",344,"Kyann Hartmann","SS Dreamin of Roses",null,16.713000000000001]
[{"$nulls":7},192,"Chelsea Young","Tressy Oaks",null,16.728999999999999]
[{"$nulls":7},205,"Ashley Schafer","Fling Ta Famous",null,16.731999999999999]
[null,null,null,"A",null,null,"X",10,"Jennifer Abbott","Wendall Jackson",null,16.734999999999999]
[null,null,null,"Y",null,null,null,378,"Alex Stokes","View This Lady Rose",null,16.736999999999998]
["X",{"$nulls":6},191,"Ryann Pedone","Sudden Hero",null,16.739999999999998]
[{"$nulls":7},42,"Jennifer Fite","Firewater Edition",null,16.739999999999998]
[{"$nulls":7},366,"Shelly Lilley-O","Winston",null,16.748999999999999]
["X",{"$nulls":6},62,"Lauren Whitmire","Down Dash Anytime",null,16.753]
[{"$nulls":7},229,"Jessica Sitzes","Miss Mighty Invictus",null,16.753]
[{"$nulls":7},4,"Nicole Meadows","Calibshippityhop",null,16.760000000000002]
[{"$nulls":7},124,"Ashley Schafer","La Jollas Isastreaker",null,16.768999999999998]
[null,null,null,"S",null,null,null,227,"Connie Randolph","Hot Rod Kitty Cat",null,16.777999999999999]
["X",{"$nulls":6},38,"Danyelle Campbell","Dirrty Money",null,16.78]
["X",{"$nulls":6},14,"Kari Brough","Frenchmantwistedfame",null,16.783999999999999]
[{"$nulls":7},22,"Karen Shelley","Flying Bar Bailey",null,16.791]
[null,null,null,"A",null,null,null,146,"Kelsey Howard","Triple Gold Time",null,16.8]
["X",{"$nulls":6},56,"SheaLynn Leach","Peter Wabbit",null,16.808]
[{"$nulls":7},99,"Hannah Hertel","Egos Moving Effort",null,16.809999999999999]
[null,"X",null,"A",null,null,null,169,"Cassidy Rabb","VF Coup Fulla Coins",null,16.811]
[{"$nulls":7},48,"Andrea Cline","Famous LaJolla",null,16.812000000000001]
[{"$nulls":7},86,"Cadee Williams","Munchkin",null,16.818999999999999]
[{"$nulls":7},11,"Lea Baze","Sheza Smooth Dash",null,16.824999999999999]
[{"$nulls":7},375,"Stevie Ann Wilhelm","Picosita Shake",null,16.831]
[{"$nulls":7},39,"Rachel Primm","Foolish In My Socks",null,16.832999999999998]
[{"$nulls":7},28,"Kim Ferguson","Dudes Spectacular Bag",null,16.835000000000001]
[{"$nulls":7},96,"SheaLynn Leach","NMD ChestersLilBunny",null,16.835000000000001]
["X",null,null,"A",null,null,null,143,"Pete Oen","Fyre In The Skye",null,16.837]
[null,null,null,"A",null,null,null,209,"Mandy Holloway","First Touch of Fire",null,16.838000000000001]
[{"$nulls":7},162,"Hailey Loose","Shiners Blue Frost",null,16.841999999999999]
[null,null,null,"Y",null,null,null,417,"Shannon Jensen","Frenchmans Lajolla",null,16.850000000000001,{"$f":"IF(OR(K191=5,K191=10, K191=15, K191=\"BP\",K191=\"SCR\"),\"NT\",L191)","v":16.850000000000001}]
[null,null,null,"A",null,null,null,278,"Alisha Todd","Sheza Amarillo Doc",null,16.853000000000002]
[null,null,null,"A",null,null,null,233,"Kylena Hager","Bar B Firewater Steel",null,16.867000000000001]
[null,null,null,"A",null,null,null,359,"Tammy Hickey","Josey",null,16.873000000000001]
[{"$nulls":7},6,"Lacy Billingsley","Dirty Dizco Diane 37",null,16.884]
[{"$nulls":7},247,"Tami Claflin","Thursday Cash A Chex",null,16.911000000000001]
[{"$nulls":7},290,"Sam Boone","Dan",null,16.919]
[null,"X",{"$nulls":5},224,"Ashley Martinkus","Jane",null,16.920999999999999]
[null,null,null,"Y",null,null,"X",356,"Bradie Bacon","Millie",null,16.925000000000001]
["X",{"$nulls":6},93,"Ashley Schafer","Streakin Cisco",null,16.925000000000001]
[{"$nulls":7},332,"Gretchen Goedeken","Fine Whatever",null,16.934999999999999]
[null,null,null,"A",null,null,"X",362,"Nicole Buell","Dirty Money",null,16.937999999999999]
[{"$nulls":7},231,"Jenae Smith","Pint Sized Pepper",null,16.937999999999999]
[{"$nulls":6},"X",321,"Pattie Mackie","Flitter Fuel Lad",null,16.937999999999999]
[null,null,null,"A",null,null,"X",202,"Shantell Hayes","Pixie",null,16.952000000000002]
[null,null,null,"S",null,null,null,165,"Simone Elmore","Badger A Conchadrift",null,16.954000000000001]
[{"$nulls":7},138,"Sharin Hall","Famous Last Edition",null,16.963000000000001]
[{"$nulls":7},215,"Fallon Forbes","Don’t Care Who UR",null,16.969000000000001]
[{"$nulls":7},385,"Emilie Veillette","Genuine Catt",null,16.986999999999998]
["X",null,null,"A",null,null,null,76,"Tristan Mounts","Blazed Gunsmoke",null,16.998999999999999]
[{"$nulls":7},26,"Kelsey Lutjen","DDD Fiesta Fling",null,17.001999999999999]
[{"$nulls":7},77,"Andrea Cline","Louisiana Shakedown",null,17.013000000000002]
[{"$nulls":7},35,"Sherrel Burgess","Boomer T Fellers",null,17.015999999999998]
[{"$nulls":7},181,"Stacy Whitener","A Drift Of Roan",null,17.038]
[{"$nulls":7},97,"Marie Anderson","Miss Cross Reiner",null,17.045999999999999,null,"4D 1st",585.9]
[{"$nulls":7},318,"Missy Piper","Cee Cee Uno",null,17.050999999999998,null,"4D 2nd",502.2]
[null,null,null,"S",null,null,"X",261,"Curtis Watson","Peppy Fire Frost",null,17.053999999999998,null,"4D 3rd",418.5]
[{"$nulls":7},283,"Katie Perkins","Heartbreak",null,17.056999999999999,null,"4D 4th/5th",293]
[{"$nulls":7},353,"Rachel Chambers","Indy",null,17.056999999999999,null,"4D 4th/5th",293]
[null,null,null,"S",null,null,"X",267,"Lisa Wernli","PROUDTOBEFRENCH",null,17.074000000000002,null,"4D 6th",195.3]
[null,null,null,"S",null,null,"X",216,"Tracy Henderson","Heza Stray Cat",null,17.076000000000001,null,"4D 7/8/9th",139.5]
[null,null,null,"Y",null,null,null,282,"Corlee Massey","Easy",null,17.076000000000001,null,"4D 7/8/9th",140]
[{"$nulls":7},74,"Bianca Dos Santos","Taladega",null,17.076000000000001,null,"4D 7/8/9th",140]
[{"$nulls":7},235,"Lisa Jo Velliquette","Namgis D 44",null,17.077000000000002,null,"4D 10th",83.7]
[{"$nulls":7},341,"Mary Alison Hoekenga","Vintage Cajun",null,17.077999999999999]
[null,null,null,"Y",null,null,"X",246,"Bella Skinner","Shorty",null,17.081]
[{"$nulls":6},"X",80,"Marlyn Bland","CD Quick Key Dash",null,17.081]
["X",{"$nulls":6},148,"Billie Ann Harmon","Patroits Firewater",null,17.087]
[null,null,null,"S",null,null,null,397,"Terry Quintana","Jerry",null,17.091000000000001,{"$f":"IF(OR(K229=5,K229=10, K229=15, K229=\"BP\",K229=\"SCR\"),\"NT\",L229)","v":17.091000000000001}]
[{"$nulls":7},371,"Nicki Zimmerman","Dashing French Fry",null,17.093]
[{"$nulls":7},263,"Ashley Schafer","Guys Famous Bombshell",null,17.097000000000001]
[{"$nulls":6},"X",207,"Carey Benton","Prime Thriftshop",null,17.11]
[null,null,null,"A",null,null,null,291,"Tiffany Durham","Hippie",null,17.132000000000001]
[{"$nulls":7},392,"Tara Hill","Cat",null,17.149000000000001]
[{"$nulls":7},164,"Lacy Matthews","Shilohs Perky Pistol",null,17.161999999999999]
[{"$nulls":6},"X",41,"Myndi Muncy","Streakin Sox",null,17.170000000000002]
[null,null,null,"A",null,null,null,336,"Melissa Jones","Threes Royal Derby",null,17.195]
["X",{"$nulls":6},178,"Joy Wargo","WR Calamity Fame",null,17.195]
[{"$nulls":7},369,"Missy Piper","EMW Cruisen Nick",null,17.199000000000002]
[null,null,null,"A",null,null,null,116,"Gayle Jones","CASh N Bubbles",null,17.204000000000001]
[null,null,null,"A",null,null,"X",31,"Tiffany Cox","C3Lacy",null,17.213999999999999]
[{"$nulls":7},199,"Bill Barber","Cruzn On A Jet",null,17.239999999999998]
["X",null,null,"S",null,null,null,250,"Glenda Barnett","Miss Famous Beduino",null,17.241]
[null,null,null,"A",null,null,null,237,"Lynn Whisenant","Hezawonderstreakin",null,17.242000000000001]
[{"$nulls":7},377,"Dacota Monk","Lil Guy",null,17.247]
[{"$nulls":7},313,"Courtney Fuchs","Uh Huh Im Streakin",null,17.25]
[{"$nulls":7},210,"Joy Wargo","WR Famous Maverick",null,17.254999999999999]
[null,null,null,"Y",null,null,null,82,"Jolie Smith","Docs Lil Leo",null,17.256]
[{"$nulls":7},136,"Leann Younger","Bubba Tucker",null,17.260000000000002]
[{"$nulls":7},240,"Emily Necaise","Trump",null,17.27]
[{"$nulls":7},149,"Sandy Rogers","Doc Leo Freckles Jet",null,17.277000000000001]
[{"$nulls":7},179,"Lacy Matthews","Shez Jettn Speed",null,17.292999999999999]
[null,"X",{"$nulls":5},183,"Ashley Martinkus","Famous First Flight",null,17.295999999999999]
[{"$nulls":7},211,"Billie Ann Harmon","Mitey Confederate I",null,17.297999999999998]
[null,null,null,"A",null,null,"X",213,"Aryn Wilkerson","SpicyLitttleStar",null,17.321000000000002]
[null,null,null,"A",null,null,null,57,"Jennifer Abbott","Blazin Wagon",null,17.324000000000002]
[{"$nulls":7},358,"Jolene Jones","Willy",null,17.367999999999999]
["X",{"$nulls":6},16,"Andrea Cline","Superflysraretreasure",null,17.373000000000001]
[null,null,null,"A",null,null,null,121,"Reagan Jackson","Power TO The Moon",null,17.379000000000001]
[{"$nulls":7},276,"Stephanie Snazuk","SR Ima Royal Streaker",null,17.38]
[{"$nulls":7},217,"LJ LaRue","Quick",null,17.395]
[{"$nulls":7},264,"Holly Pritchard","Bogies French Moon",null,17.417999999999999]
[{"$nulls":7},401,"Jana Himes","Confederate Darling",null,17.428000000000001,{"$f":"IF(OR(K263=5,K263=10, K263=15, K263=\"BP\",K263=\"SCR\"),\"NT\",L263)","v":17.428000000000001}]
[null,"X",{"$nulls":5},189,"Hanna Forbes","Ivory Candy",null,17.443000000000001]
[null,null,null,"A",null,null,null,122,"Chelsie Petty","Jade",null,17.452000000000002,17.452000000000002]
[null,null,null,"S",null,null,"X",298,"Terry Vogel","Imablueyedblondbitz",null,17.463999999999999]
[{"$nulls":7},50,"Kasey Barnes","BB Booging Frenchman",null,17.495999999999999]
[{"$nulls":7},129,"LJ LaRue","Paid By The Second",null,17.515000000000001]
[{"$nulls":7},352,"Kim Otwell","SBJ Starry Queen",null,17.527999999999999]
[{"$nulls":7},316,"Lori Buschbacher","Smokin Guns N Roses",null,17.536999999999999]
[{"$nulls":7},90,"Kari Brough","Just Lion Lil",null,17.54]
[{"$nulls":7},420,"Wyatt Paul","Jim Craig",null,17.565000000000001,{"$f":"IF(OR(K272=5,K272=10, K272=15, K272=\"BP\",K272=\"SCR\"),\"NT\",L272)","v":17.565000000000001},"5D 1st",390.59999999999997]
["X",null,null,"A",null,null,null,18,"Charlotte Edwards","VF Eye Of Tiger",null,17.565999999999999,null,"5D 2nd",334.8]
["X",null,null,"A",null,null,null,61,"Charlotte Edwards","TR Hibbie Chick",null,17.576000000000001,null,"5D 3rd",279]
["X",null,null,"A",null,null,null,63,"Kelly Allen","Miss JB 149",null,17.594000000000001,null,"5D 4th",223.2]
[null,null,null,"A",null,null,null,212,"Dominique Henderson","Me Loves A Crowd",null,17.613,null,"5D 5th",167.4]
[null,null,null,"S",null,null,null,15,"Martha Smith","My Epic Moment",null,17.626000000000001,null,"5D 6th",130.20000000000002]
[{"$nulls":7},275,"Lisa Beveridge","Aces Smoke",null,17.631,null,"5D 7th",111.6]
[null,null,null,"S",null,null,null,296,"Kevin Davis ","Gibbs",null,17.651,null,"5D 8th",93]
[{"$nulls":7},134,"Karen Heward","Runnin Booger",null,17.652999999999999,null,"5D 9th",74.400000000000006]
[null,null,null,"Y",null,null,null,333,"Kalli McCall","All That Blizz",null,17.658000000000001,null,"5D 10th",55.8]
[{"$nulls":6},"X",114,"Alley Harris","Princess",null,17.681999999999999]
[{"$nulls":7},317,"Emma Wildeisen","Shes Guy Crazy",null,17.706]
["X",null,null,"A",null,null,"X",167,"Sharin Hall","Fast Dashin Chick",null,17.725999999999999]
[null,null,null,"A",null,null,null,2,"Kelli Ann McPherson","Bar B Arabella Bug",null,17.744]
[{"$nulls":7},79,"Judi Veeder","GL Tuff",null,17.783999999999999]
[{"$nulls":7},320,"Alicia Jones","Sass N Savvy",null,17.815000000000001]
[{"$nulls":7},184,"Lisa Ogden","Trez Coronas",null,17.829000000000001]
[{"$nulls":7},379,"Mary Alison Hoekenga","The Light In Daddys Eyes",null,17.841999999999999]
["X",{"$nulls":6},399,"Lacey Harmon","Guys Silver and Gold",null,17.846,{"$f":"IF(OR(K290=5,K290=10, K290=15, K290=\"BP\",K290=\"SCR\"),\"NT\",L290)","v":17.846}]
[{"$nulls":6},"X",360,"Becky Dockery","Faithman",null,17.873000000000001]
[null,null,null,"A",null,null,null,8,"Tiffany Durham","Luke",null,17.925999999999998]
[{"$nulls":7},405,"Jessica Patanella","Charlotte",null,17.928999999999998,{"$f":"IF(OR(K293=5,K293=10, K293=15, K293=\"BP\",K293=\"SCR\"),\"NT\",L293)","v":17.928999999999998}]
[{"$nulls":7},343,"Tasha Welch","Power stroke",null,18.001999999999999]
[{"$nulls":7},350,"Julie Wright","Fly Guy",null,18.367000000000001]
[null,null,null,"Y",null,null,null,370,"Cara Crider","Diesel",null,18.420000000000002]
[null,null,null,"Y",null,null,null,255,"Cienna Jacobson","Pixie",null,18.516999999999999]
[null,null,null,"A",null,null,null,281,"Tallaney Nilson","Alida",null,18.52]
[null,null,null,"Y",null,null,null,334,"Walter Wolfe","Texas",null,18.684000000000001]
[{"$nulls":7},304,"Laura Pearson","Honky Tonk CDS",null,18.931000000000001]
[{"$nulls":7},150,"Allison Humphrey","Hes Jes Bubblicious",null,19.018999999999998]
[{"$nulls":7},37,"Marlyn Bland","TK Lady Gotta Gun",null,19.087]
[{"$nulls":7},120,"Hannah Sharon","Famous Brickhouse",null,19.422999999999998]
[{"$nulls":7},286,"Shylah Love","Hayday Lady Bug",null,19.623000000000001]
[null,null,null,"A",null,null,null,75,"Kristi Smith","Frenchmans Playgun",null,19.625]
["X",{"$nulls":6},306,"Jenna Napier","Frenchmans Dually",null,19.692]
[null,null,null,"A",null,null,null,154,"Reagan Jackson","CPB Ryker",null,19.747]
[{"$nulls":7},132,"Danyelle Campbell","Chuck",null,19.97]
["X",null,null,"A",null,null,null,197,"Pete Oen","Strait To Dallas",null,20.698]
[{"$nulls":7},236,"Brittany Worley","Honorable Flit",null,21.07]
["X",{"$nulls":6},171,"Andrea Cline","Dash Ta The Fire",null,21.495000000000001]
[null,null,null,"S",null,null,null,253,"DeeDee Jordan","Little Yella Draw",null,27.917999999999999]
[null,"X",null,"A",null,null,null,40,"Jolene Montgomery","Promise Me A Jet",null,"nt"]
[null,null,null,"A",null,null,null,87,"Tiffany Durham","Rudy",null,"nt"]
[null,null,null,"A",null,null,null,195,"Kylena Hager","The Savoy Express",null,"nt"]
[null,null,null,"S",null,null,null,220,"DeeDee Jordan","First Rappin Judge",null,"nt"]
[{"$nulls":7},13,"Emily Ann Williams","Crack",null,"nt"]
[null,"X",{"$nulls":5},85,"Cierra Chapman","Impackinfrenchpistol",null,"nt"]
[{"$nulls":7},151,"Ashley Schafer","SBD Sugar Me Sweet",null,"nt"]
[{"$nulls":7},198,"Tasha Welch","Shez Flying High Guyz",null,"nt"]
[{"$nulls":7},393,"Makala Pierce","Tracy",null,"nt"]
[null,null,"X",{"$nulls":4},305,"Wenda Johnson","Dreams First Flush",null,"nt15.658"]
[null,"X",null,"Y",null,null,null,89,"Mekenna Davis","Dreamin N French",null,"nt15.680"]
[{"$nulls":7},66,"Andrea Sewell","Abbysolutly Blitzed",null,"nt15.683"]
[null,"X",{"$nulls":5},269,"Cheyenne Wimberly","Royal Blue Fame",null,"nt15.701"]
[null,null,"X","A",null,null,null,187,"Kaylee Gallino","JC Truly Bob",null,"nt15.772"]
[{"$nulls":7},272,"Kelly Bruner","French Zone",null,"nt15.934"]
["X",{"$nulls":6},43,"Stephanie Fryar","Some Streakin French",null,"nt15.946"]
[null,null,null,"A",null,null,null,234,"Shantell Hayes","Cougar",null,"nt16.042"]
["X",{"$nulls":6},55,"Kelsey Lutjen","Rivons Gotta Tomboy",null,"nt16.047"]
[{"$nulls":7},248,"Megan Boone","Firey Hot Coco",null,"nt16.061"]
[null,"X",{"$nulls":5},27,"SheaLynn Leach","Louie Bug",null,"nt16.067"]
[null,null,null,"A",null,null,null,382,"Annabelle Martin","DTF Making My Way",null,"nt16.095"]
[{"$nulls":7},265,"Jennifer Kent","Bobbi",null,"nt16.102"]
[{"$nulls":7},206,"Sarah Rau","Savannahs Dash",null,"nt16.115"]
["X",null,null,"A",null,null,"X",59,"Molli Montgomery","Heavensfeelinspecial",null,"nt16.131"]
[null,"X",{"$nulls":5},19,"Kassie Mowry","LLP Silent Prayer",null,"nt16.160"]
[null,null,null,"Y",null,null,null,68,"Brynn Owens","StrawflyintheGold",null,"nt16.165"]
[{"$nulls":7},73,"Rachel Primm","Dashin Julene",null,"nt16.193"]
["X",{"$nulls":6},17,"Cierra Chapman","Lil Blushing Blonde",null,"nt16.198"]
[{"$nulls":7},176,"Nicole RIggle","SO Streakin Famous",null,"nt16.211"]
[null,null,"X","S",null,null,null,91,"Martha Jordan","JLFourtafame",null,"nt16.213"]
[null,null,null,"A",null,null,"X",201,"Carissa Bryant","Flaming Money Buggy",null,"nt16.244"]
[{"$nulls":7},380,"Tyra Kane","Majestick Knight",null,"nt16.245"]
[null,null,null,"A",null,null,null,147,"Gayle Jones","LS Corona Winsalot",null,"nt16.256"]
[{"$nulls":7},226,"Gabrielle Oder","Woody BA Star",null,"nt16.280"]
["X",{"$nulls":6},289,"Whitney Godinez","Her Perks Are On Fire",null,"nt16.283"]
[{"$nulls":7},347,"Erin Reich","Sallee",null,"nt16.288"]
[null,"X",null,"Y",null,null,null,381,"Shannon Jensen","Flits French Blondie",null,"nt16.294"]
[null,null,null,"S",null,null,null,258,"Jill Harbour","Bullit Proof",null,"nt16.306"]
[null,"X",{"$nulls":5},302,"Cheyenne Wimberly","Famous Willow",null,"nt16.322"]
[{"$nulls":7},25,"Cadee Williams","Jokers Sugar Rey",null,"nt16.362"]
["X",{"$nulls":6},34,"Nisa Berry","Code Name Fame",null,"nt16.386"]
["X",{"$nulls":6},222,"Ryann Pedone","VQ Im Buzzed",null,"nt16.403"]
[{"$nulls":7},311,"Tauna Bertsch","Miss Handy Cool Pep",null,"nt16.452"]
[{"$nulls":7},361,"Davie King","Alvin",null,"nt16.468"]
[{"$nulls":7},404,"Davie King","Tom",null,"nt16.482",{"$f":"IF(OR(K357=5,K357=10, K357=15, K357=\"BP\",K357=\"SCR\"),\"NT\",L357)","v":"nt16.482"}]
[{"$nulls":7},414,"Erin Reich","Hooker",null,"nt16.500",{"$f":"IF(OR(K358=5,K358=10, K358=15, K358=\"BP\",K358=\"SCR\"),\"NT\",L358)","v":"nt16.500"}]
["X",null,null,"A",null,null,null,140,"Jolene Montgomery","Smooth N Heavenly",null,"nt16.526"]
[{"$nulls":7},348,"Lacey Harmon","Convinceme Imfrench",null,"nt16.542"]
[{"$nulls":7},24,"Lisa Stafford","Lightening Bugz",null,"nt16.545"]
[{"$nulls":7},225,"Cindy Stone","Super Sonic Corona",null,"nt16.545"]
["X",null,null,"S",null,null,null,287,"Shelly Shields","Streakers Queen",null,"nt16.558"]
["X",{"$nulls":5},"X",65,"Sharin Hall","Rare Packin Six",null,"nt16.560"]
[{"$nulls":7},419,"Emilie Veillette","Witches Firewater",null,"nt16.573",{"$f":"IF(OR(K365=5,K365=10, K365=15, K365=\"BP\",K365=\"SCR\"),\"NT\",L365)","v":"nt16.573"}]
[null,null,null,"S",null,null,"X",109,"Debbie Bloxom","KN Born This Way",null,"nt16.578"]
[{"$nulls":7},277,"LJ LaRue","Jet ",null,"nt16.591"]
[null,null,null,"S",null,null,"X",113,"Kathy Muehlen","Fly Away Gal",null,"nt16.659"]
[{"$nulls":7},260,"Sadie Weldon","WB Runaway Pumpkin",null,"nt16.675"]
[{"$nulls":7},325,"Lacey Harmon","Mended Heart",null,"nt16.677"]
[{"$nulls":7},160,"Tasha Welch","Another French Boy",null,"nt16.690"]
[null,null,null,"S",null,null,null,118,"Lisa Cotter","Sonitas Shaker",null,"nt16.708"]
[{"$nulls":7},330,"Jolene Jones","Im Not Easy Guys",null,"nt16.714"]
["X",{"$nulls":6},368,"Jana Himes","KC High Pick",null,"nt16.748"]
[{"$nulls":7},301,"Lacey Harmon","Epic Nick",null,"nt16.755"]
[null,null,null,"S",null,null,null,293,"Glenda Barnett","Highonbrownwhiskey",null,"nt16.76"]
[{"$nulls":7},83,"Davie King","Hesa Brookstone",null,"nt16.812"]
[{"$nulls":7},307,"Dacota Monk","Marley",null,"nt16.844"]
[null,null,null,"A",null,null,null,29,"Lauren Thomas","Dragons Fancy Pistol",null,"nt16.863"]
[null,null,null,"A",null,null,null,415,"Melissa Patterson","Blue",null,"nt16.930",{"$f":"IF(OR(K380=5,K380=10, K380=15, K380=\"BP\",K380=\"SCR\"),\"NT\",L380)","v":"nt16.930"}]
[{"$nulls":7},365,"Adrianna Ruckteschler","Mr Spoon",null,"nt16.951"]
[{"$nulls":7},324,"Madison Franklin","Kits Little Twister",null,"nt16.957"]
["X",{"$nulls":6},413,"Dacota Monk","Sheza Slick Design",null,"nt16.981",{"$f":"IF(OR(K383=5,K383=10, K383=15, K383=\"BP\",K383=\"SCR\"),\"NT\",L383)","v":"nt16.981"}]
[{"$nulls":7},367,"Lindsey Behring","Tank",null,"nt16.989"]
[{"$nulls":7},158,"Chelsea Young","TF Savages Squawlet",null,"nt16.999"]
[{"$nulls":7},424,"Mindy Holloway","H2",null,"nt17.033",{"$f":"IF(OR(K386=5,K386=10, K386=15, K386=\"BP\",K386=\"SCR\"),\"NT\",L386)","v":"nt17.033"}]
[{"$nulls":7},190,"Debi Davis","SkyyBlue",null,"nt17.040"]
[null,null,null,"Y",null,null,"X",133,"Makynna Baldwin","TE Prissy",null,"nt17.080"]
[null,null,null,"Y",null,null,null,357,"Brooke Hickey","Shaggy",null,"nt17.081"]
[{"$nulls":7},81,"Caitlyn McCreary","GMCherryOhXpress",null,"nt17.177"]
[{"$nulls":7},268,"Alicia Jones","Turbo Tool",null,"nt17.216"]
[null,null,null,"S",null,null,null,163,"Debbie Rabb","FirewaterzLil Fritz",null,"nt17.282"]
[{"$nulls":7},416,"Stevie Perkins","Django",null,"nt17.320",{"$f":"IF(OR(K393=5,K393=10, K393=15, K393=\"BP\",K393=\"SCR\"),\"NT\",L393)","v":"nt17.320"}]
[{"$nulls":7},374,"Denny Ralls","Dash ",null,"nt17.339"]
[null,null,null,"A",null,null,null,331,"Kaylyn Smith","Classic Royal Star",null,"nt17.344"]
[{"$nulls":7},137,"LeAnn Wills","Yahoo Too",null,"nt17.368"]
[{"$nulls":7},175,"Billie Ann Harmon","HR Executive Fame",null,"nt17.399"]
[{"$nulls":7},326,"Kelly Govero","Stormy Karma",null,"nt17.422"]
[{"$nulls":7},315,"Star Hillemon","Mr. Vegas",null,"nt17.427"]
[null,null,"X",{"$nulls":4},9,"Lauren Whitmire","Fame Rox",null,"nt17.447"]
[{"$nulls":7},327,"Katie Perkins","Bubba",null,"nt17.457"]
[{"$nulls":7},340,"Dacota Monk","Stitch",null,"nt17.562"]
[{"$nulls":7},1,"Timberly Erickson","Mines Fast",null,"nt17.671"]
[null,null,null,"S",null,null,null,53,"Martha Smith","Victory Blue Moon",null,"nt17.698"]
[null,null,null,"Y",null,null,"X",95,"Makynna Baldwin","Norfleets Valley Girl",null,"nt17.739"]
[null,null,null,"A",null,null,null,54,"Cierra Chapman","Lever Action",null,"nt17.884"]
[null,null,null,"Y",null,null,null,338,"Reece Cook","Frost ",null,"nt17.983"]
[{"$nulls":7},394,"Michayla Crumley","Rakin Warrior",null,"nt18.138"]
[null,null,null,"A",null,null,null,249,"Joanna Kysar","Max",null,"nt18.407"]
["X",{"$nulls":6},398,"Shelby Rowe","Jess Say Yes",null,"nt18.707",{"$f":"IF(OR(K410=5,K410=10, K410=15, K410=\"BP\",K410=\"SCR\"),\"NT\",L410)","v":"nt18.707"}]
[null,null,null,"A",null,null,null,319,"Courtney Millsap","Kat",null,"nt18.716"]
[null,null,null,"S",null,null,null,5,"Kathy Minteer","Lil Bit",null,"nt18.805"]
[{"$nulls":7},33,"Shelley Morgan","Kinda Heavenly",null,"nt19.028"]
[{"$nulls":7},193,"Hannah Sharon","JL M80",null,"nt19.033"]
["X",null,null,"A",null,null,null,64,"Pete Oen","Fame TO The Max",null,"nt19.422"]
[{"$nulls":7},125,"Elma Sanford","Rondos Lady",null,"nt19.442"]
[{"$nulls":7},288,"Rachel Arms","JS Bubblinfirewater",null,"nt19.533"]
[{"$nulls":7},285,"Tasha Welch","Paris",null,"nt22.485"]
[{"$nulls":7},174,"Chelsi McLarty","Sunni",null,"scratch"]
[{"$nulls":7},219,"Alicia Kilgus","Check Me Out Guys",null,"scratch"]
[{"$nulls":7},230,"Tyler Trotman","Cowboy Ta Fame",null,"scratch"]
[{"$nulls":7},406,{"$nulls":4},{"$f":"IF(OR(K422=5,K422=10, K422=15, K422=\"BP\",K422=\"SCR\"),\"NT\",L422)","v":0}]
[{"$nulls":7},407,{"$nulls":4},{"$f":"IF(OR(K423=5,K423=10, K423=15, K423=\"BP\",K423=\"SCR\"),\"NT\",L423)","v":0}]
[{"$nulls":7},408,{"$nulls":4},{"$f":"IF(OR(K424=5,K424=10, K424=15, K424=\"BP\",K424=\"SCR\"),\"NT\",L424)","v":0}]
[{"$nulls":7},409,{"$nulls":4},{"$f":"IF(OR(K425=5,K425=10, K425=15, K425=\"BP\",K425=\"SCR\"),\"NT\",L425)","v":0}]
[{"$nulls":7},410,{"$nulls":4},{"$f":"IF(OR(K426=5,K426=10, K426=15, K426=\"BP\",K426=\"SCR\"),\"NT\",L426)","v":0}]
[{"$nulls":7},412,{"$nulls":4},{"$f":"IF(OR(K427=5,K427=10, K427=15, K427=\"BP\",K427=\"SCR\"),\"NT\",L427)","v":0}]
[{"$nulls":7},425,{"$nulls":4},{"$f":"IF(OR(K428=5,K428=10, K428=15, K428=\"BP\",K428=\"SCR\"),\"NT\",L428)","v":0}]
[{"$nulls":7},426,{"$nulls":4},{"$f":"IF(OR(K429=5,K429=10, K429=15, K429=\"BP\",K429=\"SCR\"),\"NT\",L429)","v":0}]
[{"$nulls":7},427,{"$nulls":4},{"$f":"IF(OR(K430=5,K430=10, K430=15, K430=\"BP\",K430=\"SCR\"),\"NT\",L430)","v":0}]
[{"$nulls":7},428,{"$nulls":4},{"$f":"IF(OR(K431=5,K431=10, K431=15, K431=\"BP\",K431=\"SCR\"),\"NT\",L431)","v":0}]
[{"$nulls":7},429,{"$nulls":4},{"$f":"IF(OR(K432=5,K432=10, K432=15, K432=\"BP\",K432=\"SCR\"),\"NT\",L432)","v":0}]
[{"$nulls":7},430,{"$nulls":4},{"$f":"IF(OR(K433=5,K433=10, K433=15, K433=\"BP\",K433=\"SCR\"),\"NT\",L433)","v":0}]
[{"$nulls":7},431,{"$nulls":4},{"$f":"IF(OR(K434=5,K434=10, K434=15, K434=\"BP\",K434=\"SCR\"),\"NT\",L434)","v":0}]
[{"$nulls":7},432,{"$nulls":4},{"$f":"IF(OR(K435=5,K435=10, K435=15, K435=\"BP\",K435=\"SCR\"),\"NT\",L435)","v":0}]
[{"$nulls":7},433,{"$nulls":4},{"$f":"IF(OR(K436=5,K436=10, K436=15, K436=\"BP\",K436=\"SCR\"),\"NT\",L436)","v":0}]
[{"$nulls":7},434,{"$nulls":4},{"$f":"IF(OR(K437=5,K437=10, K437=15, K437=\"BP\",K437=\"SCR\"),\"NT\",L437)","v":0}]
[{"$nulls":7},435,{"$nulls":4},{"$f":"IF(OR(K438=5,K438=10, K438=15, K438=\"BP\",K438=\"SCR\"),\"NT\",L438)","v":0}]
[{"$nulls":7},436,{"$nulls":4},{"$f":"IF(OR(K439=5,K439=10, K439=15, K439=\"BP\",K439=\"SCR\"),\"NT\",L439)","v":0}]
[{"$nulls":7},437,{"$nulls":4},{"$f":"IF(OR(K440=5,K440=10, K440=15, K440=\"BP\",K440=\"SCR\"),\"NT\",L440)","v":0}]
[{"$nulls":7},438,{"$nulls":4},{"$f":"IF(OR(K441=5,K441=10, K441=15, K441=\"BP\",K441=\"SCR\"),\"NT\",L441)","v":0}]
[{"$nulls":7},439,{"$nulls":4},{"$f":"IF(OR(K442=5,K442=10, K442=15, K442=\"BP\",K442=\"SCR\"),\"NT\",L442)","v":0}]
[{"$nulls":7},440,{"$nulls":4},{"$f":"IF(OR(K443=5,K443=10, K443=15, K443=\"BP\",K443=\"SCR\"),\"NT\",L443)","v":0}]
[{"$nulls":7},441,{"$nulls":4},{"$f":"IF(OR(K444=5,K444=10, K444=15, K444=\"BP\",K444=\"SCR\"),\"NT\",L444)","v":0}]
[{"$nulls":7},442,{"$nulls":4},{"$f":"IF(OR(K445=5,K445=10, K445=15, K445=\"BP\",K445=\"SCR\"),\"NT\",L445)","v":0}]
[{"$nulls":7},443,{"$nulls":4},{"$f":"IF(OR(K446=5,K446=10, K446=15, K446=\"BP\",K446=\"SCR\"),\"NT\",L446)","v":0}]
[{"$nulls":7},444,{"$nulls":4},{"$f":"IF(OR(K447=5,K447=10, K447=15, K447=\"BP\",K447=\"SCR\"),\"NT\",L447)","v":0}]
[{"$nulls":7},445,{"$nulls":4},{"$f":"IF(OR(K448=5,K448=10, K448=15, K448=\"BP\",K448=\"SCR\"),\"NT\",L448)","v":0}]
[{"$nulls":7},446,{"$nulls":4},{"$f":"IF(OR(K449=5,K449=10, K449=15, K449=\"BP\",K449=\"SCR\"),\"NT\",L449)","v":0}]
[{"$nulls":7},447,{"$nulls":4},{"$f":"IF(OR(K450=5,K450=10, K450=15, K450=\"BP\",K450=\"SCR\"),\"NT\",L450)","v":0}]
[{"$nulls":7},448,{"$nulls":4},{"$f":"IF(OR(K451=5,K451=10, K451=15, K451=\"BP\",K451=\"SCR\"),\"NT\",L451)","v":0}]
[{"$nulls":7},449,{"$nulls":4},{"$f":"IF(OR(K452=5,K452=10, K452=15, K452=\"BP\",K452=\"SCR\"),\"NT\",L452)","v":0}]
[{"$nulls":7},450,{"$nulls":4},{"$f":"IF(OR(K453=5,K453=10, K453=15, K453=\"BP\",K453=\"SCR\"),\"NT\",L453)","v":0}]
[{"$nulls":7},451,{"$nulls":4},{"$f":"IF(OR(K454=5,K454=10, K454=15, K454=\"BP\",K454=\"SCR\"),\"NT\",L454)","v":0}]
[{"$nulls":7},452,{"$nulls":4},{"$f":"IF(OR(K455=5,K455=10, K455=15, K455=\"BP\",K455=\"SCR\"),\"NT\",L455)","v":0}]
[{"$nulls":7},453,{"$nulls":4},{"$f":"IF(OR(K456=5,K456=10, K456=15, K456=\"BP\",K456=\"SCR\"),\"NT\",L456)","v":0}]
[{"$nulls":7},454,{"$nulls":4},{"$f":"IF(OR(K457=5,K457=10, K457=15, K457=\"BP\",K457=\"SCR\"),\"NT\",L457)","v":0}]
[{"$nulls":7},455,{"$nulls":4},{"$f":"IF(OR(K458=5,K458=10, K458=15, K458=\"BP\",K458=\"SCR\"),\"NT\",L458)","v":0}]
[{"$nulls":7},456,{"$nulls":4},{"$f":"IF(OR(K459=5,K459=10, K459=15, K459=\"BP\",K459=\"SCR\"),\"NT\",L459)","v":0}]
[{"$nulls":7},457,{"$nulls":4},{"$f":"IF(OR(K460=5,K460=10, K460=15, K460=\"BP\",K460=\"SCR\"),\"NT\",L460)","v":0}]
[{"$nulls":7},458,{"$nulls":4},{"$f":"IF(OR(K461=5,K461=10, K461=15, K461=\"BP\",K461=\"SCR\"),\"NT\",L461)","v":0}]
[{"$nulls":7},459,{"$nulls":4},{"$f":"IF(OR(K462=5,K462=10, K462=15, K462=\"BP\",K462=\"SCR\"),\"NT\",L462)","v":0}]
[{"$nulls":7},460,{"$nulls":4},{"$f":"IF(OR(K463=5,K463=10, K463=15, K463=\"BP\",K463=\"SCR\"),\"NT\",L463)","v":0}]
[{"$nulls":7},461,{"$nulls":4},{"$f":"IF(OR(K464=5,K464=10, K464=15, K464=\"BP\",K464=\"SCR\"),\"NT\",L464)","v":0}]
[{"$nulls":7},462,{"$nulls":4},{"$f":"IF(OR(K465=5,K465=10, K465=15, K465=\"BP\",K465=\"SCR\"),\"NT\",L465)","v":0}]
[{"$nulls":7},463,{"$nulls":4},{"$f":"IF(OR(K466=5,K466=10, K466=15, K466=\"BP\",K466=\"SCR\"),\"NT\",L466)","v":0}]
[{"$nulls":7},464,{"$nulls":4},{"$f":"IF(OR(K467=5,K467=10, K467=15, K467=\"BP\",K467=\"SCR\"),\"NT\",L467)","v":0}]
[{"$nulls":7},465,{"$nulls":4},{"$f":"IF(OR(K468=5,K468=10, K468=15, K468=\"BP\",K468=\"SCR\"),\"NT\",L468)","v":0}]
[{"$nulls":7},466,{"$nulls":4},{"$f":"IF(OR(K469=5,K469=10, K469=15, K469=\"BP\",K469=\"SCR\"),\"NT\",L469)","v":0}]
[{"$nulls":7},467,{"$nulls":4},{"$f":"IF(OR(K470=5,K470=10, K470=15, K470=\"BP\",K470=\"SCR\"),\"NT\",L470)","v":0}]
[{"$nulls":7},468,{"$nulls":4},{"$f":"IF(OR(K471=5,K471=10, K471=15, K471=\"BP\",K471=\"SCR\"),\"NT\",L471)","v":0}]
[{"$nulls":7},469,{"$nulls":4},{"$f":"IF(OR(K472=5,K472=10, K472=15, K472=\"BP\",K472=\"SCR\"),\"NT\",L472)","v":0}]
[{"$nulls":7},470,{"$nulls":4},{"$f":"IF(OR(K473=5,K473=10, K473=15, K473=\"BP\",K473=\"SCR\"),\"NT\",L473)","v":0}]
[{"$nulls":7},471,{"$nulls":4},{"$f":"IF(OR(K474=5,K474=10, K474=15, K474=\"BP\",K474=\"SCR\"),\"NT\",L474)","v":0}]
[{"$nulls":7},472,{"$nulls":4},{"$f":"IF(OR(K475=5,K475=10, K475=15, K475=\"BP\",K475=\"SCR\"),\"NT\",L475)","v":0}]
[{"$nulls":7},473,{"$nulls":4},{"$f":"IF(OR(K476=5,K476=10, K476=15, K476=\"BP\",K476=\"SCR\"),\"NT\",L476)","v":0}]
[{"$nulls":7},474,{"$nulls":4},{"$f":"IF(OR(K477=5,K477=10, K477=15, K477=\"BP\",K477=\"SCR\"),\"NT\",L477)","v":0}]
[{"$nulls":7},475,{"$nulls":4},{"$f":"IF(OR(K478=5,K478=10, K478=15, K478=\"BP\",K478=\"SCR\"),\"NT\",L478)","v":0}]
[{"$nulls":7},476,{"$nulls":4},{"$f":"IF(OR(K479=5,K479=10, K479=15, K479=\"BP\",K479=\"SCR\"),\"NT\",L479)","v":0}]
[{"$nulls":7},477,{"$nulls":4},{"$f":"IF(OR(K480=5,K480=10, K480=15, K480=\"BP\",K480=\"SCR\"),\"NT\",L480)","v":0}]
[{"$nulls":7},478,{"$nulls":4},{"$f":"IF(OR(K481=5,K481=10, K481=15, K481=\"BP\",K481=\"SCR\"),\"NT\",L481)","v":0}]
[{"$nulls":7},479,{"$nulls":4},{"$f":"IF(OR(K482=5,K482=10, K482=15, K482=\"BP\",K482=\"SCR\"),\"NT\",L482)","v":0}]
[{"$nulls":7},480,{"$nulls":4},{"$f":"IF(OR(K483=5,K483=10, K483=15, K483=\"BP\",K483=\"SCR\"),\"NT\",L483)","v":0}]
[{"$nulls":7},481,{"$nulls":4},{"$f":"IF(OR(K484=5,K484=10, K484=15, K484=\"BP\",K484=\"SCR\"),\"NT\",L484)","v":0}]
[{"$nulls":7},482,{"$nulls":4},{"$f":"IF(OR(K485=5,K485=10, K485=15, K485=\"BP\",K485=\"SCR\"),\"NT\",L485)","v":0}]
[{"$nulls":7},483,{"$nulls":4},{"$f":"IF(OR(K486=5,K486=10, K486=15, K486=\"BP\",K486=\"SCR\"),\"NT\",L486)","v":0}]
[{"$nulls":7},484,{"$nulls":4},{"$f":"IF(OR(K487=5,K487=10, K487=15, K487=\"BP\",K487=\"SCR\"),\"NT\",L487)","v":0}]
[{"$nulls":7},485,{"$nulls":4},{"$f":"IF(OR(K488=5,K488=10, K488=15, K488=\"BP\",K488=\"SCR\"),\"NT\",L488)","v":0}]
[{"$nulls":7},486,{"$nulls":4},{"$f":"IF(OR(K489=5,K489=10, K489=15, K489=\"BP\",K489=\"SCR\"),\"NT\",L489)","v":0}]
[{"$nulls":7},487,{"$nulls":4},{"$f":"IF(OR(K490=5,K490=10, K490=15, K490=\"BP\",K490=\"SCR\"),\"NT\",L490)","v":0}]
[{"$nulls":7},488,{"$nulls":4},{"$f":"IF(OR(K491=5,K491=10, K491=15, K491=\"BP\",K491=\"SCR\"),\"NT\",L491)","v":0}]
[{"$nulls":7},489,{"$nulls":4},{"$f":"IF(OR(K492=5,K492=10, K492=15, K492=\"BP\",K492=\"SCR\"),\"NT\",L492)","v":0}]
[{"$nulls":7},490,{"$nulls":4},{"$f":"IF(OR(K493=5,K493=10, K493=15, K493=\"BP\",K493=\"SCR\"),\"NT\",L493)","v":0}]
[{"$nulls":7},491,{"$nulls":4},{"$f":"IF(OR(K494=5,K494=10, K494=15, K494=\"BP\",K494=\"SCR\"),\"NT\",L494)","v":0}]
[{"$nulls":7},492,{"$nulls":4},{"$f":"IF(OR(K495=5,K495=10, K495=15, K495=\"BP\",K495=\"SCR\"),\"NT\",L495)","v":0}]
[{"$nulls":7},493,{"$nulls":4},{"$f":"IF(OR(K496=5,K496=10, K496=15, K496=\"BP\",K496=\"SCR\"),\"NT\",L496)","v":0}]
[{"$nulls":7},494,{"$nulls":4},{"$f":"IF(OR(K497=5,K497=10, K497=15, K497=\"BP\",K497=\"SCR\"),\"NT\",L497)","v":0}]
[{"$nulls":7},495,{"$nulls":4},{"$f":"IF(OR(K498=5,K498=10, K498=15, K498=\"BP\",K498=\"SCR\"),\"NT\",L498)","v":0}]
[{"$nulls":7},496,{"$nulls":4},{"$f":"IF(OR(K499=5,K499=10, K499=15, K499=\"BP\",K499=\"SCR\"),\"NT\",L499)","v":0}]
[{"$nulls":7},497,{"$nulls":4},{"$f":"IF(OR(K500=5,K500=10, K500=15, K500=\"BP\",K500=\"SCR\"),\"NT\",L500)","v":0}]
[{"$nulls":7},498,{"$nulls":4},{"$f":"IF(OR(K501=5,K501=10, K501=15, K501=\"BP\",K501=\"SCR\"),\"NT\",L501)","v":0}]
[{"$nulls":7},499,{"$nulls":4},{"$f":"IF(OR(K502=5,K502=10, K502=15, K502=\"BP\",K502=\"SCR\"),\"NT\",L502)","v":0}]
[{"$nulls":7},500,{"$nulls":4},{"$f":"IF(OR(K503=5,K503=10, K503=15, K503=\"BP\",K503=\"SCR\"),\"NT\",L503)","v":0}]

{"sheet":"Senior","index":1,"n_rows":301,"n_cols":12,"rows_kept":301,"cut":false,"hidden":false,"merged":[]}
["Futurity","Der","Age Inct.","BBR","Draw","Rider Name","Horse Name","Pen","Time","Final Time","Placing","Money Earned"]
[{"$nulls":4},1,"Carmel Wright","Fortunes Last Xtrem",null,15.686,null,"1D 1st",147]
[{"$nulls":4},2,"Sherri Barnes","Famous Little Jet",null,15.842000000000001,null,"1D 2nd",98]
[{"$nulls":4},3,"Sherri Barnes","Racing For Perks",null,15.989000000000001]
[{"$nulls":4},4,"Jaque Woolman","Another Bug",null,16]
[{"$nulls":4},5,"Lisa Wernli","Flashs Fine Effort",null,16.004999999999999]
[{"$nulls":4},6,"Teresa McClendon","Striking Poses",null,16.106000000000002]
[{"$nulls":4},7,"Mary Carter","Bullys Tiger Eye",null,16.190999999999999,null,"2D 1st",126]
[{"$nulls":4},8,"Carmel Wright","PG Eye Bully Fame",null,16.298999999999999,null,"2D 2nd",84]
[{"$nulls":4},9,"Martha Smith","Firewatermakemehappy",null,16.3]
[{"$nulls":4},10,"Jaque Woolman","Bugs A Boo",null,16.369]
[{"$nulls":4},11,"Debbie Rabb","VF Famous Fooster",null,16.411000000000001]
[{"$nulls":4},12,"Terry Vogel","BB Boogyingfrenchman",null,16.492999999999999]
[{"$nulls":4},13,"Lynn Saunders","Chumly",null,16.667999999999999]
[{"$nulls":4},14,"Connie Randolph","Hot Rod Kitty Cat",null,16.777999999999999,null,"3D 1st",84]
[{"$nulls":4},15,"Simone Elmore","Badger A Conchadrift",null,16.954000000000001,null,"3D 2nd",56]
[{"$nulls":4},16,"Curtis Watson","Peppy Fire Frost",null,17.053999999999998]
[{"$nulls":4},17,"Lisa Wernli","PROUDTOBEFRENCH",null,17.074000000000002]
[{"$nulls":4},18,"Tracy Henderson","Heza Stray Cat",null,17.076000000000001]
[{"$nulls":4},19,"Terry Quintana","Jerry",null,17.091000000000001]
[{"$nulls":4},20,"Glenda Barnett","Miss Famous Beduino",null,17.241,null,"4D 1st",63]
[{"$nulls":4},21,"Terry Vogel","Imablueyedblondbitz",null,17.463999999999999,null,"4D 2nd",42]
[{"$nulls":4},22,"Martha Smith","My Epic Moment",null,17.626000000000001]
[{"$nulls":4},23,"Kevin Davis ","Gibbs",null,17.651]
[{"$nulls":4},24,"DeeDee Jordan","Little Yella Draw",null,27.917999999999999]
[{"$nulls":4},25,"DeeDee Jordan","First Rappin Judge",null,"nt"]
[{"$nulls":4},26,"Martha Jordan","JLFourtafame",null,"nt16.213"]
[{"$nulls":4},27,"Jill Harbour","Bullit Proof",null,"nt16.306"]
[{"$nulls":4},28,"Shelly Shields","Streakers Queen",null,"nt16.558"]
[{"$nulls":4},29,"Debbie Bloxom","KN Born This Way",null,"nt16.578"]
[{"$nulls":4},30,"Kathy Muehlen","Fly Away Gal",null,"nt16.659"]
[{"$nulls":4},31,"Lisa Cotter","Sonitas Shaker",null,"nt16.708"]
[{"$nulls":4},32,"Glenda Barnett","Highonbrownwhiskey",null,"nt16.76"]
[{"$nulls":4},33,"Debbie Rabb","FirewaterzLil Fritz",null,"nt17.282"]
[{"$nulls":4},34,"Martha Smith","Victory Blue Moon",null,"nt17.698"]
[{"$nulls":4},35,"Kathy Minteer","Lil Bit",null,"nt18.805"]
[{"$nulls":4},36]
[{"$nulls":4},37]
[{"$nulls":4},38]
[{"$nulls":4},39]
[{"$nulls":4},40]
[{"$nulls":4},41,{"$nulls":4},{"$f":"IF(OR(H42=5,H42=10, H42=15, H42=\"BP\",H42=\"SCR\"),\"NT\",I42)","v":0}]
[{"$nulls":4},42,{"$nulls":4},0]
[{"$nulls":4},43,{"$nulls":4},0]
[{"$nulls":4},44,{"$nulls":4},0]
[{"$nulls":4},45,{"$nulls":4},0]
[{"$nulls":4},46,{"$nulls":4},0]
[{"$nulls":4},47,{"$nulls":4},0]
[{"$nulls":4},48,{"$nulls":4},0]
[{"$nulls":4},49,{"$nulls":4},0]
[{"$nulls":4},50,{"$nulls":4},0]
[{"$nulls":4},51,{"$nulls":4},0]
[{"$nulls":4},52,{"$nulls":4},0]
[{"$nulls":4},53,{"$nulls":4},0]
[{"$nulls":4},54,{"$nulls":4},0]
[{"$nulls":4},55,{"$nulls":4},0]
[{"$nulls":4},56,{"$nulls":4},0]
[{"$nulls":4},57,{"$nulls":4},0]
[{"$nulls":4},58,{"$nulls":4},0]
[{"$nulls":4},59,{"$nulls":4},0]
[{"$nulls":4},60,{"$nulls":4},0]
[{"$nulls":4},61,{"$nulls":4},0]
[{"$nulls":4},62,{"$nulls":4},0]
[{"$nulls":4},63,{"$nulls":4},0]
[{"$nulls":4},64,{"$nulls":4},0]
[{"$nulls":4},65,{"$nulls":4},0]
[{"$nulls":4},66,{"$nulls":4},{"$f":"IF(OR(H67=5,H67=10, H67=15, H67=\"BP\",H67=\"SCR\"),\"NT\",I67)","v":0}]
[{"$nulls":4},67,{"$nulls":4},0]
[{"$nulls":4},68,{"$nulls":4},0]
[{"$nulls":4},69,{"$nulls":4},0]
[{"$nulls":4},70,{"$nulls":4},0]
[{"$nulls":4},71,{"$nulls":4},0]
[{"$nulls":4},72,{"$nulls":4},0]
[{"$nulls":4},73,{"$nulls":4},0]
[{"$nulls":4},74,{"$nulls":4},0]
[{"$nulls":4},75,{"$nulls":4},0]
[{"$nulls":4},76,{"$nulls":4},0]
[{"$nulls":4},77,{"$nulls":4},0]
[{"$nulls":4},78,{"$nulls":4},0]
[{"$nulls":4},79,{"$nulls":4},0]
[{"$nulls":4},80,{"$nulls":4},0]
[{"$nulls":4},81,{"$nulls":4},0]
[{"$nulls":4},82,{"$nulls":4},0]
[{"$nulls":4},83,{"$nulls":4},0]
[{"$nulls":4},84,{"$nulls":4},0]
[{"$nulls":4},85,{"$nulls":4},0]
[{"$nulls":4},86,{"$nulls":4},0]
[{"$nulls":4},87,{"$nulls":4},0]
[{"$nulls":4},88,{"$nulls":4},0]
[{"$nulls":4},89,{"$nulls":4},0]
[{"$nulls":4},90,{"$nulls":4},0]
[{"$nulls":4},91,{"$nulls":4},0]
[{"$nulls":4},92,{"$nulls":4},0]
[{"$nulls":4},93,{"$nulls":4},0]
[{"$nulls":4},94,{"$nulls":4},0]
[{"$nulls":4},95,{"$nulls":4},0]
[{"$nulls":4},96,{"$nulls":4},0]
[{"$nulls":4},97,{"$nulls":4},0]
[{"$nulls":4},98,{"$nulls":4},0]
[{"$nulls":4},99,{"$nulls":4},0]
[{"$nulls":4},100,{"$nulls":4},0]
[{"$nulls":4},101,{"$nulls":4},0]
[{"$nulls":4},102,{"$nulls":4},0]
[{"$nulls":4},103,{"$nulls":4},0]
[{"$nulls":4},104,{"$nulls":4},0]
[{"$nulls":4},105,{"$nulls":4},0]
[{"$nulls":4},106,{"$nulls":4},0]
[{"$nulls":4},107,{"$nulls":4},0]
[{"$nulls":4},108,{"$nulls":4},0]
[{"$nulls":4},109,{"$nulls":4},0]
[{"$nulls":4},110,{"$nulls":4},0]
[{"$nulls":4},111,{"$nulls":4},0]
[{"$nulls":4},112,{"$nulls":4},0]
[{"$nulls":4},113,{"$nulls":4},0]
[{"$nulls":4},114,{"$nulls":4},0]
[{"$nulls":4},115,{"$nulls":4},0]
[{"$nulls":4},116,{"$nulls":4},0]
[{"$nulls":4},117,{"$nulls":4},0]
[{"$nulls":4},118,{"$nulls":4},0]
[{"$nulls":4},119,{"$nulls":4},0]
[{"$nulls":4},120,{"$nulls":4},0]
[{"$nulls":4},121,{"$nulls":4},0]
[{"$nulls":4},122,{"$nulls":4},0]
[{"$nulls":4},123,{"$nulls":4},0]
[{"$nulls":4},124,{"$nulls":4},0]
[{"$nulls":4},125,{"$nulls":4},0]
[{"$nulls":4},126,{"$nulls":4},0]
[{"$nulls":4},127,{"$nulls":4},0]
[{"$nulls":4},128,{"$nulls":4},0]
[{"$nulls":4},129,{"$nulls":4},0]
[{"$nulls":4},130,{"$nulls":4},{"$f":"IF(OR(H131=5,H131=10, H131=15, H131=\"BP\",H131=\"SCR\"),\"NT\",I131)","v":0}]
[{"$nulls":4},131,{"$nulls":4},0]
[{"$nulls":4},132,{"$nulls":4},0]
[{"$nulls":4},133,{"$nulls":4},0]
[{"$nulls":4},134,{"$nulls":4},0]
[{"$nulls":4},135,{"$nulls":4},0]
[{"$nulls":4},136,{"$nulls":4},0]
[{"$nulls":4},137,{"$nulls":4},0]
[{"$nulls":4},138,{"$nulls":4},0]
[{"$nulls":4},139,{"$nulls":4},0]
[{"$nulls":4},140,{"$nulls":4},0]
[{"$nulls":4},141,{"$nulls":4},0]
[{"$nulls":4},142,{"$nulls":4},0]
[{"$nulls":4},143,{"$nulls":4},0]
[{"$nulls":4},144,{"$nulls":4},0]
[{"$nulls":4},145,{"$nulls":4},0]
[{"$nulls":4},146,{"$nulls":4},0]
[{"$nulls":4},147,{"$nulls":4},0]
[{"$nulls":4},148,{"$nulls":4},0]
[{"$nulls":4},149,{"$nulls":4},0]
[{"$nulls":4},150,{"$nulls":4},0]
[{"$nulls":4},151,{"$nulls":4},0]
[{"$nulls":4},152,{"$nulls":4},0]
[{"$nulls":4},153,{"$nulls":4},0]
[{"$nulls":4},154,{"$nulls":4},0]
[{"$nulls":4},155,{"$nulls":4},0]
[{"$nulls":4},156,{"$nulls":4},0]
[{"$nulls":4},157,{"$nulls":4},0]
[{"$nulls":4},158,{"$nulls":4},0]
[{"$nulls":4},159,{"$nulls":4},0]
[{"$nulls":4},160,{"$nulls":4},0]
[{"$nulls":4},161,{"$nulls":4},0]
[{"$nulls":4},162,{"$nulls":4},0]
[{"$nulls":4},163,{"$nulls":4},0]
[{"$nulls":4},164,{"$nulls":4},0]
[{"$nulls":4},165,{"$nulls":4},0]
[{"$nulls":4},166,{"$nulls":4},0]
[{"$nulls":4},167,{"$nulls":4},0]
[{"$nulls":4},168,{"$nulls":4},0]
[{"$nulls":4},169,{"$nulls":4},0]
[{"$nulls":4},170,{"$nulls":4},0]
[{"$nulls":4},171,{"$nulls":4},0]
[{"$nulls":4},172,{"$nulls":4},0]
[{"$nulls":4},173,{"$nulls":4},0]
[{"$nulls":4},174,{"$nulls":4},0]
[{"$nulls":4},175,{"$nulls":4},0]
[{"$nulls":4},176,{"$nulls":4},0]
[{"$nulls":4},177,{"$nulls":4},0]
[{"$nulls":4},178,{"$nulls":4},0]
[{"$nulls":4},179,{"$nulls":4},0]
[{"$nulls":4},180,{"$nulls":4},0]
[{"$nulls":4},181,{"$nulls":4},0]
[{"$nulls":4},182,{"$nulls":4},0]
[{"$nulls":4},183,{"$nulls":4},0]
[{"$nulls":4},184,{"$nulls":4},0]
[{"$nulls":4},185,{"$nulls":4},0]
[{"$nulls":4},186,{"$nulls":4},0]
[{"$nulls":4},187,{"$nulls":4},0]
[{"$nulls":4},188,{"$nulls":4},0]
[{"$nulls":4},189,{"$nulls":4},0]
[{"$nulls":4},190,{"$nulls":4},0]
[{"$nulls":4},191,{"$nulls":4},0]
[{"$nulls":4},192,{"$nulls":4},0]
[{"$nulls":4},193,{"$nulls":4},0]
[{"$nulls":4},194,{"$nulls":4},{"$f":"IF(OR(H195=5,H195=10, H195=15, H195=\"BP\",H195=\"SCR\"),\"NT\",I195)","v":0}]
[{"$nulls":4},195,{"$nulls":4},0]
[{"$nulls":4},196,{"$nulls":4},0]
[{"$nulls":4},197,{"$nulls":4},0]
[{"$nulls":4},198,{"$nulls":4},0]
[{"$nulls":4},199,{"$nulls":4},0]
[{"$nulls":4},200,{"$nulls":4},0]
[{"$nulls":4},201,{"$nulls":4},0]
[{"$nulls":4},202,{"$nulls":4},0]
[{"$nulls":4},203,{"$nulls":4},0]
[{"$nulls":4},204,{"$nulls":4},0]
[{"$nulls":4},205,{"$nulls":4},0]
[{"$nulls":4},206,{"$nulls":4},0]
[{"$nulls":4},207,{"$nulls":4},0]
[{"$nulls":4},208,{"$nulls":4},0]
[{"$nulls":4},209,{"$nulls":4},0]
[{"$nulls":4},210,{"$nulls":4},0]
[{"$nulls":4},211,{"$nulls":4},0]
[{"$nulls":4},212,{"$nulls":4},0]
[{"$nulls":4},213,{"$nulls":4},0]
[{"$nulls":4},214,{"$nulls":4},0]
[{"$nulls":4},215,{"$nulls":4},0]
[{"$nulls":4},216,{"$nulls":4},0]
[{"$nulls":4},217,{"$nulls":4},0]
[{"$nulls":4},218,{"$nulls":4},0]
[{"$nulls":4},219,{"$nulls":4},0]
[{"$nulls":4},220,{"$nulls":4},0]
[{"$nulls":4},221,{"$nulls":4},0]
[{"$nulls":4},222,{"$nulls":4},0]
[{"$nulls":4},223,{"$nulls":4},0]
[{"$nulls":4},224,{"$nulls":4},0]
[{"$nulls":4},225,{"$nulls":4},0]
[{"$nulls":4},226,{"$nulls":4},0]
[{"$nulls":4},227,{"$nulls":4},0]
[{"$nulls":4},228,{"$nulls":4},0]
[{"$nulls":4},229,{"$nulls":4},0]
[{"$nulls":4},230,{"$nulls":4},0]
[{"$nulls":4},231,{"$nulls":4},0]
[{"$nulls":4},232,{"$nulls":4},0]
[{"$nulls":4},233,{"$nulls":4},0]
[{"$nulls":4},234,{"$nulls":4},0]
[{"$nulls":4},235,{"$nulls":4},0]
[{"$nulls":4},236,{"$nulls":4},0]
[{"$nulls":4},237,{"$nulls":4},0]
[{"$nulls":4},238,{"$nulls":4},0]
[{"$nulls":4},239,{"$nulls":4},0]
[{"$nulls":4},240,{"$nulls":4},0]
[{"$nulls":4},241,{"$nulls":4},0]
[{"$nulls":4},242,{"$nulls":4},0]
[{"$nulls":4},243,{"$nulls":4},0]
[{"$nulls":4},244,{"$nulls":4},0]
[{"$nulls":4},245,{"$nulls":4},0]
[{"$nulls":4},246,{"$nulls":4},0]
[{"$nulls":4},247,{"$nulls":4},0]
[{"$nulls":4},248,{"$nulls":4},0]
[{"$nulls":4},249,{"$nulls":4},0]
[{"$nulls":4},250,{"$nulls":4},0]
[{"$nulls":4},251,{"$nulls":4},0]
[{"$nulls":4},252,{"$nulls":4},0]
[{"$nulls":4},253,{"$nulls":4},0]
[{"$nulls":4},254,{"$nulls":4},0]
[{"$nulls":4},255,{"$nulls":4},0]
[{"$nulls":4},256,{"$nulls":4},0]
[{"$nulls":4},257,{"$nulls":4},0]
[{"$nulls":4},258,{"$nulls":4},{"$f":"IF(OR(H259=5,H259=10, H259=15, H259=\"BP\",H259=\"SCR\"),\"NT\",I259)","v":0}]
[{"$nulls":4},259,{"$nulls":4},0]
[{"$nulls":4},260,{"$nulls":4},0]
[{"$nulls":4},261,{"$nulls":4},0]
[{"$nulls":4},262,{"$nulls":4},0]
[{"$nulls":4},263,{"$nulls":4},0]
[{"$nulls":4},264,{"$nulls":4},0]
[{"$nulls":4},265,{"$nulls":4},0]
[{"$nulls":4},266,{"$nulls":4},0]
[{"$nulls":4},267,{"$nulls":4},0]
[{"$nulls":4},268,{"$nulls":4},0]
[{"$nulls":4},269,{"$nulls":4},0]
[{"$nulls":4},270,{"$nulls":4},0]
[{"$nulls":4},271,{"$nulls":4},0]
[{"$nulls":4},272,{"$nulls":4},0]
[{"$nulls":4},273,{"$nulls":4},0]
[{"$nulls":4},274,{"$nulls":4},0]
[{"$nulls":4},275,{"$nulls":4},0]
[{"$nulls":4},276,{"$nulls":4},0]
[{"$nulls":4},277,{"$nulls":4},0]
[{"$nulls":4},278,{"$nulls":4},0]
[{"$nulls":4},279,{"$nulls":4},0]
[{"$nulls":4},280,{"$nulls":4},0]
[{"$nulls":4},281,{"$nulls":4},0]
[{"$nulls":4},282,{"$nulls":4},0]
[{"$nulls":4},283,{"$nulls":4},0]
[{"$nulls":4},284,{"$nulls":4},0]
[{"$nulls":4},285,{"$nulls":4},0]
[{"$nulls":4},286,{"$nulls":4},0]
[{"$nulls":4},287,{"$nulls":4},0]
[{"$nulls":4},288,{"$nulls":4},0]
[{"$nulls":4},289,{"$nulls":4},0]
[{"$nulls":4},290,{"$nulls":4},0]
[{"$nulls":4},291,{"$nulls":4},0]
[{"$nulls":4},292,{"$nulls":4},0]
[{"$nulls":4},293,{"$nulls":4},0]
[{"$nulls":4},294,{"$nulls":4},0]
[{"$nulls":4},295,{"$nulls":4},0]
[{"$nulls":4},296,{"$nulls":4},0]
[{"$nulls":4},297,{"$nulls":4},0]
[{"$nulls":4},298,{"$nulls":4},0]
[{"$nulls":4},299,{"$nulls":4},0]
[{"$nulls":4},300,{"$nulls":4},0]

{"sheet":"Adult","index":2,"n_rows":301,"n_cols":12,"rows_kept":301,"cut":false,"hidden":false,"merged":[]}
["Futurity","Der","Age Inct.","BBR","Draw","Rider Name","Horse Name","Pen","Time","Final Time","Placing","Money Earned"]
[{"$nulls":4},1,"Cierra Chapman","Sun In Fun",null,15.632,null,"1D 1st",245]
[{"$nulls":4},2,"Jolene Montgomery","Streakin Easily",null,15.818,null,"1D 2nd",196]
[{"$nulls":4},3,"Kelly Allen","Moons Fire Ta Fame",null,15.843,null,"1D 3nd",147]
[{"$nulls":4},4,"Jolene Montgomery","Flits Khamacasse",null,15.86]
[{"$nulls":4},5,"Jolene Montgomery","Firin Ta Heaven",null,15.959]
[{"$nulls":4},6,"Cassidy Kruse","Guys Six Pack",null,15.99]
[{"$nulls":4},7,"Kaylee Gallino","W Q Bar Socks",null,16.036000000000001]
[{"$nulls":4},8,"Kaylee Gallino","JC Baldy Frost",null,16.065999999999999]
[{"$nulls":4},9,"Brandy Vogue","Dmac Hypnotize",null,16.155999999999999,null,"2D 1st",210]
[{"$nulls":4},10,"Denny Ralls","Whiskey",null,16.177,null,"2D 2nd",126]
[{"$nulls":4},11,"Pete Oen","HGF Flinging Frosted",null,16.227,null,"2D 3rd",84]
[{"$nulls":4},12,"Jolene Montgomery","Famously Perkin",null,16.34]
[{"$nulls":4},13,"Pete Oen","Corona Four Fiesta",null,16.405999999999999]
[{"$nulls":4},14,"Kathy Vazquez","Sail On Ta Fame",null,16.420999999999999]
[{"$nulls":4},15,"Pete Oen","Deans Terror",null,16.484000000000002]
[{"$nulls":4},16,"Cassidy Rabb","VF Temptations",null,16.506]
[{"$nulls":4},17,"Kendall Jordan","Guns On Fire",null,16.553000000000001]
[{"$nulls":4},18,"Gayle Jones","Credit Me For Hollan",null,16.567]
[{"$nulls":4},19,"Debbie Bloxom","Bad Firing Rising",null,16.597000000000001]
[{"$nulls":4},20,"Pete Oen","FC Black Firewater",null,16.617000000000001]
[{"$nulls":4},21,"Kelsey Howard","Midnight DJ",null,16.62]
[{"$nulls":4},22,"Jess Lewis","Francy Streak",null,16.678000000000001,null,"3D 1st",140]
[{"$nulls":4},23,"Jennifer Abbott","Wendall Jackson",null,16.734999999999999,null,"3D 2nd",84]
[{"$nulls":4},24,"Kelsey Howard","Triple Gold Time",null,16.8,null,"3D 3rd",56]
[{"$nulls":4},25,"Cassidy Rabb","VF Coup Fulla Coins",null,16.811]
[{"$nulls":4},26,"Pete Oen","Fyre In The Skye",null,16.837]
[{"$nulls":4},27,"Mandy Holloway","First Touch of Fire",null,16.838000000000001]
[{"$nulls":4},28,"Alisha Todd","Sheza Amarillo Doc",null,16.853000000000002]
[{"$nulls":4},29,"Kylena Hager","Bar B Firewater Steel",null,16.867000000000001]
[{"$nulls":4},30,"Tammy Hickey","Josey",null,16.873000000000001]
[{"$nulls":4},31,"Nicole Buell","Dirty Money",null,16.937999999999999]
[{"$nulls":4},32,"Shantell Hayes","Pixie",null,16.952000000000002]
[{"$nulls":4},33,"Tristan Mounts","Blazed Gunsmoke",null,16.998999999999999]
[{"$nulls":4},34,"Tiffany Durham","Hippie",null,17.132000000000001,null,"4D 1st",105]
[{"$nulls":4},35,"Melissa Jones","Threes Royal Derby",null,17.195,null,"4D 2nd",63]
[{"$nulls":4},36,"Gayle Jones","CASh N Bubbles",null,17.204000000000001,null,"4D 3rd",42]
[{"$nulls":4},37,"Tiffany Cox","C3Lacy",null,17.213999999999999]
[{"$nulls":4},38,"Lynn Whisenant","Hezawonderstreakin",null,17.242000000000001]
[{"$nulls":4},39,"Aryn Wilkerson","SpicyLitttleStar",null,17.321000000000002]
[{"$nulls":4},40,"Jennifer Abbott","Blazin Wagon",null,17.324000000000002]
[{"$nulls":4},41,"Reagan Jackson","Power TO The Moon",null,17.379000000000001]
[{"$nulls":4},42,"Chelsie Petty","Jade",null,17.452000000000002]
[{"$nulls":4},43,"Charlotte Edwards","VF Eye Of Tiger",null,17.565999999999999]
[{"$nulls":4},44,"Charlotte Edwards","TR Hibbie Chick",null,17.576000000000001]
[{"$nulls":4},45,"Kelly Allen","Miss JB 149",null,17.594000000000001]
[{"$nulls":4},46,"Dominique Henderson","Me Loves A Crowd",null,17.613]
[{"$nulls":4},47,"Sharin Hall","Fast Dashin Chick",null,17.725999999999999]
[{"$nulls":4},48,"Kelli Ann McPherson","Bar B Arabella Bug",null,17.744]
[{"$nulls":4},49,"Tiffany Durham","Luke",null,17.925999999999998]
[{"$nulls":4},50,"Tallaney Nilson","Alida",null,18.52]
[{"$nulls":4},51,"Kristi Smith","Frenchmans Playgun",null,19.625]
[{"$nulls":4},52,"Reagan Jackson","CPB Ryker",null,19.747]
[{"$nulls":4},53,"Pete Oen","Strait To Dallas",null,20.698]
[{"$nulls":4},54,"Jolene Montgomery","Promise Me A Jet",null,"nt"]
[{"$nulls":4},55,"Tiffany Durham","Rudy",null,"nt"]
[{"$nulls":4},56,"Kylena Hager","The Savoy Express",null,"nt"]
[{"$nulls":4},57,"Kaylee Gallino","JC Truly Bob",null,"nt15.772"]
[{"$nulls":4},58,"Shantell Hayes","Cougar",null,"nt16.042"]
[{"$nulls":4},59,"Annabelle Martin","DTF Making My Way",null,"nt16.095"]
[{"$nulls":4},60,"Molli Montgomery","Heavensfeelinspecial",null,"nt16.131"]
[{"$nulls":4},61,"Carissa Bryant","Flaming Money Buggy",null,"nt16.244"]
[{"$nulls":4},62,"Gayle Jones","LS Corona Winsalot",null,"nt16.256"]
[{"$nulls":4},63,"Jolene Montgomery","Smooth N Heavenly",null,"nt16.526"]
[{"$nulls":4},64,"Lauren Thomas","Dragons Fancy Pistol",null,"nt16.863"]
[{"$nulls":4},65,"Melissa Patterson","Blue",null,"nt16.930"]
[{"$nulls":4},66,"Kaylyn Smith","Classic Royal Star",null,"nt17.344"]
[{"$nulls":4},67,"Cierra Chapman","Lever Action",null,"nt17.884"]
[{"$nulls":4},68,"Joanna Kysar","Max",null,"nt18.407"]
[{"$nulls":4},69,"Courtney Millsap","Kat",null,"nt18.716"]
[{"$nulls":4},70,"Pete Oen","Fame TO The Max",null,"nt19.422",{"$f":"IF(OR(H71=5,H71=10, H71=15, H71=\"BP\",H71=\"SCR\"),\"NT\",I71)","v":"nt19.422"}]
[{"$nulls":4},71,{"$nulls":4},0]
[{"$nulls":4},72,{"$nulls":4},0]
[{"$nulls":4},73,{"$nulls":4},0]
[{"$nulls":4},74,{"$nulls":4},0]
[{"$nulls":4},75,{"$nulls":4},0]
[{"$nulls":4},76,{"$nulls":4},0]
[{"$nulls":4},77,{"$nulls":4},0]
[{"$nulls":4},78,{"$nulls":4},0]
[{"$nulls":4},79,{"$nulls":4},0]
[{"$nulls":4},80,{"$nulls":4},0]
[{"$nulls":4},81,{"$nulls":4},0]
[{"$nulls":4},82,{"$nulls":4},0]
[{"$nulls":4},83,{"$nulls":4},0]
[{"$nulls":4},84,{"$nulls":4},0]
[{"$nulls":4},85,{"$nulls":4},0]
[{"$nulls":4},86,{"$nulls":4},0]
[{"$nulls":4},87,{"$nulls":4},0]
[{"$nulls":4},88,{"$nulls":4},0]
[{"$nulls":4},89,{"$nulls":4},0]
[{"$nulls":4},90,{"$nulls":4},0]
[{"$nulls":4},91,{"$nulls":4},0]
[{"$nulls":4},92,{"$nulls":4},0]
[{"$nulls":4},93,{"$nulls":4},0]
[{"$nulls":4},94,{"$nulls":4},0]
[{"$nulls":4},95,{"$nulls":4},0]
[{"$nulls":4},96,{"$nulls":4},0]
[{"$nulls":4},97,{"$nulls":4},0]
[{"$nulls":4},98,{"$nulls":4},0]
[{"$nulls":4},99,{"$nulls":4},0]
[{"$nulls":4},100,{"$nulls":4},0]
[{"$nulls":4},101,{"$nulls":4},0]
[{"$nulls":4},102,{"$nulls":4},0]
[{"$nulls":4},103,{"$nulls":4},0]
[{"$nulls":4},104,{"$nulls":4},0]
[{"$nulls":4},105,{"$nulls":4},0]
[{"$nulls":4},106,{"$nulls":4},0]
[{"$nulls":4},107,{"$nulls":4},0]
[{"$nulls":4},108,{"$nulls":4},0]
[{"$nulls":4},109,{"$nulls":4},0]
[{"$nulls":4},110,{"$nulls":4},0]
[{"$nulls":4},111,{"$nulls":4},0]
[{"$nulls":4},112,{"$nulls":4},0]
[{"$nulls":4},113,{"$nulls":4},0]
[{"$nulls":4},114,{"$nulls":4},0]
[{"$nulls":4},115,{"$nulls":4},0]
[{"$nulls":4},116,{"$nulls":4},0]
[{"$nulls":4},117,{"$nulls":4},0]
[{"$nulls":4},118,{"$nulls":4},0]
[{"$nulls":4},119,{"$nulls":4},0]
[{"$nulls":4},120,{"$nulls":4},0]
[{"$nulls":4},121,{"$nulls":4},0]
[{"$nulls":4},122,{"$nulls":4},0]
[{"$nulls":4},123,{"$nulls":4},0]
[{"$nulls":4},124,{"$nulls":4},0]
[{"$nulls":4},125,{"$nulls":4},0]
[{"$nulls":4},126,{"$nulls":4},0]
[{"$nulls":4},127,{"$nulls":4},0]
[{"$nulls":4},128,{"$nulls":4},0]
[{"$nulls":4},129,{"$nulls":4},0]
[{"$nulls":4},130,{"$nulls":4},{"$f":"IF(OR(H131=5,H131=10, H131=15, H131=\"BP\",H131=\"SCR\"),\"NT\",I131)","v":0}]
[{"$nulls":4},131,{"$nulls":4},0]
[{"$nulls":4},132,{"$nulls":4},0]
[{"$nulls":4},133,{"$nulls":4},0]
[{"$nulls":4},134,{"$nulls":4},0]
[{"$nulls":4},135,{"$nulls":4},0]
[{"$nulls":4},136,{"$nulls":4},0]
[{"$nulls":4},137,{"$nulls":4},0]
[{"$nulls":4},138,{"$nulls":4},0]
[{"$nulls":4},139,{"$nulls":4},0]
[{"$nulls":4},140,{"$nulls":4},0]
[{"$nulls":4},141,{"$nulls":4},0]
[{"$nulls":4},142,{"$nulls":4},0]
[{"$nulls":4},143,{"$nulls":4},0]
[{"$nulls":4},144,{"$nulls":4},0]
[{"$nulls":4},145,{"$nulls":4},0]
[{"$nulls":4},146,{"$nulls":4},0]
[{"$nulls":4},147,{"$nulls":4},0]
[{"$nulls":4},148,{"$nulls":4},0]
[{"$nulls":4},149,{"$nulls":4},0]
[{"$nulls":4},150,{"$nulls":4},0]
[{"$nulls":4},151,{"$nulls":4},0]
[{"$nulls":4},152,{"$nulls":4},0]
[{"$nulls":4},153,{"$nulls":4},0]
[{"$nulls":4},154,{"$nulls":4},0]
[{"$nulls":4},155,{"$nulls":4},0]
[{"$nulls":4},156,{"$nulls":4},0]
[{"$nulls":4},157,{"$nulls":4},0]
[{"$nulls":4},158,{"$nulls":4},0]
[{"$nulls":4},159,{"$nulls":4},0]
[{"$nulls":4},160,{"$nulls":4},0]
[{"$nulls":4},161,{"$nulls":4},0]
[{"$nulls":4},162,{"$nulls":4},0]
[{"$nulls":4},163,{"$nulls":4},0]
[{"$nulls":4},164,{"$nulls":4},0]
[{"$nulls":4},165,{"$nulls":4},0]
[{"$nulls":4},166,{"$nulls":4},0]
[{"$nulls":4},167,{"$nulls":4},0]
[{"$nulls":4},168,{"$nulls":4},0]
[{"$nulls":4},169,{"$nulls":4},0]
[{"$nulls":4},170,{"$nulls":4},0]
[{"$nulls":4},171,{"$nulls":4},0]
[{"$nulls":4},172,{"$nulls":4},0]
[{"$nulls":4},173,{"$nulls":4},0]
[{"$nulls":4},174,{"$nulls":4},0]
[{"$nulls":4},175,{"$nulls":4},0]
[{"$nulls":4},176,{"$nulls":4},0]
[{"$nulls":4},177,{"$nulls":4},0]
[{"$nulls":4},178,{"$nulls":4},0]
[{"$nulls":4},179,{"$nulls":4},0]
[{"$nulls":4},180,{"$nulls":4},0]
[{"$nulls":4},181,{"$nulls":4},0]
[{"$nulls":4},182,{"$nulls":4},0]
[{"$nulls":4},183,{"$nulls":4},0]
[{"$nulls":4},184,{"$nulls":4},0]
[{"$nulls":4},185,{"$nulls":4},0]
[{"$nulls":4},186,{"$nulls":4},0]
[{"$nulls":4},187,{"$nulls":4},0]
[{"$nulls":4},188,{"$nulls":4},0]
[{"$nulls":4},189,{"$nulls":4},0]
[{"$nulls":4},190,{"$nulls":4},0]
[{"$nulls":4},191,{"$nulls":4},0]
[{"$nulls":4},192,{"$nulls":4},0]
[{"$nulls":4},193,{"$nulls":4},0]
[{"$nulls":4},194,{"$nulls":4},{"$f":"IF(OR(H195=5,H195=10, H195=15, H195=\"BP\",H195=\"SCR\"),\"NT\",I195)","v":0}]
[{"$nulls":4},195,{"$nulls":4},0]
[{"$nulls":4},196,{"$nulls":4},0]
[{"$nulls":4},197,{"$nulls":4},0]
[{"$nulls":4},198,{"$nulls":4},0]
[{"$nulls":4},199,{"$nulls":4},0]
[{"$nulls":4},200,{"$nulls":4},0]
[{"$nulls":4},201,{"$nulls":4},0]
[{"$nulls":4},202,{"$nulls":4},0]
[{"$nulls":4},203,{"$nulls":4},0]
[{"$nulls":4},204,{"$nulls":4},0]
[{"$nulls":4},205,{"$nulls":4},0]
[{"$nulls":4},206,{"$nulls":4},0]
[{"$nulls":4},207,{"$nulls":4},0]
[{"$nulls":4},208,{"$nulls":4},0]
[{"$nulls":4},209,{"$nulls":4},0]
[{"$nulls":4},210,{"$nulls":4},0]
[{"$nulls":4},211,{"$nulls":4},0]
[{"$nulls":4},212,{"$nulls":4},0]
[{"$nulls":4},213,{"$nulls":4},0]
[{"$nulls":4},214,{"$nulls":4},0]
[{"$nulls":4},215,{"$nulls":4},0]
[{"$nulls":4},216,{"$nulls":4},0]
[{"$nulls":4},217,{"$nulls":4},0]
[{"$nulls":4},218,{"$nulls":4},0]
[{"$nulls":4},219,{"$nulls":4},0]
[{"$nulls":4},220,{"$nulls":4},0]
[{"$nulls":4},221,{"$nulls":4},0]
[{"$nulls":4},222,{"$nulls":4},0]
[{"$nulls":4},223,{"$nulls":4},0]
[{"$nulls":4},224,{"$nulls":4},0]
[{"$nulls":4},225,{"$nulls":4},0]
[{"$nulls":4},226,{"$nulls":4},0]
[{"$nulls":4},227,{"$nulls":4},0]
[{"$nulls":4},228,{"$nulls":4},0]
[{"$nulls":4},229,{"$nulls":4},0]
[{"$nulls":4},230,{"$nulls":4},0]
[{"$nulls":4},231,{"$nulls":4},0]
[{"$nulls":4},232,{"$nulls":4},0]
[{"$nulls":4},233,{"$nulls":4},0]
[{"$nulls":4},234,{"$nulls":4},0]
[{"$nulls":4},235,{"$nulls":4},0]
[{"$nulls":4},236,{"$nulls":4},0]
[{"$nulls":4},237,{"$nulls":4},0]
[{"$nulls":4},238,{"$nulls":4},0]
[{"$nulls":4},239,{"$nulls":4},0]
[{"$nulls":4},240,{"$nulls":4},0]
[{"$nulls":4},241,{"$nulls":4},0]
[{"$nulls":4},242,{"$nulls":4},0]
[{"$nulls":4},243,{"$nulls":4},0]
[{"$nulls":4},244,{"$nulls":4},0]
[{"$nulls":4},245,{"$nulls":4},0]
[{"$nulls":4},246,{"$nulls":4},0]
[{"$nulls":4},247,{"$nulls":4},0]
[{"$nulls":4},248,{"$nulls":4},0]
[{"$nulls":4},249,{"$nulls":4},0]
[{"$nulls":4},250,{"$nulls":4},0]
[{"$nulls":4},251,{"$nulls":4},0]
[{"$nulls":4},252,{"$nulls":4},0]
[{"$nulls":4},253,{"$nulls":4},0]
[{"$nulls":4},254,{"$nulls":4},0]
[{"$nulls":4},255,{"$nulls":4},0]
[{"$nulls":4},256,{"$nulls":4},0]
[{"$nulls":4},257,{"$nulls":4},0]
[{"$nulls":4},258,{"$nulls":4},{"$f":"IF(OR(H259=5,H259=10, H259=15, H259=\"BP\",H259=\"SCR\"),\"NT\",I259)","v":0}]
[{"$nulls":4},259,{"$nulls":4},0]
[{"$nulls":4},260,{"$nulls":4},0]
[{"$nulls":4},261,{"$nulls":4},0]
[{"$nulls":4},262,{"$nulls":4},0]
[{"$nulls":4},263,{"$nulls":4},0]
[{"$nulls":4},264,{"$nulls":4},0]
[{"$nulls":4},265,{"$nulls":4},0]
[{"$nulls":4},266,{"$nulls":4},0]
[{"$nulls":4},267,{"$nulls":4},0]
[{"$nulls":4},268,{"$nulls":4},0]
[{"$nulls":4},269,{"$nulls":4},0]
[{"$nulls":4},270,{"$nulls":4},0]
[{"$nulls":4},271,{"$nulls":4},0]
[{"$nulls":4},272,{"$nulls":4},0]
[{"$nulls":4},273,{"$nulls":4},0]
[{"$nulls":4},274,{"$nulls":4},0]
[{"$nulls":4},275,{"$nulls":4},0]
[{"$nulls":4},276,{"$nulls":4},0]
[{"$nulls":4},277,{"$nulls":4},0]
[{"$nulls":4},278,{"$nulls":4},0]
[{"$nulls":4},279,{"$nulls":4},0]
[{"$nulls":4},280,{"$nulls":4},0]
[{"$nulls":4},281,{"$nulls":4},0]
[{"$nulls":4},282,{"$nulls":4},0]
[{"$nulls":4},283,{"$nulls":4},0]
[{"$nulls":4},284,{"$nulls":4},0]
[{"$nulls":4},285,{"$nulls":4},0]
[{"$nulls":4},286,{"$nulls":4},0]
[{"$nulls":4},287,{"$nulls":4},0]
[{"$nulls":4},288,{"$nulls":4},0]
[{"$nulls":4},289,{"$nulls":4},0]
[{"$nulls":4},290,{"$nulls":4},0]
[{"$nulls":4},291,{"$nulls":4},0]
[{"$nulls":4},292,{"$nulls":4},0]
[{"$nulls":4},293,{"$nulls":4},0]
[{"$nulls":4},294,{"$nulls":4},0]
[{"$nulls":4},295,{"$nulls":4},0]
[{"$nulls":4},296,{"$nulls":4},0]
[{"$nulls":4},297,{"$nulls":4},0]
[{"$nulls":4},298,{"$nulls":4},0]
[{"$nulls":4},299,{"$nulls":4},0]
[{"$nulls":4},300,{"$nulls":4},0]

{"sheet":"Youth","index":3,"n_rows":301,"n_cols":11,"rows_kept":301,"cut":false,"hidden":false,"merged":[]}
["Futurity","Der","Age Inct.","BBR","Draw","Rider Name","Horse Name","Pen","Time","Placing","Money Earned"]
[{"$nulls":4},1,"Emily Becker","MR Elegant Shawne",null,15.849,"1D 1st",130]
[{"$nulls":4},2,"Emma Smith","Double O Daryl",null,15.9,"1D 2nd",87]
[{"$nulls":4},3,"Shannon Jensen","Frenchmans Dashnista",null,15.932]
[{"$nulls":4},4,"Riley Cook",null,null,16.030999999999999]
[{"$nulls":4},5,"Kalli McCall","Dr Nicks Cash",null,16.140999999999998]
[{"$nulls":4},6,"Haley Hunt","Hoops",null,16.202000000000002]
[{"$nulls":4},7,"Rhese Brough","Wildcard Money",null,16.221]
[{"$nulls":4},8,"Faith Ross","Cash",null,16.245000000000001]
[{"$nulls":4},9,"Josie Hartmann","TR Illumniater Cash",null,16.289000000000001]
[{"$nulls":4},10,"Kalli McCall","Showdown San Man",null,16.466999999999999,"2D 1st",112]
[{"$nulls":4},11,"Emma Smith","Pocket Fulla Pozzi",null,16.545000000000002,"2D 2nd",74]
[{"$nulls":4},12,"Josie Hartmann","Hes Honor",null,16.559999999999999]
[{"$nulls":4},13,"Stormi Branch","Demon",null,16.565000000000001]
[{"$nulls":4},14,"Alex Stokes","Mo Sugar Bars Bee",null,16.582000000000001]
[{"$nulls":4},15,"Shannon Jensen","Frenchmans Lajolla",null,16.850000000000001,"3D 1st",74]
[{"$nulls":4},16,"Bradie Bacon","Millie",null,16.925000000000001,"3D 2nd",50]
[{"$nulls":4},17,"Corlee Massey","Easy",null,17.076000000000001]
[{"$nulls":4},18,"Bella Skinner","Shorty",null,17.081]
[{"$nulls":4},19,"Jolie Smith","Docs Lil Leo",null,17.256]
[{"$nulls":4},20,"Kalli McCall","All That Blizz",null,17.658000000000001,"4D 1st",56]
[{"$nulls":4},21,"Alex Stokes","View This Lady Rose",null,17.841999999999999,"4D 2nd",37]
[{"$nulls":4},22,"Cara Crider","Diesel",null,18.420000000000002]
[{"$nulls":4},23,"Cienna Jacobson","Pixie",null,18.516999999999999]
[{"$nulls":4},24,"Walter Wolfe","Texas",null,18.684000000000001]
[{"$nulls":4},25,"Mekenna Davis","Dreamin N French",null,"nt15.680"]
[{"$nulls":4},26,"Brynn Owens","StrawflyintheGold",null,"nt16.165"]
[{"$nulls":4},27,"Shannon Jensen","Flits French Blondie",null,"nt16.294"]
[{"$nulls":4},28,"Makynna Baldwin","TE Prissy",null,"nt17.080"]
[{"$nulls":4},29,"Brooke Hickey","Shaggy",null,"nt17.081"]
[{"$nulls":4},30,"Makynna Baldwin","Norfleets Valley Girl",null,"nt17.739"]
[{"$nulls":4},31,"Reece Cook","Frost ",null,"nt17.983"]
[{"$nulls":4},32]
[{"$nulls":4},33]
[{"$nulls":4},34]
[{"$nulls":4},35]
[{"$nulls":4},36]
[{"$nulls":4},37]
[{"$nulls":4},38]
[{"$nulls":4},39]
[{"$nulls":4},40]
[{"$nulls":4},41]
[{"$nulls":4},42]
[{"$nulls":4},43]
[{"$nulls":4},44]
[{"$nulls":4},45]
[{"$nulls":4},46]
[{"$nulls":4},47]
[{"$nulls":4},48]
[{"$nulls":4},49]
[{"$nulls":4},50]
[{"$nulls":4},51]
[{"$nulls":4},52]
[{"$nulls":4},53]
[{"$nulls":4},54]
[{"$nulls":4},55]
[{"$nulls":4},56]
[{"$nulls":4},57]
[{"$nulls":4},58]
[{"$nulls":4},59]
[{"$nulls":4},60]
[{"$nulls":4},61]
[{"$nulls":4},62]
[{"$nulls":4},63]
[{"$nulls":4},64]
[{"$nulls":4},65]
[{"$nulls":4},66]
[{"$nulls":4},67]
[{"$nulls":4},68]
[{"$nulls":4},69]
[{"$nulls":4},70]
[{"$nulls":4},71]
[{"$nulls":4},72]
[{"$nulls":4},73]
[{"$nulls":4},74]
[{"$nulls":4},75]
[{"$nulls":4},76]
[{"$nulls":4},77]
[{"$nulls":4},78]
[{"$nulls":4},79]
[{"$nulls":4},80]
[{"$nulls":4},81]
[{"$nulls":4},82]
[{"$nulls":4},83]
[{"$nulls":4},84]
[{"$nulls":4},85]
[{"$nulls":4},86]
[{"$nulls":4},87]
[{"$nulls":4},88]
[{"$nulls":4},89]
[{"$nulls":4},90]
[{"$nulls":4},91]
[{"$nulls":4},92]
[{"$nulls":4},93]
[{"$nulls":4},94]
[{"$nulls":4},95]
[{"$nulls":4},96]
[{"$nulls":4},97]
[{"$nulls":4},98]
[{"$nulls":4},99]
[{"$nulls":4},100]
[{"$nulls":4},101]
[{"$nulls":4},102]
[{"$nulls":4},103]
[{"$nulls":4},104]
[{"$nulls":4},105]
[{"$nulls":4},106]
[{"$nulls":4},107]
[{"$nulls":4},108]
[{"$nulls":4},109]
[{"$nulls":4},110]
[{"$nulls":4},111]
[{"$nulls":4},112]
[{"$nulls":4},113]
[{"$nulls":4},114]
[{"$nulls":4},115]
[{"$nulls":4},116]
[{"$nulls":4},117]
[{"$nulls":4},118]
[{"$nulls":4},119]
[{"$nulls":4},120]
[{"$nulls":4},121]
[{"$nulls":4},122]
[{"$nulls":4},123]
[{"$nulls":4},124]
[{"$nulls":4},125]
[{"$nulls":4},126]
[{"$nulls":4},127]
[{"$nulls":4},128]
[{"$nulls":4},129]
[{"$nulls":4},130]
[{"$nulls":4},131]
[{"$nulls":4},132]
[{"$nulls":4},133]
[{"$nulls":4},134]
[{"$nulls":4},135]
[{"$nulls":4},136]
[{"$nulls":4},137]
[{"$nulls":4},138]
[{"$nulls":4},139]
[{"$nulls":4},140]
[{"$nulls":4},141]
[{"$nulls":4},142]
[{"$nulls":4},143]
[{"$nulls":4},144]
[{"$nulls":4},145]
[{"$nulls":4},146]
[{"$nulls":4},147]
[{"$nulls":4},148]
[{"$nulls":4},149]
[{"$nulls":4},150]
[{"$nulls":4},151]
[{"$nulls":4},152]
[{"$nulls":4},153]
[{"$nulls":4},154]
[{"$nulls":4},155]
[{"$nulls":4},156]
[{"$nulls":4},157]
[{"$nulls":4},158]
[{"$nulls":4},159]
[{"$nulls":4},160]
[{"$nulls":4},161]
[{"$nulls":4},162]
[{"$nulls":4},163]
[{"$nulls":4},164]
[{"$nulls":4},165]
[{"$nulls":4},166]
[{"$nulls":4},167]
[{"$nulls":4},168]
[{"$nulls":4},169]
[{"$nulls":4},170]
[{"$nulls":4},171]
[{"$nulls":4},172]
[{"$nulls":4},173]
[{"$nulls":4},174]
[{"$nulls":4},175]
[{"$nulls":4},176]
[{"$nulls":4},177]
[{"$nulls":4},178]
[{"$nulls":4},179]
[{"$nulls":4},180]
[{"$nulls":4},181]
[{"$nulls":4},182]
[{"$nulls":4},183]
[{"$nulls":4},184]
[{"$nulls":4},185]
[{"$nulls":4},186]
[{"$nulls":4},187]
[{"$nulls":4},188]
[{"$nulls":4},189]
[{"$nulls":4},190]
[{"$nulls":4},191]
[{"$nulls":4},192]
[{"$nulls":4},193]
[{"$nulls":4},194]
[{"$nulls":4},195]
[{"$nulls":4},196]
[{"$nulls":4},197]
[{"$nulls":4},198]
[{"$nulls":4},199]
[{"$nulls":4},200]
[{"$nulls":4},201]
[{"$nulls":4},202]
[{"$nulls":4},203]
[{"$nulls":4},204]
[{"$nulls":4},205]
[{"$nulls":4},206]
[{"$nulls":4},207]
[{"$nulls":4},208]
[{"$nulls":4},209]
[{"$nulls":4},210]
[{"$nulls":4},211]
[{"$nulls":4},212]
[{"$nulls":4},213]
[{"$nulls":4},214]
[{"$nulls":4},215]
[{"$nulls":4},216]
[{"$nulls":4},217]
[{"$nulls":4},218]
[{"$nulls":4},219]
[{"$nulls":4},220]
[{"$nulls":4},221]
[{"$nulls":4},222]
[{"$nulls":4},223]
[{"$nulls":4},224]
[{"$nulls":4},225]
[{"$nulls":4},226]
[{"$nulls":4},227]
[{"$nulls":4},228]
[{"$nulls":4},229]
[{"$nulls":4},230]
[{"$nulls":4},231]
[{"$nulls":4},232]
[{"$nulls":4},233]
[{"$nulls":4},234]
[{"$nulls":4},235]
[{"$nulls":4},236]
[{"$nulls":4},237]
[{"$nulls":4},238]
[{"$nulls":4},239]
[{"$nulls":4},240]
[{"$nulls":4},241]
[{"$nulls":4},242]
[{"$nulls":4},243]
[{"$nulls":4},244]
[{"$nulls":4},245]
[{"$nulls":4},246]
[{"$nulls":4},247]
[{"$nulls":4},248]
[{"$nulls":4},249]
[{"$nulls":4},250]
[{"$nulls":4},251]
[{"$nulls":4},252]
[{"$nulls":4},253]
[{"$nulls":4},254]
[{"$nulls":4},255]
[{"$nulls":4},256]
[{"$nulls":4},257]
[{"$nulls":4},258]
[{"$nulls":4},259]
[{"$nulls":4},260]
[{"$nulls":4},261]
[{"$nulls":4},262]
[{"$nulls":4},263]
[{"$nulls":4},264]
[{"$nulls":4},265]
[{"$nulls":4},266]
[{"$nulls":4},267]
[{"$nulls":4},268]
[{"$nulls":4},269]
[{"$nulls":4},270]
[{"$nulls":4},271]
[{"$nulls":4},272]
[{"$nulls":4},273]
[{"$nulls":4},274]
[{"$nulls":4},275]
[{"$nulls":4},276]
[{"$nulls":4},277]
[{"$nulls":4},278]
[{"$nulls":4},279]
[{"$nulls":4},280]
[{"$nulls":4},281]
[{"$nulls":4},282]
[{"$nulls":4},283]
[{"$nulls":4},284]
[{"$nulls":4},285]
[{"$nulls":4},286]
[{"$nulls":4},287]
[{"$nulls":4},288]
[{"$nulls":4},289]
[{"$nulls":4},290]
[{"$nulls":4},291]
[{"$nulls":4},292]
[{"$nulls":4},293]
[{"$nulls":4},294]
[{"$nulls":4},295]
[{"$nulls":4},296]
[{"$nulls":4},297]
[{"$nulls":4},298]
[{"$nulls":4},299]
[{"$nulls":4},300]

{"sheet":"Derby","index":4,"n_rows":301,"n_cols":12,"rows_kept":301,"cut":false,"hidden":false,"merged":[]}
["Futurity","Der","Age Inct.","BBR","Draw","Rider Name","Horse Name","c/o","Time","Final Time","Placing","Money Earned"]
[{"$nulls":4},1,"Stephanie Fryar","The Red Maserati",null,15.667999999999999,null,"1st",190]
[{"$nulls":4},2,"Wenda Johnson","Macgyver Moonflash",null,15.704000000000001,null,"2nd",114]
[{"$nulls":4},3,"Emily Becker","MR Elegant Shawne",null,15.849,null,"3rd",76]
[{"$nulls":4},4,"Shannon Jensen","Frenchmans Dashnista",null,15.932]
[{"$nulls":4},5,"Joy Wargo","Run Leo Run",null,16.193999999999999]
[{"$nulls":4},6,"Cassidy Rabb","VF Temptations",null,16.506]
[{"$nulls":4},7,"Haley Bowen","Sadies Superman",null,16.710999999999999]
[{"$nulls":4},8,"Cassidy Rabb","VF Coup Fulla Coins",null,16.811]
[{"$nulls":4},9,"Ashley Martinkus","Jane",null,16.920999999999999]
[{"$nulls":4},10,"Ashley Martinkus","Famous First Flight",null,17.295999999999999]
[{"$nulls":4},11,"Hanna Forbes","Ivory Candy",null,17.443000000000001]
[{"$nulls":4},12,"Jolene Montgomery","Promise Me A Jet",null,"nt"]
[{"$nulls":4},13,"Cierra Chapman","Impackinfrenchpistol",null,"nt"]
[{"$nulls":4},14,"Mekenna Davis","Dreamin N French",null,"nt15.680"]
[{"$nulls":4},15,"Cheyenne Wimberly","Royal Blue Fame",null,"nt15.701"]
[{"$nulls":4},16,"SheaLynn Leach","Louie Bug",null,"nt16.067"]
[{"$nulls":4},17,"Kassie Mowry","LLP Silent Prayer",null,"nt16.160",{"$f":"IF(OR(H18=5,H18=10, H18=15, H18=\"BP\",H18=\"SCR\"),\"NT\",I18)","v":"nt16.160"}]
[{"$nulls":4},18,"Shannon Jensen","Flits French Blondie",null,"nt16.294","nt16.294"]
[{"$nulls":4},19,"Cheyenne Wimberly","Famous Willow",null,"nt16.322","nt16.322"]
[{"$nulls":4},20,{"$nulls":4},0]
[{"$nulls":4},21,{"$nulls":4},0]
[{"$nulls":4},22,{"$nulls":4},0]
[{"$nulls":4},23,{"$nulls":4},0]
[{"$nulls":4},24,{"$nulls":4},0]
[{"$nulls":4},25,{"$nulls":4},0]
[{"$nulls":4},26,{"$nulls":4},0]
[{"$nulls":4},27,{"$nulls":4},0]
[{"$nulls":4},28,{"$nulls":4},0]
[{"$nulls":4},29,{"$nulls":4},0]
[{"$nulls":4},30,{"$nulls":4},0]
[{"$nulls":4},31,{"$nulls":4},0]
[{"$nulls":4},32,{"$nulls":4},0]
[{"$nulls":4},33,{"$nulls":4},0]
[{"$nulls":4},34,{"$nulls":4},0]
[{"$nulls":4},35,{"$nulls":4},0]
[{"$nulls":4},36,{"$nulls":4},0]
[{"$nulls":4},37,{"$nulls":4},0]
[{"$nulls":4},38,{"$nulls":4},0]
[{"$nulls":4},39,{"$nulls":4},0]
[{"$nulls":4},40,{"$nulls":4},0]
[{"$nulls":4},41,{"$nulls":4},0]
[{"$nulls":4},42,{"$nulls":4},0]
[{"$nulls":4},43,{"$nulls":4},0]
[{"$nulls":4},44,{"$nulls":4},0]
[{"$nulls":4},45,{"$nulls":4},0]
[{"$nulls":4},46,{"$nulls":4},0]
[{"$nulls":4},47,{"$nulls":4},0]
[{"$nulls":4},48,{"$nulls":4},0]
[{"$nulls":4},49,{"$nulls":4},0]
[{"$nulls":4},50,{"$nulls":4},0]
[{"$nulls":4},51,{"$nulls":4},0]
[{"$nulls":4},52,{"$nulls":4},0]
[{"$nulls":4},53,{"$nulls":4},0]
[{"$nulls":4},54,{"$nulls":4},0]
[{"$nulls":4},55,{"$nulls":4},0]
[{"$nulls":4},56,{"$nulls":4},0]
[{"$nulls":4},57,{"$nulls":4},0]
[{"$nulls":4},58,{"$nulls":4},0]
[{"$nulls":4},59,{"$nulls":4},0]
[{"$nulls":4},60,{"$nulls":4},0]
[{"$nulls":4},61,{"$nulls":4},0]
[{"$nulls":4},62,{"$nulls":4},0]
[{"$nulls":4},63,{"$nulls":4},0]
[{"$nulls":4},64,{"$nulls":4},0]
[{"$nulls":4},65,{"$nulls":4},0]
[{"$nulls":4},66,{"$nulls":4},0]
[{"$nulls":4},67,{"$nulls":4},0]
[{"$nulls":4},68,{"$nulls":4},0]
[{"$nulls":4},69,{"$nulls":4},0]
[{"$nulls":4},70,{"$nulls":4},0]
[{"$nulls":4},71,{"$nulls":4},0]
[{"$nulls":4},72,{"$nulls":4},0]
[{"$nulls":4},73,{"$nulls":4},0]
[{"$nulls":4},74,{"$nulls":4},0]
[{"$nulls":4},75,{"$nulls":4},0]
[{"$nulls":4},76,{"$nulls":4},0]
[{"$nulls":4},77,{"$nulls":4},0]
[{"$nulls":4},78,{"$nulls":4},0]
[{"$nulls":4},79,{"$nulls":4},0]
[{"$nulls":4},80,{"$nulls":4},0]
[{"$nulls":4},81,{"$nulls":4},{"$f":"IF(OR(H82=5,H82=10, H82=15, H82=\"BP\",H82=\"SCR\"),\"NT\",I82)","v":0}]
[{"$nulls":4},82,{"$nulls":4},0]
[{"$nulls":4},83,{"$nulls":4},0]
[{"$nulls":4},84,{"$nulls":4},0]
[{"$nulls":4},85,{"$nulls":4},0]
[{"$nulls":4},86,{"$nulls":4},0]
[{"$nulls":4},87,{"$nulls":4},0]
[{"$nulls":4},88,{"$nulls":4},0]
[{"$nulls":4},89,{"$nulls":4},0]
[{"$nulls":4},90,{"$nulls":4},0]
[{"$nulls":4},91,{"$nulls":4},0]
[{"$nulls":4},92,{"$nulls":4},0]
[{"$nulls":4},93,{"$nulls":4},0]
[{"$nulls":4},94,{"$nulls":4},0]
[{"$nulls":4},95,{"$nulls":4},0]
[{"$nulls":4},96,{"$nulls":4},0]
[{"$nulls":4},97,{"$nulls":4},0]
[{"$nulls":4},98,{"$nulls":4},0]
[{"$nulls":4},99,{"$nulls":4},0]
[{"$nulls":4},100,{"$nulls":4},0]
[{"$nulls":4},101,{"$nulls":4},0]
[{"$nulls":4},102,{"$nulls":4},0]
[{"$nulls":4},103,{"$nulls":4},0]
[{"$nulls":4},104,{"$nulls":4},0]
[{"$nulls":4},105,{"$nulls":4},0]
[{"$nulls":4},106,{"$nulls":4},0]
[{"$nulls":4},107,{"$nulls":4},0]
[{"$nulls":4},108,{"$nulls":4},0]
[{"$nulls":4},109,{"$nulls":4},0]
[{"$nulls":4},110,{"$nulls":4},0]
[{"$nulls":4},111,{"$nulls":4},0]
[{"$nulls":4},112,{"$nulls":4},0]
[{"$nulls":4},113,{"$nulls":4},0]
[{"$nulls":4},114,{"$nulls":4},0]
[{"$nulls":4},115,{"$nulls":4},0]
[{"$nulls":4},116,{"$nulls":4},0]
[{"$nulls":4},117,{"$nulls":4},0]
[{"$nulls":4},118,{"$nulls":4},0]
[{"$nulls":4},119,{"$nulls":4},0]
[{"$nulls":4},120,{"$nulls":4},0]
[{"$nulls":4},121,{"$nulls":4},0]
[{"$nulls":4},122,{"$nulls":4},0]
[{"$nulls":4},123,{"$nulls":4},0]
[{"$nulls":4},124,{"$nulls":4},0]
[{"$nulls":4},125,{"$nulls":4},0]
[{"$nulls":4},126,{"$nulls":4},0]
[{"$nulls":4},127,{"$nulls":4},0]
[{"$nulls":4},128,{"$nulls":4},0]
[{"$nulls":4},129,{"$nulls":4},0]
[{"$nulls":4},130,{"$nulls":4},0]
[{"$nulls":4},131,{"$nulls":4},0]
[{"$nulls":4},132,{"$nulls":4},0]
[{"$nulls":4},133,{"$nulls":4},0]
[{"$nulls":4},134,{"$nulls":4},0]
[{"$nulls":4},135,{"$nulls":4},0]
[{"$nulls":4},136,{"$nulls":4},0]
[{"$nulls":4},137,{"$nulls":4},0]
[{"$nulls":4},138,{"$nulls":4},0]
[{"$nulls":4},139,{"$nulls":4},0]
[{"$nulls":4},140,{"$nulls":4},0]
[{"$nulls":4},141,{"$nulls":4},0]
[{"$nulls":4},142,{"$nulls":4},0]
[{"$nulls":4},143,{"$nulls":4},0]
[{"$nulls":4},144,{"$nulls":4},0]
[{"$nulls":4},145,{"$nulls":4},{"$f":"IF(OR(H146=5,H146=10, H146=15, H146=\"BP\",H146=\"SCR\"),\"NT\",I146)","v":0}]
[{"$nulls":4},146,{"$nulls":4},0]
[{"$nulls":4},147,{"$nulls":4},0]
[{"$nulls":4},148,{"$nulls":4},0]
[{"$nulls":4},149,{"$nulls":4},0]
[{"$nulls":4},150,{"$nulls":4},0]
[{"$nulls":4},151,{"$nulls":4},0]
[{"$nulls":4},152,{"$nulls":4},0]
[{"$nulls":4},153,{"$nulls":4},0]
[{"$nulls":4},154,{"$nulls":4},0]
[{"$nulls":4},155,{"$nulls":4},0]
[{"$nulls":4},156,{"$nulls":4},0]
[{"$nulls":4},157,{"$nulls":4},0]
[{"$nulls":4},158,{"$nulls":4},0]
[{"$nulls":4},159,{"$nulls":4},0]
[{"$nulls":4},160,{"$nulls":4},0]
[{"$nulls":4},161,{"$nulls":4},0]
[{"$nulls":4},162,{"$nulls":4},0]
[{"$nulls":4},163,{"$nulls":4},0]
[{"$nulls":4},164,{"$nulls":4},0]
[{"$nulls":4},165,{"$nulls":4},0]
[{"$nulls":4},166,{"$nulls":4},0]
[{"$nulls":4},167,{"$nulls":4},0]
[{"$nulls":4},168,{"$nulls":4},0]
[{"$nulls":4},169,{"$nulls":4},0]
[{"$nulls":4},170,{"$nulls":4},0]
[{"$nulls":4},171,{"$nulls":4},0]
[{"$nulls":4},172,{"$nulls":4},0]
[{"$nulls":4},173,{"$nulls":4},0]
[{"$nulls":4},174,{"$nulls":4},0]
[{"$nulls":4},175,{"$nulls":4},0]
[{"$nulls":4},176,{"$nulls":4},0]
[{"$nulls":4},177,{"$nulls":4},0]
[{"$nulls":4},178,{"$nulls":4},0]
[{"$nulls":4},179,{"$nulls":4},0]
[{"$nulls":4},180,{"$nulls":4},0]
[{"$nulls":4},181,{"$nulls":4},0]
[{"$nulls":4},182,{"$nulls":4},0]
[{"$nulls":4},183,{"$nulls":4},0]
[{"$nulls":4},184,{"$nulls":4},0]
[{"$nulls":4},185,{"$nulls":4},0]
[{"$nulls":4},186,{"$nulls":4},0]
[{"$nulls":4},187,{"$nulls":4},0]
[{"$nulls":4},188,{"$nulls":4},0]
[{"$nulls":4},189,{"$nulls":4},0]
[{"$nulls":4},190,{"$nulls":4},0]
[{"$nulls":4},191,{"$nulls":4},0]
[{"$nulls":4},192,{"$nulls":4},0]
[{"$nulls":4},193,{"$nulls":4},0]
[{"$nulls":4},194,{"$nulls":4},0]
[{"$nulls":4},195,{"$nulls":4},0]
[{"$nulls":4},196,{"$nulls":4},0]
[{"$nulls":4},197,{"$nulls":4},0]
[{"$nulls":4},198,{"$nulls":4},0]
[{"$nulls":4},199,{"$nulls":4},0]
[{"$nulls":4},200,{"$nulls":4},0]
[{"$nulls":4},201,{"$nulls":4},0]
[{"$nulls":4},202,{"$nulls":4},0]
[{"$nulls":4},203,{"$nulls":4},0]
[{"$nulls":4},204,{"$nulls":4},0]
[{"$nulls":4},205,{"$nulls":4},0]
[{"$nulls":4},206,{"$nulls":4},0]
[{"$nulls":4},207,{"$nulls":4},0]
[{"$nulls":4},208,{"$nulls":4},0]
[{"$nulls":4},209,{"$nulls":4},{"$f":"IF(OR(H210=5,H210=10, H210=15, H210=\"BP\",H210=\"SCR\"),\"NT\",I210)","v":0}]
[{"$nulls":4},210,{"$nulls":4},0]
[{"$nulls":4},211,{"$nulls":4},0]
[{"$nulls":4},212,{"$nulls":4},0]
[{"$nulls":4},213,{"$nulls":4},0]
[{"$nulls":4},214,{"$nulls":4},0]
[{"$nulls":4},215,{"$nulls":4},0]
[{"$nulls":4},216,{"$nulls":4},0]
[{"$nulls":4},217,{"$nulls":4},0]
[{"$nulls":4},218,{"$nulls":4},0]
[{"$nulls":4},219,{"$nulls":4},0]
[{"$nulls":4},220,{"$nulls":4},0]
[{"$nulls":4},221,{"$nulls":4},0]
[{"$nulls":4},222,{"$nulls":4},0]
[{"$nulls":4},223,{"$nulls":4},0]
[{"$nulls":4},224,{"$nulls":4},0]
[{"$nulls":4},225,{"$nulls":4},0]
[{"$nulls":4},226,{"$nulls":4},0]
[{"$nulls":4},227,{"$nulls":4},0]
[{"$nulls":4},228,{"$nulls":4},0]
[{"$nulls":4},229,{"$nulls":4},0]
[{"$nulls":4},230,{"$nulls":4},0]
[{"$nulls":4},231,{"$nulls":4},0]
[{"$nulls":4},232,{"$nulls":4},0]
[{"$nulls":4},233,{"$nulls":4},0]
[{"$nulls":4},234,{"$nulls":4},0]
[{"$nulls":4},235,{"$nulls":4},0]
[{"$nulls":4},236,{"$nulls":4},0]
[{"$nulls":4},237,{"$nulls":4},0]
[{"$nulls":4},238,{"$nulls":4},0]
[{"$nulls":4},239,{"$nulls":4},0]
[{"$nulls":4},240,{"$nulls":4},0]
[{"$nulls":4},241,{"$nulls":4},0]
[{"$nulls":4},242,{"$nulls":4},0]
[{"$nulls":4},243,{"$nulls":4},0]
[{"$nulls":4},244,{"$nulls":4},0]
[{"$nulls":4},245,{"$nulls":4},0]
[{"$nulls":4},246,{"$nulls":4},0]
[{"$nulls":4},247,{"$nulls":4},0]
[{"$nulls":4},248,{"$nulls":4},0]
[{"$nulls":4},249,{"$nulls":4},0]
[{"$nulls":4},250,{"$nulls":4},0]
[{"$nulls":4},251,{"$nulls":4},0]
[{"$nulls":4},252,{"$nulls":4},0]
[{"$nulls":4},253,{"$nulls":4},0]
[{"$nulls":4},254,{"$nulls":4},0]
[{"$nulls":4},255,{"$nulls":4},0]
[{"$nulls":4},256,{"$nulls":4},0]
[{"$nulls":4},257,{"$nulls":4},0]
[{"$nulls":4},258,{"$nulls":4},0]
[{"$nulls":4},259,{"$nulls":4},0]
[{"$nulls":4},260,{"$nulls":4},0]
[{"$nulls":4},261,{"$nulls":4},0]
[{"$nulls":4},262,{"$nulls":4},0]
[{"$nulls":4},263,{"$nulls":4},0]
[{"$nulls":4},264,{"$nulls":4},0]
[{"$nulls":4},265,{"$nulls":4},0]
[{"$nulls":4},266,{"$nulls":4},0]
[{"$nulls":4},267,{"$nulls":4},0]
[{"$nulls":4},268,{"$nulls":4},0]
[{"$nulls":4},269,{"$nulls":4},0]
[{"$nulls":4},270,{"$nulls":4},0]
[{"$nulls":4},271,{"$nulls":4},0]
[{"$nulls":4},272,{"$nulls":4},0]
[{"$nulls":4},273,{"$nulls":4},{"$f":"IF(OR(H274=5,H274=10, H274=15, H274=\"BP\",H274=\"SCR\"),\"NT\",I274)","v":0}]
[{"$nulls":4},274,{"$nulls":4},0]
[{"$nulls":4},275,{"$nulls":4},0]
[{"$nulls":4},276,{"$nulls":4},0]
[{"$nulls":4},277,{"$nulls":4},0]
[{"$nulls":4},278,{"$nulls":4},0]
[{"$nulls":4},279,{"$nulls":4},0]
[{"$nulls":4},280,{"$nulls":4},0]
[{"$nulls":4},281,{"$nulls":4},0]
[{"$nulls":4},282,{"$nulls":4},0]
[{"$nulls":4},283,{"$nulls":4},0]
[{"$nulls":4},284,{"$nulls":4},0]
[{"$nulls":4},285,{"$nulls":4},0]
[{"$nulls":4},286,{"$nulls":4},0]
[{"$nulls":4},287,{"$nulls":4},0]
[{"$nulls":4},288,{"$nulls":4},0]
[{"$nulls":4},289,{"$nulls":4},0]
[{"$nulls":4},290,{"$nulls":4},0]
[{"$nulls":4},291,{"$nulls":4},0]
[{"$nulls":4},292,{"$nulls":4},0]
[{"$nulls":4},293,{"$nulls":4},0]
[{"$nulls":4},294,{"$nulls":4},0]
[{"$nulls":4},295,{"$nulls":4},0]
[{"$nulls":4},296,{"$nulls":4},0]
[{"$nulls":4},297,{"$nulls":4},0]
[{"$nulls":4},298,{"$nulls":4},0]
[{"$nulls":4},299,{"$nulls":4},0]
[{"$nulls":4},300,{"$nulls":4},0]

{"sheet":"Revolution","index":5,"n_rows":301,"n_cols":12,"rows_kept":301,"cut":false,"hidden":false,"merged":[]}
["Futurity","Der","Age Inct.","BBR","Draw","Rider Name","Horse Name","c/o","Time","Final Time","Placing","Money Earned"]
[{"$nulls":4},1,"Kassie Mowry","Famous Ladies Man",null,15.815,null,"1D 1st"]
[{"$nulls":4},2,"Emily Becker","MR Elegant Shawne",null,15.849]
[{"$nulls":4},3,"Kassie Mowry","CP He Will Be Epic",null,15.938000000000001]
[{"$nulls":4},4,"Kassie Mowry","Epic Guy",null,15.942]
[{"$nulls":4},5,"Lisa Wernli","Flashs Fine Effort",null,16.004999999999999]
[{"$nulls":4},6,"Riley Cook",null,null,16.030999999999999]
[{"$nulls":4},7,"Teresa McClendon","Striking Poses",null,16.106000000000002]
[{"$nulls":4},8,"Chancie Rogers","One Third Sugar",null,16.141999999999999]
[{"$nulls":4},9,"Haley Hunt","Hoops",null,16.202000000000002]
[{"$nulls":4},10,"Jamie Wilson","Check Your Bet",null,16.221]
[{"$nulls":4},11,"Josie Hartmann","TR Illumniater Cash",null,16.289000000000001]
[{"$nulls":4},12,"Terry Vogel","BB Boogyingfrenchman",null,16.492999999999999,null,"2D 1st"]
[{"$nulls":4},13,"Josie Hartmann","Hes Honor",null,16.559999999999999]
[{"$nulls":4},14,"Stormi Branch","Demon",null,16.565000000000001]
[{"$nulls":4},15,"Debbie Bloxom","Bad Firing Rising",null,16.597000000000001]
[{"$nulls":4},16,"Kyann Hartmann","SS Dreamin of Roses",null,16.713000000000001]
[{"$nulls":4},17,"Bradie Bacon","Millie",null,16.925000000000001,null,"3D 1st"]
[{"$nulls":4},18,"Nicole Buell","Dirty Money",null,16.937999999999999]
[{"$nulls":4},19,"Pattie Mackie","Flitter Fuel Lad",null,16.937999999999999]
[{"$nulls":4},20,"Shantell Hayes","Pixie",null,16.952000000000002]
[{"$nulls":4},21,"Curtis Watson","Peppy Fire Frost",null,17.053999999999998]
[{"$nulls":4},22,"Lisa Wernli","PROUDTOBEFRENCH",null,17.074000000000002]
[{"$nulls":4},23,"Tracy Henderson","Heza Stray Cat",null,17.076000000000001]
[{"$nulls":4},24,"Bella Skinner","Shorty",null,17.081]
[{"$nulls":4},25,"Marlyn Bland","CD Quick Key Dash",null,17.081]
[{"$nulls":4},26,"Carey Benton","Prime Thriftshop",null,17.11]
[{"$nulls":4},27,"Myndi Muncy","Streakin Sox",null,17.170000000000002]
[{"$nulls":4},28,"Tiffany Cox","C3Lacy",null,17.213999999999999]
[{"$nulls":4},29,"Aryn Wilkerson","SpicyLitttleStar",null,17.321000000000002,null,"4D 1st"]
[{"$nulls":4},30,"Terry Vogel","Imablueyedblondbitz",null,17.463999999999999]
[{"$nulls":4},31,"Alley Harris","Princess",null,17.681999999999999]
[{"$nulls":4},32,"Sharin Hall","Fast Dashin Chick",null,17.725000000000001]
[{"$nulls":4},33,"Becky Dockery","Faithman",null,17.873000000000001]
[{"$nulls":4},34,"Jennifer Abbott","Wendall Jackson",null,"16.735S"]
[{"$nulls":4},35,"Molli Montgomery","Heavensfeelinspecial",null,"nt16.131"]
[{"$nulls":4},36,"Carissa Bryant","Flaming Money Buggy",null,"nt16.244"]
[{"$nulls":4},37,"Sharin Hall","Rare Packin Six",null,"nt16.560"]
[{"$nulls":4},38,"Debbie Bloxom","KN Born This Way",null,"nt16.578"]
[{"$nulls":4},39,"Kathy Muehlen","Fly Away Gal",null,"nt16.659"]
[{"$nulls":4},40,"Makynna Baldwin","TE Prissy",null,"nt17.080"]
[{"$nulls":4},41,"Makynna Baldwin","Norfleets Valley Girl",null,"nt17.739"]
[{"$nulls":4},42]
[{"$nulls":4},43]
[{"$nulls":4},44]
[{"$nulls":4},45]
[{"$nulls":4},46]
[{"$nulls":4},47]
[{"$nulls":4},48,{"$nulls":4},{"$f":"IF(OR(H49=5,H49=10, H49=15, H49=\"BP\",H49=\"SCR\"),\"NT\",I49)","v":0}]
[{"$nulls":4},49,{"$nulls":4},0]
[{"$nulls":4},50,{"$nulls":4},0]
[{"$nulls":4},51,{"$nulls":4},0]
[{"$nulls":4},52,{"$nulls":4},0]
[{"$nulls":4},53,{"$nulls":4},0]
[{"$nulls":4},54,{"$nulls":4},0]
[{"$nulls":4},55,{"$nulls":4},0]
[{"$nulls":4},56,{"$nulls":4},0]
[{"$nulls":4},57,{"$nulls":4},0]
[{"$nulls":4},58,{"$nulls":4},0]
[{"$nulls":4},59,{"$nulls":4},0]
[{"$nulls":4},60,{"$nulls":4},0]
[{"$nulls":4},61,{"$nulls":4},0]
[{"$nulls":4},62,{"$nulls":4},0]
[{"$nulls":4},63,{"$nulls":4},0]
[{"$nulls":4},64,{"$nulls":4},0]
[{"$nulls":4},65,{"$nulls":4},0]
[{"$nulls":4},66,{"$nulls":4},0]
[{"$nulls":4},67,{"$nulls":4},0]
[{"$nulls":4},68,{"$nulls":4},0]
[{"$nulls":4},69,{"$nulls":4},0]
[{"$nulls":4},70,{"$nulls":4},0]
[{"$nulls":4},71,{"$nulls":4},0]
[{"$nulls":4},72,{"$nulls":4},0]
[{"$nulls":4},73,{"$nulls":4},0]
[{"$nulls":4},74,{"$nulls":4},0]
[{"$nulls":4},75,{"$nulls":4},0]
[{"$nulls":4},76,{"$nulls":4},0]
[{"$nulls":4},77,{"$nulls":4},0]
[{"$nulls":4},78,{"$nulls":4},0]
[{"$nulls":4},79,{"$nulls":4},0]
[{"$nulls":4},80,{"$nulls":4},0]
[{"$nulls":4},81,{"$nulls":4},0]
[{"$nulls":4},82,{"$nulls":4},0]
[{"$nulls":4},83,{"$nulls":4},0]
[{"$nulls":4},84,{"$nulls":4},0]
[{"$nulls":4},85,{"$nulls":4},0]
[{"$nulls":4},86,{"$nulls":4},0]
[{"$nulls":4},87,{"$nulls":4},0]
[{"$nulls":4},88,{"$nulls":4},0]
[{"$nulls":4},89,{"$nulls":4},0]
[{"$nulls":4},90,{"$nulls":4},0]
[{"$nulls":4},91,{"$nulls":4},0]
[{"$nulls":4},92,{"$nulls":4},0]
[{"$nulls":4},93,{"$nulls":4},0]
[{"$nulls":4},94,{"$nulls":4},0]
[{"$nulls":4},95,{"$nulls":4},0]
[{"$nulls":4},96,{"$nulls":4},0]
[{"$nulls":4},97,{"$nulls":4},0]
[{"$nulls":4},98,{"$nulls":4},0]
[{"$nulls":4},99,{"$nulls":4},0]
[{"$nulls":4},100,{"$nulls":4},0]
[{"$nulls":4},101,{"$nulls":4},0]
[{"$nulls":4},102,{"$nulls":4},0]
[{"$nulls":4},103,{"$nulls":4},{"$f":"IF(OR(H104=5,H104=10, H104=15, H104=\"BP\",H104=\"SCR\"),\"NT\",I104)","v":0}]
[{"$nulls":4},104,{"$nulls":4},0]
[{"$nulls":4},105,{"$nulls":4},0]
[{"$nulls":4},106,{"$nulls":4},0]
[{"$nulls":4},107,{"$nulls":4},0]
[{"$nulls":4},108,{"$nulls":4},0]
[{"$nulls":4},109,{"$nulls":4},0]
[{"$nulls":4},110,{"$nulls":4},0]
[{"$nulls":4},111,{"$nulls":4},0]
[{"$nulls":4},112,{"$nulls":4},0]
[{"$nulls":4},113,{"$nulls":4},0]
[{"$nulls":4},114,{"$nulls":4},0]
[{"$nulls":4},115,{"$nulls":4},0]
[{"$nulls":4},116,{"$nulls":4},0]
[{"$nulls":4},117,{"$nulls":4},0]
[{"$nulls":4},118,{"$nulls":4},0]
[{"$nulls":4},119,{"$nulls":4},0]
[{"$nulls":4},120,{"$nulls":4},0]
[{"$nulls":4},121,{"$nulls":4},0]
[{"$nulls":4},122,{"$nulls":4},0]
[{"$nulls":4},123,{"$nulls":4},0]
[{"$nulls":4},124,{"$nulls":4},0]
[{"$nulls":4},125,{"$nulls":4},0]
[{"$nulls":4},126,{"$nulls":4},0]
[{"$nulls":4},127,{"$nulls":4},0]
[{"$nulls":4},128,{"$nulls":4},0]
[{"$nulls":4},129,{"$nulls":4},0]
[{"$nulls":4},130,{"$nulls":4},0]
[{"$nulls":4},131,{"$nulls":4},0]
[{"$nulls":4},132,{"$nulls":4},0]
[{"$nulls":4},133,{"$nulls":4},0]
[{"$nulls":4},134,{"$nulls":4},0]
[{"$nulls":4},135,{"$nulls":4},0]
[{"$nulls":4},136,{"$nulls":4},0]
[{"$nulls":4},137,{"$nulls":4},0]
[{"$nulls":4},138,{"$nulls":4},0]
[{"$nulls":4},139,{"$nulls":4},0]
[{"$nulls":4},140,{"$nulls":4},0]
[{"$nulls":4},141,{"$nulls":4},0]
[{"$nulls":4},142,{"$nulls":4},0]
[{"$nulls":4},143,{"$nulls":4},0]
[{"$nulls":4},144,{"$nulls":4},0]
[{"$nulls":4},145,{"$nulls":4},0]
[{"$nulls":4},146,{"$nulls":4},0]
[{"$nulls":4},147,{"$nulls":4},0]
[{"$nulls":4},148,{"$nulls":4},0]
[{"$nulls":4},149,{"$nulls":4},0]
[{"$nulls":4},150,{"$nulls":4},0]
[{"$nulls":4},151,{"$nulls":4},0]
[{"$nulls":4},152,{"$nulls":4},0]
[{"$nulls":4},153,{"$nulls":4},0]
[{"$nulls":4},154,{"$nulls":4},0]
[{"$nulls":4},155,{"$nulls":4},0]
[{"$nulls":4},156,{"$nulls":4},0]
[{"$nulls":4},157,{"$nulls":4},0]
[{"$nulls":4},158,{"$nulls":4},0]
[{"$nulls":4},159,{"$nulls":4},0]
[{"$nulls":4},160,{"$nulls":4},0]
[{"$nulls":4},161,{"$nulls":4},0]
[{"$nulls":4},162,{"$nulls":4},0]
[{"$nulls":4},163,{"$nulls":4},0]
[{"$nulls":4},164,{"$nulls":4},0]
[{"$nulls":4},165,{"$nulls":4},0]
[{"$nulls":4},166,{"$nulls":4},0]
[{"$nulls":4},167,{"$nulls":4},{"$f":"IF(OR(H168=5,H168=10, H168=15, H168=\"BP\",H168=\"SCR\"),\"NT\",I168)","v":0}]
[{"$nulls":4},168,{"$nulls":4},0]
[{"$nulls":4},169,{"$nulls":4},0]
[{"$nulls":4},170,{"$nulls":4},0]
[{"$nulls":4},171,{"$nulls":4},0]
[{"$nulls":4},172,{"$nulls":4},0]
[{"$nulls":4},173,{"$nulls":4},0]
[{"$nulls":4},174,{"$nulls":4},0]
[{"$nulls":4},175,{"$nulls":4},0]
[{"$nulls":4},176,{"$nulls":4},0]
[{"$nulls":4},177,{"$nulls":4},0]
[{"$nulls":4},178,{"$nulls":4},0]
[{"$nulls":4},179,{"$nulls":4},0]
[{"$nulls":4},180,{"$nulls":4},0]
[{"$nulls":4},181,{"$nulls":4},0]
[{"$nulls":4},182,{"$nulls":4},0]
[{"$nulls":4},183,{"$nulls":4},0]
[{"$nulls":4},184,{"$nulls":4},0]
[{"$nulls":4},185,{"$nulls":4},0]
[{"$nulls":4},186,{"$nulls":4},0]
[{"$nulls":4},187,{"$nulls":4},0]
[{"$nulls":4},188,{"$nulls":4},0]
[{"$nulls":4},189,{"$nulls":4},0]
[{"$nulls":4},190,{"$nulls":4},0]
[{"$nulls":4},191,{"$nulls":4},0]
[{"$nulls":4},192,{"$nulls":4},0]
[{"$nulls":4},193,{"$nulls":4},0]
[{"$nulls":4},194,{"$nulls":4},0]
[{"$nulls":4},195,{"$nulls":4},0]
[{"$nulls":4},196,{"$nulls":4},0]
[{"$nulls":4},197,{"$nulls":4},0]
[{"$nulls":4},198,{"$nulls":4},0]
[{"$nulls":4},199,{"$nulls":4},0]
[{"$nulls":4},200,{"$nulls":4},0]
[{"$nulls":4},201,{"$nulls":4},0]
[{"$nulls":4},202,{"$nulls":4},0]
[{"$nulls":4},203,{"$nulls":4},0]
[{"$nulls":4},204,{"$nulls":4},0]
[{"$nulls":4},205,{"$nulls":4},0]
[{"$nulls":4},206,{"$nulls":4},0]
[{"$nulls":4},207,{"$nulls":4},0]
[{"$nulls":4},208,{"$nulls":4},0]
[{"$nulls":4},209,{"$nulls":4},0]
[{"$nulls":4},210,{"$nulls":4},0]
[{"$nulls":4},211,{"$nulls":4},0]
[{"$nulls":4},212,{"$nulls":4},0]
[{"$nulls":4},213,{"$nulls":4},0]
[{"$nulls":4},214,{"$nulls":4},0]
[{"$nulls":4},215,{"$nulls":4},0]
[{"$nulls":4},216,{"$nulls":4},0]
[{"$nulls":4},217,{"$nulls":4},0]
[{"$nulls":4},218,{"$nulls":4},0]
[{"$nulls":4},219,{"$nulls":4},0]
[{"$nulls":4},220,{"$nulls":4},0]
[{"$nulls":4},221,{"$nulls":4},0]
[{"$nulls":4},222,{"$nulls":4},0]
[{"$nulls":4},223,{"$nulls":4},0]
[{"$nulls":4},224,{"$nulls":4},0]
[{"$nulls":4},225,{"$nulls":4},0]
[{"$nulls":4},226,{"$nulls":4},0]
[{"$nulls":4},227,{"$nulls":4},0]
[{"$nulls":4},228,{"$nulls":4},0]
[{"$nulls":4},229,{"$nulls":4},0]
[{"$nulls":4},230,{"$nulls":4},0]
[{"$nulls":4},231,{"$nulls":4},{"$f":"IF(OR(H232=5,H232=10, H232=15, H232=\"BP\",H232=\"SCR\"),\"NT\",I232)","v":0}]
[{"$nulls":4},232,{"$nulls":4},0]
[{"$nulls":4},233,{"$nulls":4},0]
[{"$nulls":4},234,{"$nulls":4},0]
[{"$nulls":4},235,{"$nulls":4},0]
[{"$nulls":4},236,{"$nulls":4},0]
[{"$nulls":4},237,{"$nulls":4},0]
[{"$nulls":4},238,{"$nulls":4},0]
[{"$nulls":4},239,{"$nulls":4},0]
[{"$nulls":4},240,{"$nulls":4},0]
[{"$nulls":4},241,{"$nulls":4},0]
[{"$nulls":4},242,{"$nulls":4},0]
[{"$nulls":4},243,{"$nulls":4},0]
[{"$nulls":4},244,{"$nulls":4},0]
[{"$nulls":4},245,{"$nulls":4},0]
[{"$nulls":4},246,{"$nulls":4},0]
[{"$nulls":4},247,{"$nulls":4},0]
[{"$nulls":4},248,{"$nulls":4},0]
[{"$nulls":4},249,{"$nulls":4},0]
[{"$nulls":4},250,{"$nulls":4},0]
[{"$nulls":4},251,{"$nulls":4},0]
[{"$nulls":4},252,{"$nulls":4},0]
[{"$nulls":4},253,{"$nulls":4},0]
[{"$nulls":4},254,{"$nulls":4},0]
[{"$nulls":4},255,{"$nulls":4},0]
[{"$nulls":4},256,{"$nulls":4},0]
[{"$nulls":4},257,{"$nulls":4},0]
[{"$nulls":4},258,{"$nulls":4},0]
[{"$nulls":4},259,{"$nulls":4},0]
[{"$nulls":4},260,{"$nulls":4},0]
[{"$nulls":4},261,{"$nulls":4},0]
[{"$nulls":4},262,{"$nulls":4},0]
[{"$nulls":4},263,{"$nulls":4},0]
[{"$nulls":4},264,{"$nulls":4},0]
[{"$nulls":4},265,{"$nulls":4},0]
[{"$nulls":4},266,{"$nulls":4},0]
[{"$nulls":4},267,{"$nulls":4},0]
[{"$nulls":4},268,{"$nulls":4},0]
[{"$nulls":4},269,{"$nulls":4},0]
[{"$nulls":4},270,{"$nulls":4},0]
[{"$nulls":4},271,{"$nulls":4},0]
[{"$nulls":4},272,{"$nulls":4},0]
[{"$nulls":4},273,{"$nulls":4},0]
[{"$nulls":4},274,{"$nulls":4},0]
[{"$nulls":4},275,{"$nulls":4},0]
[{"$nulls":4},276,{"$nulls":4},0]
[{"$nulls":4},277,{"$nulls":4},0]
[{"$nulls":4},278,{"$nulls":4},0]
[{"$nulls":4},279,{"$nulls":4},0]
[{"$nulls":4},280,{"$nulls":4},0]
[{"$nulls":4},281,{"$nulls":4},0]
[{"$nulls":4},282,{"$nulls":4},0]
[{"$nulls":4},283,{"$nulls":4},0]
[{"$nulls":4},284,{"$nulls":4},0]
[{"$nulls":4},285,{"$nulls":4},0]
[{"$nulls":4},286,{"$nulls":4},0]
[{"$nulls":4},287,{"$nulls":4},0]
[{"$nulls":4},288,{"$nulls":4},0]
[{"$nulls":4},289,{"$nulls":4},0]
[{"$nulls":4},290,{"$nulls":4},0]
[{"$nulls":4},291,{"$nulls":4},0]
[{"$nulls":4},292,{"$nulls":4},0]
[{"$nulls":4},293,{"$nulls":4},0]
[{"$nulls":4},294,{"$nulls":4},0]
[{"$nulls":4},295,{"$nulls":4},{"$f":"IF(OR(H296=5,H296=10, H296=15, H296=\"BP\",H296=\"SCR\"),\"NT\",I296)","v":0}]
[{"$nulls":4},296,{"$nulls":4},0]
[{"$nulls":4},297,{"$nulls":4},0]
[{"$nulls":4},298,{"$nulls":4},0]
[{"$nulls":4},299,{"$nulls":4},0]
[{"$nulls":4},300,{"$nulls":4},0]

{"sheet":"Highstakes","index":6,"n_rows":301,"n_cols":12,"rows_kept":301,"cut":false,"hidden":false,"merged":[]}
["Futurity","Der","Age Inct.","BBR","Draw","Rider Name","Horse Name","c/o","Time","Final Time","Placing","Money Earned"]
[{"$nulls":4},1,"Wenda Johnson","Macgyver Moonflash",null,15.704000000000001,null,"1st",432]
[{"$nulls":4},2,"Jolene Montgomery","Streakin Easily",null,15.818,null,"2nd",288]
[{"$nulls":4},3,"Emily Becker","MR Elegant Shawne",null,15.849]
[{"$nulls":4},4,"Jolene Montgomery","Firin Ta Heaven",null,15.959]
[{"$nulls":4},5,"Haley Bowen","Sadies Superman",null,16.710999999999999]
[{"$nulls":4},6,"Wenda Johnson","Dreams First Flush",null,"nt15.658"]
[{"$nulls":4},7,"Kaylee Gallino","JC Truly Bob",null,"nt15.772"]
[{"$nulls":4},8,"Martha Jordan","JLFourtafame",null,"nt16.213"]
[{"$nulls":4},9,"Lauren Whitmire","Fame Rox",null,"nt17.447"]
[{"$nulls":4},10]
[{"$nulls":4},11]
[{"$nulls":4},12]
[{"$nulls":4},13]
[{"$nulls":4},14]
[{"$nulls":4},15]
[{"$nulls":4},16]
[{"$nulls":4},17]
[{"$nulls":4},18]
[{"$nulls":4},19]
[{"$nulls":4},20]
[{"$nulls":4},21]
[{"$nulls":4},22]
[{"$nulls":4},23]
[{"$nulls":4},24]
[{"$nulls":4},25]
[{"$nulls":4},26]
[{"$nulls":4},27]
[{"$nulls":4},28]
[{"$nulls":4},29]
[{"$nulls":4},30]
[{"$nulls":4},31]
[{"$nulls":4},32]
[{"$nulls":4},33]
[{"$nulls":4},34]
[{"$nulls":4},35]
[{"$nulls":4},36]
[{"$nulls":4},37]
[{"$nulls":4},38]
[{"$nulls":4},39,{"$nulls":4},{"$f":"IF(OR(H40=5,H40=10, H40=15, H40=\"BP\",H40=\"SCR\"),\"NT\",I40)","v":0}]
[{"$nulls":4},40,{"$nulls":4},0]
[{"$nulls":4},41,{"$nulls":4},0]
[{"$nulls":4},42,{"$nulls":4},0]
[{"$nulls":4},43,{"$nulls":4},0]
[{"$nulls":4},44,{"$nulls":4},0]
[{"$nulls":4},45,{"$nulls":4},0]
[{"$nulls":4},46,{"$nulls":4},0]
[{"$nulls":4},47,{"$nulls":4},0]
[{"$nulls":4},48,{"$nulls":4},0]
[{"$nulls":4},49,{"$nulls":4},0]
[{"$nulls":4},50,{"$nulls":4},0]
[{"$nulls":4},51,{"$nulls":4},0]
[{"$nulls":4},52,{"$nulls":4},0]
[{"$nulls":4},53,{"$nulls":4},0]
[{"$nulls":4},54,{"$nulls":4},0]
[{"$nulls":4},55,{"$nulls":4},0]
[{"$nulls":4},56,{"$nulls":4},0]
[{"$nulls":4},57,{"$nulls":4},0]
[{"$nulls":4},58,{"$nulls":4},0]
[{"$nulls":4},59,{"$nulls":4},0]
[{"$nulls":4},60,{"$nulls":4},0]
[{"$nulls":4},61,{"$nulls":4},0]
[{"$nulls":4},62,{"$nulls":4},0]
[{"$nulls":4},63,{"$nulls":4},0]
[{"$nulls":4},64,{"$nulls":4},0]
[{"$nulls":4},65,{"$nulls":4},0]
[{"$nulls":4},66,{"$nulls":4},0]
[{"$nulls":4},67,{"$nulls":4},0]
[{"$nulls":4},68,{"$nulls":4},0]
[{"$nulls":4},69,{"$nulls":4},0]
[{"$nulls":4},70,{"$nulls":4},0]
[{"$nulls":4},71,{"$nulls":4},0]
[{"$nulls":4},72,{"$nulls":4},0]
[{"$nulls":4},73,{"$nulls":4},0]
[{"$nulls":4},74,{"$nulls":4},0]
[{"$nulls":4},75,{"$nulls":4},0]
[{"$nulls":4},76,{"$nulls":4},0]
[{"$nulls":4},77,{"$nulls":4},0]
[{"$nulls":4},78,{"$nulls":4},0]
[{"$nulls":4},79,{"$nulls":4},0]
[{"$nulls":4},80,{"$nulls":4},0]
[{"$nulls":4},81,{"$nulls":4},0]
[{"$nulls":4},82,{"$nulls":4},0]
[{"$nulls":4},83,{"$nulls":4},0]
[{"$nulls":4},84,{"$nulls":4},0]
[{"$nulls":4},85,{"$nulls":4},0]
[{"$nulls":4},86,{"$nulls":4},0]
[{"$nulls":4},87,{"$nulls":4},0]
[{"$nulls":4},88,{"$nulls":4},0]
[{"$nulls":4},89,{"$nulls":4},0]
[{"$nulls":4},90,{"$nulls":4},0]
[{"$nulls":4},91,{"$nulls":4},0]
[{"$nulls":4},92,{"$nulls":4},0]
[{"$nulls":4},93,{"$nulls":4},0]
[{"$nulls":4},94,{"$nulls":4},0]
[{"$nulls":4},95,{"$nulls":4},0]
[{"$nulls":4},96,{"$nulls":4},0]
[{"$nulls":4},97,{"$nulls":4},0]
[{"$nulls":4},98,{"$nulls":4},0]
[{"$nulls":4},99,{"$nulls":4},0]
[{"$nulls":4},100,{"$nulls":4},0]
[{"$nulls":4},101,{"$nulls":4},0]
[{"$nulls":4},102,{"$nulls":4},0]
[{"$nulls":4},103,{"$nulls":4},{"$f":"IF(OR(H104=5,H104=10, H104=15, H104=\"BP\",H104=\"SCR\"),\"NT\",I104)","v":0}]
[{"$nulls":4},104,{"$nulls":4},0]
[{"$nulls":4},105,{"$nulls":4},0]
[{"$nulls":4},106,{"$nulls":4},0]
[{"$nulls":4},107,{"$nulls":4},0]
[{"$nulls":4},108,{"$nulls":4},0]
[{"$nulls":4},109,{"$nulls":4},0]
[{"$nulls":4},110,{"$nulls":4},0]
[{"$nulls":4},111,{"$nulls":4},0]
[{"$nulls":4},112,{"$nulls":4},0]
[{"$nulls":4},113,{"$nulls":4},0]
[{"$nulls":4},114,{"$nulls":4},0]
[{"$nulls":4},115,{"$nulls":4},0]
[{"$nulls":4},116,{"$nulls":4},0]
[{"$nulls":4},117,{"$nulls":4},0]
[{"$nulls":4},118,{"$nulls":4},0]
[{"$nulls":4},119,{"$nulls":4},0]
[{"$nulls":4},120,{"$nulls":4},0]
[{"$nulls":4},121,{"$nulls":4},0]
[{"$nulls":4},122,{"$nulls":4},0]
[{"$nulls":4},123,{"$nulls":4},0]
[{"$nulls":4},124,{"$nulls":4},0]
[{"$nulls":4},125,{"$nulls":4},0]
[{"$nulls":4},126,{"$nulls":4},0]
[{"$nulls":4},127,{"$nulls":4},0]
[{"$nulls":4},128,{"$nulls":4},0]
[{"$nulls":4},129,{"$nulls":4},0]
[{"$nulls":4},130,{"$nulls":4},0]
[{"$nulls":4},131,{"$nulls":4},0]
[{"$nulls":4},132,{"$nulls":4},0]
[{"$nulls":4},133,{"$nulls":4},0]
[{"$nulls":4},134,{"$nulls":4},0]
[{"$nulls":4},135,{"$nulls":4},0]
[{"$nulls":4},136,{"$nulls":4},0]
[{"$nulls":4},137,{"$nulls":4},0]
[{"$nulls":4},138,{"$nulls":4},0]
[{"$nulls":4},139,{"$nulls":4},0]
[{"$nulls":4},140,{"$nulls":4},0]
[{"$nulls":4},141,{"$nulls":4},0]
[{"$nulls":4},142,{"$nulls":4},0]
[{"$nulls":4},143,{"$nulls":4},0]
[{"$nulls":4},144,{"$nulls":4},0]
[{"$nulls":4},145,{"$nulls":4},0]
[{"$nulls":4},146,{"$nulls":4},0]
[{"$nulls":4},147,{"$nulls":4},0]
[{"$nulls":4},148,{"$nulls":4},0]
[{"$nulls":4},149,{"$nulls":4},0]
[{"$nulls":4},150,{"$nulls":4},0]
[{"$nulls":4},151,{"$nulls":4},0]
[{"$nulls":4},152,{"$nulls":4},0]
[{"$nulls":4},153,{"$nulls":4},0]
[{"$nulls":4},154,{"$nulls":4},0]
[{"$nulls":4},155,{"$nulls":4},0]
[{"$nulls":4},156,{"$nulls":4},0]
[{"$nulls":4},157,{"$nulls":4},0]
[{"$nulls":4},158,{"$nulls":4},0]
[{"$nulls":4},159,{"$nulls":4},0]
[{"$nulls":4},160,{"$nulls":4},0]
[{"$nulls":4},161,{"$nulls":4},0]
[{"$nulls":4},162,{"$nulls":4},0]
[{"$nulls":4},163,{"$nulls":4},0]
[{"$nulls":4},164,{"$nulls":4},0]
[{"$nulls":4},165,{"$nulls":4},0]
[{"$nulls":4},166,{"$nulls":4},0]
[{"$nulls":4},167,{"$nulls":4},{"$f":"IF(OR(H168=5,H168=10, H168=15, H168=\"BP\",H168=\"SCR\"),\"NT\",I168)","v":0}]
[{"$nulls":4},168,{"$nulls":4},0]
[{"$nulls":4},169,{"$nulls":4},0]
[{"$nulls":4},170,{"$nulls":4},0]
[{"$nulls":4},171,{"$nulls":4},0]
[{"$nulls":4},172,{"$nulls":4},0]
[{"$nulls":4},173,{"$nulls":4},0]
[{"$nulls":4},174,{"$nulls":4},0]
[{"$nulls":4},175,{"$nulls":4},0]
[{"$nulls":4},176,{"$nulls":4},0]
[{"$nulls":4},177,{"$nulls":4},0]
[{"$nulls":4},178,{"$nulls":4},0]
[{"$nulls":4},179,{"$nulls":4},0]
[{"$nulls":4},180,{"$nulls":4},0]
[{"$nulls":4},181,{"$nulls":4},0]
[{"$nulls":4},182,{"$nulls":4},0]
[{"$nulls":4},183,{"$nulls":4},0]
[{"$nulls":4},184,{"$nulls":4},0]
[{"$nulls":4},185,{"$nulls":4},0]
[{"$nulls":4},186,{"$nulls":4},0]
[{"$nulls":4},187,{"$nulls":4},0]
[{"$nulls":4},188,{"$nulls":4},0]
[{"$nulls":4},189,{"$nulls":4},0]
[{"$nulls":4},190,{"$nulls":4},0]
[{"$nulls":4},191,{"$nulls":4},0]
[{"$nulls":4},192,{"$nulls":4},0]
[{"$nulls":4},193,{"$nulls":4},0]
[{"$nulls":4},194,{"$nulls":4},0]
[{"$nulls":4},195,{"$nulls":4},0]
[{"$nulls":4},196,{"$nulls":4},0]
[{"$nulls":4},197,{"$nulls":4},0]
[{"$nulls":4},198,{"$nulls":4},0]
[{"$nulls":4},199,{"$nulls":4},0]
[{"$nulls":4},200,{"$nulls":4},0]
[{"$nulls":4},201,{"$nulls":4},0]
[{"$nulls":4},202,{"$nulls":4},0]
[{"$nulls":4},203,{"$nulls":4},0]
[{"$nulls":4},204,{"$nulls":4},0]
[{"$nulls":4},205,{"$nulls":4},0]
[{"$nulls":4},206,{"$nulls":4},0]
[{"$nulls":4},207,{"$nulls":4},0]
[{"$nulls":4},208,{"$nulls":4},0]
[{"$nulls":4},209,{"$nulls":4},0]
[{"$nulls":4},210,{"$nulls":4},0]
[{"$nulls":4},211,{"$nulls":4},0]
[{"$nulls":4},212,{"$nulls":4},0]
[{"$nulls":4},213,{"$nulls":4},0]
[{"$nulls":4},214,{"$nulls":4},0]
[{"$nulls":4},215,{"$nulls":4},0]
[{"$nulls":4},216,{"$nulls":4},0]
[{"$nulls":4},217,{"$nulls":4},0]
[{"$nulls":4},218,{"$nulls":4},0]
[{"$nulls":4},219,{"$nulls":4},0]
[{"$nulls":4},220,{"$nulls":4},0]
[{"$nulls":4},221,{"$nulls":4},0]
[{"$nulls":4},222,{"$nulls":4},0]
[{"$nulls":4},223,{"$nulls":4},0]
[{"$nulls":4},224,{"$nulls":4},0]
[{"$nulls":4},225,{"$nulls":4},0]
[{"$nulls":4},226,{"$nulls":4},0]
[{"$nulls":4},227,{"$nulls":4},0]
[{"$nulls":4},228,{"$nulls":4},0]
[{"$nulls":4},229,{"$nulls":4},0]
[{"$nulls":4},230,{"$nulls":4},0]
[{"$nulls":4},231,{"$nulls":4},{"$f":"IF(OR(H232=5,H232=10, H232=15, H232=\"BP\",H232=\"SCR\"),\"NT\",I232)","v":0}]
[{"$nulls":4},232,{"$nulls":4},0]
[{"$nulls":4},233,{"$nulls":4},0]
[{"$nulls":4},234,{"$nulls":4},0]
[{"$nulls":4},235,{"$nulls":4},0]
[{"$nulls":4},236,{"$nulls":4},0]
[{"$nulls":4},237,{"$nulls":4},0]
[{"$nulls":4},238,{"$nulls":4},0]
[{"$nulls":4},239,{"$nulls":4},0]
[{"$nulls":4},240,{"$nulls":4},0]
[{"$nulls":4},241,{"$nulls":4},0]
[{"$nulls":4},242,{"$nulls":4},0]
[{"$nulls":4},243,{"$nulls":4},0]
[{"$nulls":4},244,{"$nulls":4},0]
[{"$nulls":4},245,{"$nulls":4},0]
[{"$nulls":4},246,{"$nulls":4},0]
[{"$nulls":4},247,{"$nulls":4},0]
[{"$nulls":4},248,{"$nulls":4},0]
[{"$nulls":4},249,{"$nulls":4},0]
[{"$nulls":4},250,{"$nulls":4},0]
[{"$nulls":4},251,{"$nulls":4},0]
[{"$nulls":4},252,{"$nulls":4},0]
[{"$nulls":4},253,{"$nulls":4},0]
[{"$nulls":4},254,{"$nulls":4},0]
[{"$nulls":4},255,{"$nulls":4},0]
[{"$nulls":4},256,{"$nulls":4},0]
[{"$nulls":4},257,{"$nulls":4},0]
[{"$nulls":4},258,{"$nulls":4},0]
[{"$nulls":4},259,{"$nulls":4},0]
[{"$nulls":4},260,{"$nulls":4},0]
[{"$nulls":4},261,{"$nulls":4},0]
[{"$nulls":4},262,{"$nulls":4},0]
[{"$nulls":4},263,{"$nulls":4},0]
[{"$nulls":4},264,{"$nulls":4},0]
[{"$nulls":4},265,{"$nulls":4},0]
[{"$nulls":4},266,{"$nulls":4},0]
[{"$nulls":4},267,{"$nulls":4},0]
[{"$nulls":4},268,{"$nulls":4},0]
[{"$nulls":4},269,{"$nulls":4},0]
[{"$nulls":4},270,{"$nulls":4},0]
[{"$nulls":4},271,{"$nulls":4},0]
[{"$nulls":4},272,{"$nulls":4},0]
[{"$nulls":4},273,{"$nulls":4},0]
[{"$nulls":4},274,{"$nulls":4},0]
[{"$nulls":4},275,{"$nulls":4},0]
[{"$nulls":4},276,{"$nulls":4},0]
[{"$nulls":4},277,{"$nulls":4},0]
[{"$nulls":4},278,{"$nulls":4},0]
[{"$nulls":4},279,{"$nulls":4},0]
[{"$nulls":4},280,{"$nulls":4},0]
[{"$nulls":4},281,{"$nulls":4},0]
[{"$nulls":4},282,{"$nulls":4},0]
[{"$nulls":4},283,{"$nulls":4},0]
[{"$nulls":4},284,{"$nulls":4},0]
[{"$nulls":4},285,{"$nulls":4},0]
[{"$nulls":4},286,{"$nulls":4},0]
[{"$nulls":4},287,{"$nulls":4},0]
[{"$nulls":4},288,{"$nulls":4},0]
[{"$nulls":4},289,{"$nulls":4},0]
[{"$nulls":4},290,{"$nulls":4},0]
[{"$nulls":4},291,{"$nulls":4},0]
[{"$nulls":4},292,{"$nulls":4},0]
[{"$nulls":4},293,{"$nulls":4},0]
[{"$nulls":4},294,{"$nulls":4},0]
[{"$nulls":4},295,{"$nulls":4},{"$f":"IF(OR(H296=5,H296=10, H296=15, H296=\"BP\",H296=\"SCR\"),\"NT\",I296)","v":0}]
[{"$nulls":4},296,{"$nulls":4},0]
[{"$nulls":4},297,{"$nulls":4},0]
[{"$nulls":4},298,{"$nulls":4},0]
[{"$nulls":4},299,{"$nulls":4},0]
[{"$nulls":4},300,{"$nulls":4},0]

{"sheet":"Futurity","index":7,"n_rows":301,"n_cols":12,"rows_kept":301,"cut":false,"hidden":false,"merged":[]}
["Futurity","Der","Age Inct.","BBR","Draw","Rider Name","Horse Name","c/o","Time","Final Time","Placing","Money Earned"]
[{"$nulls":4},1,"Stephanie Fryar","RR LaJollas Roll",null,15.739000000000001,null,"1D 1st",945]
[{"$nulls":4},2,"Kassie Mowry","Famous Ladies Man",null,15.815,null,"1D 2nd",787.5]
[{"$nulls":4},3,"Kelly Allen","Moons Fire Ta Fame",null,15.843,null,"1D 3rd",630]
[{"$nulls":4},4,"Jolene Montgomery","Flits Khamacasse",null,15.86,null,"1D 4th",472.5]
[{"$nulls":4},5,"Kassie Mowry","Dashing Canelo",null,15.87,null,"1D 5th",315]
[{"$nulls":4},6,"Jessie Domann","Ima Perry N Famous",null,15.895]
[{"$nulls":4},7,"Kassie Mowry","CP He Will Be Epic",null,15.938000000000001]
[{"$nulls":4},8,"Kassie Mowry","Epic Guy",null,15.942]
[{"$nulls":4},9,"Kelsey Lutjen","KN Luna",null,15.958]
[{"$nulls":4},10,"Jolene Montgomery","Firin Ta Heaven",null,15.959]
[{"$nulls":4},11,"Lacey Harmon","Mitey Man",null,16.077999999999999]
[{"$nulls":4},12,"Kelsey Lutjen","TS Dash Dang It",null,16.081]
[{"$nulls":4},13,"James Barnes","Flamin Flicka",null,16.132000000000001]
[{"$nulls":4},14,"Andrea Cline","Cruz N Ta Fame",null,16.146999999999998]
[{"$nulls":4},15,"Kim Squires","Ima Diva Red Dasher",null,16.172000000000001]
[{"$nulls":4},16,"Kassie Mowry","Back The Blue",null,16.172999999999998]
[{"$nulls":4},17,"James Barnes","Slicks Sweet Legacy",null,16.184000000000001]
[{"$nulls":4},18,"Rachel Arms","RY Wyatt Earl",null,16.204999999999998]
[{"$nulls":4},19,"Pete Oen","HGF Flinging Frosted",null,16.227]
[{"$nulls":4},20,"Jade Crago","CM Sierras Fire Frost",null,16.239000000000001,null,"2D 1st",405]
[{"$nulls":4},21,"Carmel Wright","PG Eye Bully Fame",null,16.298999999999999,null,"2D 2nd",337.5]
[{"$nulls":4},22,"Ryan Reynolds","Kick of Fame",null,16.306000000000001,null,"2D 3rd",270]
[{"$nulls":4},23,"Brooke Kelley","Nu Bueno Karma",null,16.327000000000002,null,"2D 4th",202.5]
[{"$nulls":4},24,"Danyelle Campbell","Primrose Fame",null,16.332000000000001,null,"2D 5th",135]
[{"$nulls":4},25,"Kelsey Lutjen","Blazin X's N Oh's",null,16.337]
[{"$nulls":4},26,"Jolene Montgomery","Famously Perkin",null,16.34]
[{"$nulls":4},27,"Jaque Woolman","Bugs A Boo",null,16.369]
[{"$nulls":4},28,"Kelsey Lutjen","TS Queens Shakem",null,16.408000000000001]
[{"$nulls":4},29,"Nicole RIggle","Moonshinesgotmefiren",null,16.408000000000001]
[{"$nulls":4},30,"Danyelle Campbell","CP Winnie",null,16.416]
[{"$nulls":4},31,"Joy Wargo","Dash Ta Mirage",null,16.446999999999999]
[{"$nulls":4},32,"Ryann Pedone","Dash Ta Perfection",null,16.448]
[{"$nulls":4},33,"Cassidy Kruse","Lost Creek Widow",null,16.481000000000002]
[{"$nulls":4},34,"Kari Brough","Hot French Lady",null,16.481999999999999]
[{"$nulls":4},35,"Wyatt Paul","Paparazzi Love Me",null,16.484000000000002]
[{"$nulls":4},36,"Tasha Welch","Victorious Firewater",null,16.542999999999999]
[{"$nulls":4},37,"Jessie Domann","IRoseSuchAStinson",null,16.588000000000001]
[{"$nulls":4},38,"Debbie Bloxom","Bad Firing Rising",null,16.597000000000001]
[{"$nulls":4},39,"Pete Oen","FC Black Firewater",null,16.617000000000001]
[{"$nulls":4},40,"Andrea Sewell","Uptown Fame",null,16.649999999999999]
[{"$nulls":4},41,"Madison Merrill","RS Forever Famous",null,16.657]
[{"$nulls":4},42,"Ryann Pedone","Sudden Hero",null,16.739999999999998]
[{"$nulls":4},43,"Lauren Whitmire","Down Dash Anytime",null,16.753]
[{"$nulls":4},44,"Danyelle Campbell","Dirrty Money",null,16.78]
[{"$nulls":4},45,"Kari Brough","Frenchmantwistedfame",null,16.783999999999999]
[{"$nulls":4},46,"SheaLynn Leach","Peter Wabbit",null,16.808]
[{"$nulls":4},47,"Pete Oen","Fyre In The Skye",null,16.837]
[{"$nulls":4},48,"Ashley Schafer","Streakin Cisco",null,16.925000000000001]
[{"$nulls":4},49,"Tristan Mounts","Blazed Gunsmoke",null,16.998999999999999]
[{"$nulls":4},50,"Billie Ann Harmon","Patroits Firewater",null,17.087]
[{"$nulls":4},51,"Joy Wargo","WR Calamity Fame",null,17.195]
[{"$nulls":4},52,"Glenda Barnett","Miss Famous Beduino",null,17.241]
[{"$nulls":4},53,"Andrea Cline","Superflysraretreasure",null,17.373000000000001]
[{"$nulls":4},54,"Charlotte Edwards","VF Eye Of Tiger",null,17.565999999999999]
[{"$nulls":4},55,"Charlotte Edwards","TR Hibbie Chick",null,17.576000000000001]
[{"$nulls":4},56,"Kelly Allen","Miss JB 149",null,17.594000000000001]
[{"$nulls":4},57,"Sharin Hall","Fast Dashin Chick",null,17.725999999999999]
[{"$nulls":4},58,"Lacey Harmon","Guys Silver and Gold",null,17.846]
[{"$nulls":4},59,"Jenna Napier","Frenchmans Dually",null,19.692]
[{"$nulls":4},60,"Pete Oen","Strait To Dallas",null,20.698]
[{"$nulls":4},61,"Andrea Cline","Dash Ta The Fire",null,21.495000000000001]
[{"$nulls":4},62,"Stephanie Fryar","Some Streakin French",null,"nt15.946"]
[{"$nulls":4},63,"Kelsey Lutjen","Rivons Gotta Tomboy",null,"nt16.047"]
[{"$nulls":4},64,"Molli Montgomery","Heavensfeelinspecial",null,"nt16.131"]
[{"$nulls":4},65,"Cierra Chapman","Lil Blushing Blonde",null,"nt16.198"]
[{"$nulls":4},66,"Whitney Godinez","Her Perks Are On Fire",null,"nt16.283"]
[{"$nulls":4},67,"Nisa Berry","Code Name Fame",null,"nt16.386"]
[{"$nulls":4},68,"Ryann Pedone","VQ Im Buzzed",null,"nt16.403"]
[{"$nulls":4},69,"Jolene Montgomery","Smooth N Heavenly",null,"nt16.526"]
[{"$nulls":4},70,"Shelly Shields","Streakers Queen",null,"nt16.558"]
[{"$nulls":4},71,"Sharin Hall","Rare Packin Six",null,"nt16.560"]
[{"$nulls":4},72,"Jana Himes","KC High Pick",null,"nt16.748"]
[{"$nulls":4},73,"Dacota Monk","Sheza Slick Design",null,"nt16.981"]
[{"$nulls":4},74,"Shelby Rowe","Jess Say Yes",null,"nt18.707"]
[{"$nulls":4},75,"Pete Oen","Fame TO The Max",null,"nt19.422"]
[{"$nulls":4},76,{"$nulls":4},{"$f":"IF(OR(H77=5,H77=10, H77=15, H77=\"BP\",H77=\"SCR\"),\"NT\",I77)","v":0}]
[{"$nulls":4},77,{"$nulls":4},0]
[{"$nulls":4},78,{"$nulls":4},0]
[{"$nulls":4},79,{"$nulls":4},0]
[{"$nulls":4},80,{"$nulls":4},0]
[{"$nulls":4},81,{"$nulls":4},0]
[{"$nulls":4},82,{"$nulls":4},0]
[{"$nulls":4},83,{"$nulls":4},0]
[{"$nulls":4},84,{"$nulls":4},0]
[{"$nulls":4},85,{"$nulls":4},0]
[{"$nulls":4},86,{"$nulls":4},0]
[{"$nulls":4},87,{"$nulls":4},0]
[{"$nulls":4},88,{"$nulls":4},0]
[{"$nulls":4},89,{"$nulls":4},0]
[{"$nulls":4},90,{"$nulls":4},0]
[{"$nulls":4},91,{"$nulls":4},0]
[{"$nulls":4},92,{"$nulls":4},0]
[{"$nulls":4},93,{"$nulls":4},0]
[{"$nulls":4},94,{"$nulls":4},0]
[{"$nulls":4},95,{"$nulls":4},{"$f":"IF(OR(H96=5,H96=10, H96=15, H96=\"BP\",H96=\"SCR\"),\"NT\",I96)","v":0}]
[{"$nulls":4},96,{"$nulls":4},0]
[{"$nulls":4},97,{"$nulls":4},0]
[{"$nulls":4},98,{"$nulls":4},0]
[{"$nulls":4},99,{"$nulls":4},0]
[{"$nulls":4},100,{"$nulls":4},0]
[{"$nulls":4},101,{"$nulls":4},0]
[{"$nulls":4},102,{"$nulls":4},0]
[{"$nulls":4},103,{"$nulls":4},0]
[{"$nulls":4},104,{"$nulls":4},0]
[{"$nulls":4},105,{"$nulls":4},0]
[{"$nulls":4},106,{"$nulls":4},0]
[{"$nulls":4},107,{"$nulls":4},0]
[{"$nulls":4},108,{"$nulls":4},0]
[{"$nulls":4},109,{"$nulls":4},0]
[{"$nulls":4},110,{"$nulls":4},0]
[{"$nulls":4},111,{"$nulls":4},0]
[{"$nulls":4},112,{"$nulls":4},0]
[{"$nulls":4},113,{"$nulls":4},0]
[{"$nulls":4},114,{"$nulls":4},0]
[{"$nulls":4},115,{"$nulls":4},0]
[{"$nulls":4},116,{"$nulls":4},0]
[{"$nulls":4},117,{"$nulls":4},0]
[{"$nulls":4},118,{"$nulls":4},0]
[{"$nulls":4},119,{"$nulls":4},0]
[{"$nulls":4},120,{"$nulls":4},0]
[{"$nulls":4},121,{"$nulls":4},0]
[{"$nulls":4},122,{"$nulls":4},0]
[{"$nulls":4},123,{"$nulls":4},0]
[{"$nulls":4},124,{"$nulls":4},0]
[{"$nulls":4},125,{"$nulls":4},0]
[{"$nulls":4},126,{"$nulls":4},0]
[{"$nulls":4},127,{"$nulls":4},0]
[{"$nulls":4},128,{"$nulls":4},0]
[{"$nulls":4},129,{"$nulls":4},0]
[{"$nulls":4},130,{"$nulls":4},0]
[{"$nulls":4},131,{"$nulls":4},0]
[{"$nulls":4},132,{"$nulls":4},0]
[{"$nulls":4},133,{"$nulls":4},0]
[{"$nulls":4},134,{"$nulls":4},0]
[{"$nulls":4},135,{"$nulls":4},0]
[{"$nulls":4},136,{"$nulls":4},0]
[{"$nulls":4},137,{"$nulls":4},0]
[{"$nulls":4},138,{"$nulls":4},0]
[{"$nulls":4},139,{"$nulls":4},0]
[{"$nulls":4},140,{"$nulls":4},0]
[{"$nulls":4},141,{"$nulls":4},0]
[{"$nulls":4},142,{"$nulls":4},0]
[{"$nulls":4},143,{"$nulls":4},0]
[{"$nulls":4},144,{"$nulls":4},0]
[{"$nulls":4},145,{"$nulls":4},0]
[{"$nulls":4},146,{"$nulls":4},0]
[{"$nulls":4},147,{"$nulls":4},0]
[{"$nulls":4},148,{"$nulls":4},0]
[{"$nulls":4},149,{"$nulls":4},0]
[{"$nulls":4},150,{"$nulls":4},0]
[{"$nulls":4},151,{"$nulls":4},0]
[{"$nulls":4},152,{"$nulls":4},0]
[{"$nulls":4},153,{"$nulls":4},0]
[{"$nulls":4},154,{"$nulls":4},0]
[{"$nulls":4},155,{"$nulls":4},0]
[{"$nulls":4},156,{"$nulls":4},0]
[{"$nulls":4},157,{"$nulls":4},0]
[{"$nulls":4},158,{"$nulls":4},0]
[{"$nulls":4},159,{"$nulls":4},{"$f":"IF(OR(H160=5,H160=10, H160=15, H160=\"BP\",H160=\"SCR\"),\"NT\",I160)","v":0}]
[{"$nulls":4},160,{"$nulls":4},0]
[{"$nulls":4},161,{"$nulls":4},0]
[{"$nulls":4},162,{"$nulls":4},0]
[{"$nulls":4},163,{"$nulls":4},0]
[{"$nulls":4},164,{"$nulls":4},0]
[{"$nulls":4},165,{"$nulls":4},0]
[{"$nulls":4},166,{"$nulls":4},0]
[{"$nulls":4},167,{"$nulls":4},0]
[{"$nulls":4},168,{"$nulls":4},0]
[{"$nulls":4},169,{"$nulls":4},0]
[{"$nulls":4},170,{"$nulls":4},0]
[{"$nulls":4},171,{"$nulls":4},0]
[{"$nulls":4},172,{"$nulls":4},0]
[{"$nulls":4},173,{"$nulls":4},0]
[{"$nulls":4},174,{"$nulls":4},0]
[{"$nulls":4},175,{"$nulls":4},0]
[{"$nulls":4},176,{"$nulls":4},0]
[{"$nulls":4},177,{"$nulls":4},0]
[{"$nulls":4},178,{"$nulls":4},0]
[{"$nulls":4},179,{"$nulls":4},0]
[{"$nulls":4},180,{"$nulls":4},0]
[{"$nulls":4},181,{"$nulls":4},0]
[{"$nulls":4},182,{"$nulls":4},0]
[{"$nulls":4},183,{"$nulls":4},0]
[{"$nulls":4},184,{"$nulls":4},0]
[{"$nulls":4},185,{"$nulls":4},0]
[{"$nulls":4},186,{"$nulls":4},0]
[{"$nulls":4},187,{"$nulls":4},0]
[{"$nulls":4},188,{"$nulls":4},0]
[{"$nulls":4},189,{"$nulls":4},0]
[{"$nulls":4},190,{"$nulls":4},0]
[{"$nulls":4},191,{"$nulls":4},0]
[{"$nulls":4},192,{"$nulls":4},0]
[{"$nulls":4},193,{"$nulls":4},0]
[{"$nulls":4},194,{"$nulls":4},0]
[{"$nulls":4},195,{"$nulls":4},0]
[{"$nulls":4},196,{"$nulls":4},0]
[{"$nulls":4},197,{"$nulls":4},0]
[{"$nulls":4},198,{"$nulls":4},0]
[{"$nulls":4},199,{"$nulls":4},0]
[{"$nulls":4},200,{"$nulls":4},0]
[{"$nulls":4},201,{"$nulls":4},0]
[{"$nulls":4},202,{"$nulls":4},0]
[{"$nulls":4},203,{"$nulls":4},0]
[{"$nulls":4},204,{"$nulls":4},0]
[{"$nulls":4},205,{"$nulls":4},0]
[{"$nulls":4},206,{"$nulls":4},0]
[{"$nulls":4},207,{"$nulls":4},0]
[{"$nulls":4},208,{"$nulls":4},0]
[{"$nulls":4},209,{"$nulls":4},0]
[{"$nulls":4},210,{"$nulls":4},0]
[{"$nulls":4},211,{"$nulls":4},0]
[{"$nulls":4},212,{"$nulls":4},0]
[{"$nulls":4},213,{"$nulls":4},0]
[{"$nulls":4},214,{"$nulls":4},0]
[{"$nulls":4},215,{"$nulls":4},0]
[{"$nulls":4},216,{"$nulls":4},0]
[{"$nulls":4},217,{"$nulls":4},0]
[{"$nulls":4},218,{"$nulls":4},0]
[{"$nulls":4},219,{"$nulls":4},0]
[{"$nulls":4},220,{"$nulls":4},0]
[{"$nulls":4},221,{"$nulls":4},0]
[{"$nulls":4},222,{"$nulls":4},0]
[{"$nulls":4},223,{"$nulls":4},{"$f":"IF(OR(H224=5,H224=10, H224=15, H224=\"BP\",H224=\"SCR\"),\"NT\",I224)","v":0}]
[{"$nulls":4},224,{"$nulls":4},0]
[{"$nulls":4},225,{"$nulls":4},0]
[{"$nulls":4},226,{"$nulls":4},0]
[{"$nulls":4},227,{"$nulls":4},0]
[{"$nulls":4},228,{"$nulls":4},0]
[{"$nulls":4},229,{"$nulls":4},0]
[{"$nulls":4},230,{"$nulls":4},0]
[{"$nulls":4},231,{"$nulls":4},0]
[{"$nulls":4},232,{"$nulls":4},0]
[{"$nulls":4},233,{"$nulls":4},0]
[{"$nulls":4},234,{"$nulls":4},0]
[{"$nulls":4},235,{"$nulls":4},0]
[{"$nulls":4},236,{"$nulls":4},0]
[{"$nulls":4},237,{"$nulls":4},0]
[{"$nulls":4},238,{"$nulls":4},0]
[{"$nulls":4},239,{"$nulls":4},0]
[{"$nulls":4},240,{"$nulls":4},0]
[{"$nulls":4},241,{"$nulls":4},0]
[{"$nulls":4},242,{"$nulls":4},0]
[{"$nulls":4},243,{"$nulls":4},0]
[{"$nulls":4},244,{"$nulls":4},0]
[{"$nulls":4},245,{"$nulls":4},0]
[{"$nulls":4},246,{"$nulls":4},0]
[{"$nulls":4},247,{"$nulls":4},0]
[{"$nulls":4},248,{"$nulls":4},0]
[{"$nulls":4},249,{"$nulls":4},0]
[{"$nulls":4},250,{"$nulls":4},0]
[{"$nulls":4},251,{"$nulls":4},0]
[{"$nulls":4},252,{"$nulls":4},0]
[{"$nulls":4},253,{"$nulls":4},0]
[{"$nulls":4},254,{"$nulls":4},0]
[{"$nulls":4},255,{"$nulls":4},0]
[{"$nulls":4},256,{"$nulls":4},0]
[{"$nulls":4},257,{"$nulls":4},0]
[{"$nulls":4},258,{"$nulls":4},0]
[{"$nulls":4},259,{"$nulls":4},0]
[{"$nulls":4},260,{"$nulls":4},0]
[{"$nulls":4},261,{"$nulls":4},0]
[{"$nulls":4},262,{"$nulls":4},0]
[{"$nulls":4},263,{"$nulls":4},0]
[{"$nulls":4},264,{"$nulls":4},0]
[{"$nulls":4},265,{"$nulls":4},0]
[{"$nulls":4},266,{"$nulls":4},0]
[{"$nulls":4},267,{"$nulls":4},0]
[{"$nulls":4},268,{"$nulls":4},0]
[{"$nulls":4},269,{"$nulls":4},0]
[{"$nulls":4},270,{"$nulls":4},0]
[{"$nulls":4},271,{"$nulls":4},0]
[{"$nulls":4},272,{"$nulls":4},0]
[{"$nulls":4},273,{"$nulls":4},0]
[{"$nulls":4},274,{"$nulls":4},0]
[{"$nulls":4},275,{"$nulls":4},0]
[{"$nulls":4},276,{"$nulls":4},0]
[{"$nulls":4},277,{"$nulls":4},0]
[{"$nulls":4},278,{"$nulls":4},0]
[{"$nulls":4},279,{"$nulls":4},0]
[{"$nulls":4},280,{"$nulls":4},0]
[{"$nulls":4},281,{"$nulls":4},0]
[{"$nulls":4},282,{"$nulls":4},0]
[{"$nulls":4},283,{"$nulls":4},0]
[{"$nulls":4},284,{"$nulls":4},0]
[{"$nulls":4},285,{"$nulls":4},0]
[{"$nulls":4},286,{"$nulls":4},0]
[{"$nulls":4},287,{"$nulls":4},{"$f":"IF(OR(H288=5,H288=10, H288=15, H288=\"BP\",H288=\"SCR\"),\"NT\",I288)","v":0}]
[{"$nulls":4},288,{"$nulls":4},0]
[{"$nulls":4},289,{"$nulls":4},0]
[{"$nulls":4},290,{"$nulls":4},0]
[{"$nulls":4},291,{"$nulls":4},0]
[{"$nulls":4},292,{"$nulls":4},0]
[{"$nulls":4},293,{"$nulls":4},0]
[{"$nulls":4},294,{"$nulls":4},0]
[{"$nulls":4},295,{"$nulls":4},0]
[{"$nulls":4},296,{"$nulls":4},0]
[{"$nulls":4},297,{"$nulls":4},0]
[{"$nulls":4},298,{"$nulls":4},0]
[{"$nulls":4},299,{"$nulls":4},0]
[{"$nulls":4},300,{"$nulls":4},0]

{"sheet":"12 & Under","index":8,"n_rows":301,"n_cols":11,"rows_kept":301,"cut":false,"hidden":true,"merged":[]}
["Futurity","Der","Age Inct.","R/O","Draw","Rider Name","Horse Name","Time","Final Time","Placing","Money Earned"]
{"$rows_empty":31}
[{"$nulls":4},32]
[{"$nulls":4},33]
[{"$nulls":4},34]
[{"$nulls":4},35]
[{"$nulls":4},36]
[{"$nulls":4},37]
[{"$nulls":4},38]
[{"$nulls":4},39]
[{"$nulls":4},40]
[{"$nulls":4},41]
[{"$nulls":4},42]
[{"$nulls":4},43]
[{"$nulls":4},44]
[{"$nulls":4},45]
[{"$nulls":4},46]
[{"$nulls":4},47]
[{"$nulls":4},48]
[{"$nulls":4},49]
[{"$nulls":4},50]
[{"$nulls":4},51]
[{"$nulls":4},52]
[{"$nulls":4},53]
[{"$nulls":4},54]
[{"$nulls":4},55]
[{"$nulls":4},56]
[{"$nulls":4},57]
[{"$nulls":4},58]
[{"$nulls":4},59]
[{"$nulls":4},60]
[{"$nulls":4},61]
[{"$nulls":4},62]
[{"$nulls":4},63]
[{"$nulls":4},64]
[{"$nulls":4},65]
[{"$nulls":4},66]
[{"$nulls":4},67]
[{"$nulls":4},68]
[{"$nulls":4},69]
[{"$nulls":4},70]
[{"$nulls":4},71]
[{"$nulls":4},72]
[{"$nulls":4},73]
[{"$nulls":4},74]
[{"$nulls":4},75]
[{"$nulls":4},76]
[{"$nulls":4},77]
[{"$nulls":4},78]
[{"$nulls":4},79]
[{"$nulls":4},80]
[{"$nulls":4},81]
[{"$nulls":4},82]
[{"$nulls":4},83]
[{"$nulls":4},84]
[{"$nulls":4},85]
[{"$nulls":4},86]
[{"$nulls":4},87]
[{"$nulls":4},88]
[{"$nulls":4},89]
[{"$nulls":4},90]
[{"$nulls":4},91]
[{"$nulls":4},92]
[{"$nulls":4},93]
[{"$nulls":4},94]
[{"$nulls":4},95]
[{"$nulls":4},96]
[{"$nulls":4},97]
[{"$nulls":4},98]
[{"$nulls":4},99]
[{"$nulls":4},100]
[{"$nulls":4},101]
[{"$nulls":4},102]
[{"$nulls":4},103]
[{"$nulls":4},104]
[{"$nulls":4},105]
[{"$nulls":4},106]
[{"$nulls":4},107]
[{"$nulls":4},108]
[{"$nulls":4},109]
[{"$nulls":4},110]
[{"$nulls":4},111]
[{"$nulls":4},112]
[{"$nulls":4},113]
[{"$nulls":4},114]
[{"$nulls":4},115]
[{"$nulls":4},116]
[{"$nulls":4},117]
[{"$nulls":4},118]
[{"$nulls":4},119]
[{"$nulls":4},120]
[{"$nulls":4},121]
[{"$nulls":4},122]
[{"$nulls":4},123]
[{"$nulls":4},124]
[{"$nulls":4},125]
[{"$nulls":4},126]
[{"$nulls":4},127]
[{"$nulls":4},128]
[{"$nulls":4},129]
[{"$nulls":4},130]
[{"$nulls":4},131]
[{"$nulls":4},132]
[{"$nulls":4},133]
[{"$nulls":4},134]
[{"$nulls":4},135]
[{"$nulls":4},136]
[{"$nulls":4},137]
[{"$nulls":4},138]
[{"$nulls":4},139]
[{"$nulls":4},140]
[{"$nulls":4},141]
[{"$nulls":4},142]
[{"$nulls":4},143]
[{"$nulls":4},144]
[{"$nulls":4},145]
[{"$nulls":4},146]
[{"$nulls":4},147]
[{"$nulls":4},148]
[{"$nulls":4},149]
[{"$nulls":4},150]
[{"$nulls":4},151]
[{"$nulls":4},152]
[{"$nulls":4},153]
[{"$nulls":4},154]
[{"$nulls":4},155]
[{"$nulls":4},156]
[{"$nulls":4},157]
[{"$nulls":4},158]
[{"$nulls":4},159]
[{"$nulls":4},160]
[{"$nulls":4},161]
[{"$nulls":4},162]
[{"$nulls":4},163]
[{"$nulls":4},164]
[{"$nulls":4},165]
[{"$nulls":4},166]
[{"$nulls":4},167]
[{"$nulls":4},168]
[{"$nulls":4},169]
[{"$nulls":4},170]
[{"$nulls":4},171]
[{"$nulls":4},172]
[{"$nulls":4},173]
[{"$nulls":4},174]
[{"$nulls":4},175]
[{"$nulls":4},176]
[{"$nulls":4},177]
[{"$nulls":4},178]
[{"$nulls":4},179]
[{"$nulls":4},180]
[{"$nulls":4},181]
[{"$nulls":4},182]
[{"$nulls":4},183]
[{"$nulls":4},184]
[{"$nulls":4},185]
[{"$nulls":4},186]
[{"$nulls":4},187]
[{"$nulls":4},188]
[{"$nulls":4},189]
[{"$nulls":4},190]
[{"$nulls":4},191]
[{"$nulls":4},192]
[{"$nulls":4},193]
[{"$nulls":4},194]
[{"$nulls":4},195]
[{"$nulls":4},196]
[{"$nulls":4},197]
[{"$nulls":4},198]
[{"$nulls":4},199]
[{"$nulls":4},200]
[{"$nulls":4},201]
[{"$nulls":4},202]
[{"$nulls":4},203]
[{"$nulls":4},204]
[{"$nulls":4},205]
[{"$nulls":4},206]
[{"$nulls":4},207]
[{"$nulls":4},208]
[{"$nulls":4},209]
[{"$nulls":4},210]
[{"$nulls":4},211]
[{"$nulls":4},212]
[{"$nulls":4},213]
[{"$nulls":4},214]
[{"$nulls":4},215]
[{"$nulls":4},216]
[{"$nulls":4},217]
[{"$nulls":4},218]
[{"$nulls":4},219]
[{"$nulls":4},220]
[{"$nulls":4},221]
[{"$nulls":4},222]
[{"$nulls":4},223]
[{"$nulls":4},224]
[{"$nulls":4},225]
[{"$nulls":4},226]
[{"$nulls":4},227]
[{"$nulls":4},228]
[{"$nulls":4},229]
[{"$nulls":4},230]
[{"$nulls":4},231]
[{"$nulls":4},232]
[{"$nulls":4},233]
[{"$nulls":4},234]
[{"$nulls":4},235]
[{"$nulls":4},236]
[{"$nulls":4},237]
[{"$nulls":4},238]
[{"$nulls":4},239]
[{"$nulls":4},240]
[{"$nulls":4},241]
[{"$nulls":4},242]
[{"$nulls":4},243]
[{"$nulls":4},244]
[{"$nulls":4},245]
[{"$nulls":4},246]
[{"$nulls":4},247]
[{"$nulls":4},248]
[{"$nulls":4},249]
[{"$nulls":4},250]
[{"$nulls":4},251]
[{"$nulls":4},252]
[{"$nulls":4},253]
[{"$nulls":4},254]
[{"$nulls":4},255]
[{"$nulls":4},256]
[{"$nulls":4},257]
[{"$nulls":4},258]
[{"$nulls":4},259]
[{"$nulls":4},260]
[{"$nulls":4},261]
[{"$nulls":4},262]
[{"$nulls":4},263]
[{"$nulls":4},264]
[{"$nulls":4},265]
[{"$nulls":4},266]
[{"$nulls":4},267]
[{"$nulls":4},268]
[{"$nulls":4},269]
[{"$nulls":4},270]
[{"$nulls":4},271]
[{"$nulls":4},272]
[{"$nulls":4},273]
[{"$nulls":4},274]
[{"$nulls":4},275]
[{"$nulls":4},276]
[{"$nulls":4},277]
[{"$nulls":4},278]
[{"$nulls":4},279]
[{"$nulls":4},280]
[{"$nulls":4},281]
[{"$nulls":4},282]
[{"$nulls":4},283]
[{"$nulls":4},284]
[{"$nulls":4},285]
[{"$nulls":4},286]
[{"$nulls":4},287]
[{"$nulls":4},288]
[{"$nulls":4},289]
[{"$nulls":4},290]
[{"$nulls":4},291]
[{"$nulls":4},292]
[{"$nulls":4},293]
[{"$nulls":4},294]
[{"$nulls":4},295]
[{"$nulls":4},296]
[{"$nulls":4},297]
[{"$nulls":4},298]
[{"$nulls":4},299]
[{"$nulls":4},300]

{"sheet":"8&under","index":9,"n_rows":21,"n_cols":8,"rows_kept":21,"cut":false,"hidden":false,"merged":[]}
["Draw","Rider Name","Horse Name","Pen","Time","Final Time","Placing","Money Earned"]
[1,"Kyndall Pedone"]
[2,"Raylee Cook"]
[3]
[4]
[5]
[6]
[7]
[8]
[9]
[10,{"$nulls":4},{"$f":"IF(OR(D11=5,D11=10, D11=15, D11=\"BP\",D11=\"SCR\"),\"NT\",E11)","v":0}]
[11,{"$nulls":4},0]
[12,{"$nulls":4},0]
[13,{"$nulls":4},0]
[14,{"$nulls":4},0]
[15,{"$nulls":4},0]
[16,{"$nulls":4},0]
[17,{"$nulls":4},0]
[18,{"$nulls":4},0]
[19,{"$nulls":4},0]
[20,{"$nulls":4},0]

{"sheet":"Average","index":10,"n_rows":503,"n_cols":31,"rows_kept":503,"cut":false,"hidden":false,"merged":[[0,0,0,26],[1,0,1,26],[2,28,2,29],[9,28,9,29],[10,28,10,29]]}
["Parker County Arena "]
["Open"]
["4 Yr Fut","5 Yr Fut","Der","Age Inct.","Am","Carry","T/C","F/F","Mem","Nom","Av","BBR","WPRA","Draw","Owner Name","Rider Name","Horse Name","Pen","Time 1","Final Time 1","Pen","Time 2","Final Time 2","Total Time","Average Time","Placing","Money Earned",null,"D Placing",null,"Split"]
[{"$nulls":13},1,{"$nulls":5},{"$f":"IF(OR(R4=5,R4=10, R4=15, R4=\"BP\",R4=\"SCR\"),\"NT\",S4)","v":0},null,null,{"$f":"IF(OR(U4=5,U4=10, U4=15, U4=\"BP\",U4=\"SCR\"),\"NT\",V4)","v":0},{"$f":"(T4+W4)","v":0},{"$f":"(T4+W4)/2","v":0},null,null,null,"1D"]
[{"$nulls":13},2,{"$nulls":5},0,null,null,0,0,0,null,null,null,"2D",{"$f":"$AD$4+$AE$5","v":0.5},0.5]
[{"$nulls":13},3,{"$nulls":5},0,null,null,0,0,0,null,null,null,"3D",{"$f":"$AD$5+$AE$6","v":1},0.5]
[{"$nulls":13},4,{"$nulls":5},0,null,null,0,0,0,null,null,null,"4D",{"$f":"$AD$6+$AE$7","v":1.5},0.5]
[{"$nulls":13},5,{"$nulls":5},0,null,null,0,0,0,null,null,null,"5D",{"$f":"$AD$7+$AE$8","v":2},0.5]
[{"$nulls":13},6,{"$nulls":5},0,null,null,0,0,0]
[{"$nulls":13},7,{"$nulls":5},0,null,null,0,0,0,null,null,null,"# Entered"]
[{"$nulls":13},8,{"$nulls":5},0,null,null,0,0,0,null,null,null,{"$f":"COUNTA(P4:P503)","v":0}]
[{"$nulls":13},9,{"$nulls":5},0,null,null,0,0,0]
[{"$nulls":13},10,{"$nulls":5},0,null,null,0,0,0]
[{"$nulls":13},11,{"$nulls":5},0,null,null,0,0,0]
[{"$nulls":13},12,{"$nulls":5},0,null,null,0,0,0]
[{"$nulls":13},13,{"$nulls":5},0,null,null,0,0,0]
[{"$nulls":13},14,{"$nulls":5},{"$f":"IF(OR(R17=5,R17=10, R17=15, R17=\"BP\",R17=\"SCR\"),\"NT\",S17)","v":0},null,null,{"$f":"IF(OR(U17=5,U17=10, U17=15, U17=\"BP\",U17=\"SCR\"),\"NT\",V17)","v":0},{"$f":"(T17+W17)","v":0},{"$f":"(T17+W17)/2","v":0}]
[{"$nulls":13},15,{"$nulls":5},0,null,null,0,0,0]
[{"$nulls":13},16,{"$nulls":5},0,null,null,0,0,0]
[{"$nulls":13},17,{"$nulls":5},0,null,null,0,0,0]
[{"$nulls":13},18,{"$nulls":5},0,null,null,0,0,0]
[{"$nulls":13},19,{"$nulls":5},0,null,null,0,0,0]
[{"$nulls":13},20,{"$nulls":5},0,null,null,0,0,0]
[{"$nulls":13},21,{"$nulls":5},0,null,null,0,0,0]
[{"$nulls":13},22,{"$nulls":5},0,null,null,0,0,0]
[{"$nulls":13},23,{"$nulls":5},0,null,null,0,0,0]
[{"$nulls":13},24,{"$nulls":5},0,null,null,0,0,0]
[{"$nulls":13},25,{"$nulls":5},0,null,null,0,0,0]
[{"$nulls":13},26,{"$nulls":5},0,null,null,0,0,0]
[{"$nulls":13},27,{"$nulls":5},0,null,null,0,0,0]
[{"$nulls":13},28,{"$nulls":5},0,null,null,0,0,0]
[{"$nulls":13},29,{"$nulls":5},0,null,null,0,0,0]
[{"$nulls":13},30,{"$nulls":5},0,null,null,0,0,0]
[{"$nulls":13},31,{"$nulls":5},0,null,null,0,0,0]
[{"$nulls":13},32,{"$nulls":5},0,null,null,0,0,0]
[{"$nulls":13},33,{"$nulls":5},0,null,null,0,0,0]
[{"$nulls":13},34,{"$nulls":5},0,null,null,0,0,0]
[{"$nulls":13},35,{"$nulls":5},0,null,null,0,0,0]
[{"$nulls":13},36,{"$nulls":5},0,null,null,0,0,0]
[{"$nulls":13},37,{"$nulls":5},0,null,null,0,0,0]
[{"$nulls":13},38,{"$nulls":5},0,null,null,0,0,0]
[{"$nulls":13},39,{"$nulls":5},0,null,null,0,0,0]
[{"$nulls":13},40,{"$nulls":5},0,null,null,0,0,0]
[{"$nulls":13},41,{"$nulls":5},0,null,null,0,0,0]
[{"$nulls":13},42,{"$nulls":5},0,null,null,0,0,0]
[{"$nulls":13},43,{"$nulls":5},0,null,null,0,0,0]
[{"$nulls":13},44,{"$nulls":5},0,null,null,0,0,0]
[{"$nulls":13},45,{"$nulls":5},0,null,null,0,0,0]
[{"$nulls":13},46,{"$nulls":5},0,null,null,0,0,0]
[{"$nulls":13},47,{"$nulls":5},0,null,null,0,0,0]
[{"$nulls":13},48,{"$nulls":5},0,null,null,0,0,0]
[{"$nulls":13},49,{"$nulls":5},0,null,null,0,0,0]
[{"$nulls":13},50,{"$nulls":5},0,null,null,0,0,0]
[{"$nulls":13},51,{"$nulls":5},0,null,null,0,0,0]
[{"$nulls":13},52,{"$nulls":5},0,null,null,0,0,0]
[{"$nulls":13},53,{"$nulls":5},0,null,null,0,0,0]
[{"$nulls":13},54,{"$nulls":5},0,null,null,0,0,0]
[{"$nulls":13},55,{"$nulls":5},0,null,null,0,0,0]
[{"$nulls":13},56,{"$nulls":5},0,null,null,0,0,0]
[{"$nulls":13},57,{"$nulls":5},0,null,null,0,0,0]
[{"$nulls":13},58,{"$nulls":5},0,null,null,0,0,0]
[{"$nulls":13},59,{"$nulls":5},0,null,null,0,0,0]
[{"$nulls":13},60,{"$nulls":5},0,null,null,0,0,0]
[{"$nulls":13},61,{"$nulls":5},0,null,null,0,0,0]
[{"$nulls":13},62,{"$nulls":5},0,null,null,0,0,0]
[{"$nulls":13},63,{"$nulls":5},0,null,null,0,0,0]
[{"$nulls":13},64,{"$nulls":5},0,null,null,0,0,0]
[{"$nulls":13},65,{"$nulls":5},0,null,null,0,0,0]
[{"$nulls":13},66,{"$nulls":5},{"$f":"IF(OR(R69=5,R69=10, R69=15, R69=\"BP\",R69=\"SCR\"),\"NT\",S69)","v":0},null,null,{"$f":"IF(OR(U69=5,U69=10, U69=15, U69=\"BP\",U69=\"SCR\"),\"NT\",V69)","v":0},{"$f":"(T69+W69)","v":0},{"$f":"(T69+W69)/2","v":0}]
[{"$nulls":13},67,{"$nulls":5},0,null,null,0,0,0]
[{"$nulls":13},68,{"$nulls":5},0,null,null,0,0,0]
[{"$nulls":13},69,{"$nulls":5},0,null,null,0,0,0]
[{"$nulls":13},70,{"$nulls":5},0,null,null,0,0,0]
[{"$nulls":13},71,{"$nulls":5},0,null,null,0,0,0]
[{"$nulls":13},72,{"$nulls":5},0,null,null,0,0,0]
[{"$nulls":13},73,{"$nulls":5},0,null,null,0,0,0]
[{"$nulls":13},74,{"$nulls":5},0,null,null,0,0,0]
[{"$nulls":13},75,{"$nulls":5},0,null,null,0,0,0]
[{"$nulls":13},76,{"$nulls":5},0,null,null,0,0,0]
[{"$nulls":13},77,{"$nulls":5},0,null,null,0,0,0]
[{"$nulls":13},78,{"$nulls":5},0,null,null,0,0,0]
[{"$nulls":13},79,{"$nulls":5},0,null,null,0,0,0]
[{"$nulls":13},80,{"$nulls":5},0,null,null,0,0,0]
[{"$nulls":13},81,{"$nulls":5},0,null,null,0,0,0]
[{"$nulls":13},82,{"$nulls":5},0,null,null,0,0,0]
[{"$nulls":13},83,{"$nulls":5},0,null,null,0,0,0]
[{"$nulls":13},84,{"$nulls":5},0,null,null,0,0,0]
[{"$nulls":13},85,{"$nulls":5},0,null,null,0,0,0]
[{"$nulls":13},86,{"$nulls":5},0,null,null,0,0,0]
[{"$nulls":13},87,{"$nulls":5},0,null,null,0,0,0]
[{"$nulls":13},88,{"$nulls":5},0,null,null,0,0,0]
[{"$nulls":13},89,{"$nulls":5},0,null,null,0,0,0]
[{"$nulls":13},90,{"$nulls":5},0,null,null,0,0,0]
[{"$nulls":13},91,{"$nulls":5},0,null,null,0,0,0]
[{"$nulls":13},92,{"$nulls":5},0,null,null,0,0,0]
[{"$nulls":13},93,{"$nulls":5},0,null,null,0,0,0]
[{"$nulls":13},94,{"$nulls":5},0,null,null,0,0,0]
[{"$nulls":13},95,{"$nulls":5},0,null,null,0,0,0]
[{"$nulls":13},96,{"$nulls":5},0,null,null,0,0,0]
[{"$nulls":13},97,{"$nulls":5},0,null,null,0,0,0]
[{"$nulls":13},98,{"$nulls":5},0,null,null,0,0,0]
[{"$nulls":13},99,{"$nulls":5},0,null,null,0,0,0]
[{"$nulls":13},100,{"$nulls":5},0,null,null,0,0,0]
[{"$nulls":13},101,{"$nulls":5},0,null,null,0,0,0]
[{"$nulls":13},102,{"$nulls":5},0,null,null,0,0,0]
[{"$nulls":13},103,{"$nulls":5},0,null,null,0,0,0]
[{"$nulls":13},104,{"$nulls":5},0,null,null,0,0,0]
[{"$nulls":13},105,{"$nulls":5},0,null,null,0,0,0]
[{"$nulls":13},106,{"$nulls":5},0,null,null,0,0,0]
[{"$nulls":13},107,{"$nulls":5},0,null,null,0,0,0]
[{"$nulls":13},108,{"$nulls":5},0,null,null,0,0,0]
[{"$nulls":13},109,{"$nulls":5},0,null,null,0,0,0]
[{"$nulls":13},110,{"$nulls":5},0,null,null,0,0,0]
[{"$nulls":13},111,{"$nulls":5},0,null,null,0,0,0]
[{"$nulls":13},112,{"$nulls":5},0,null,null,0,0,0]
[{"$nulls":13},113,{"$nulls":5},0,null,null,0,0,0]
[{"$nulls":13},114,{"$nulls":5},0,null,null,0,0,0]
[{"$nulls":13},115,{"$nulls":5},0,null,null,0,0,0]
[{"$nulls":13},116,{"$nulls":5},0,null,null,0,0,0]
[{"$nulls":13},117,{"$nulls":5},0,null,null,0,0,0]
[{"$nulls":13},118,{"$nulls":5},0,null,null,0,0,0]
[{"$nulls":13},119,{"$nulls":5},0,null,null,0,0,0]
[{"$nulls":13},120,{"$nulls":5},0,null,null,0,0,0]
[{"$nulls":13},121,{"$nulls":5},0,null,null,0,0,0]
[{"$nulls":13},122,{"$nulls":5},0,null,null,0,0,0]
[{"$nulls":13},123,{"$nulls":5},0,null,null,0,0,0]
[{"$nulls":13},124,{"$nulls":5},0,null,null,0,0,0]
[{"$nulls":13},125,{"$nulls":5},0,null,null,0,0,0]
[{"$nulls":13},126,{"$nulls":5},0,null,null,0,0,0]
[{"$nulls":13},127,{"$nulls":5},0,null,null,0,0,0]
[{"$nulls":13},128,{"$nulls":5},0,null,null,0,0,0]
[{"$nulls":13},129,{"$nulls":5},0,null,null,0,0,0]
[{"$nulls":13},130,{"$nulls":5},{"$f":"IF(OR(R133=5,R133=10, R133=15, R133=\"BP\",R133=\"SCR\"),\"NT\",S133)","v":0},null,null,{"$f":"IF(OR(U133=5,U133=10, U133=15, U133=\"BP\",U133=\"SCR\"),\"NT\",V133)","v":0},{"$f":"(T133+W133)","v":0},{"$f":"(T133+W133)/2","v":0}]
[{"$nulls":13},131,{"$nulls":5},0,null,null,0,0,0]
[{"$nulls":13},132,{"$nulls":5},0,null,null,0,0,0]
[{"$nulls":13},133,{"$nulls":5},0,null,null,0,0,0]
[{"$nulls":13},134,{"$nulls":5},0,null,null,0,0,0]
[{"$nulls":13},135,{"$nulls":5},0,null,null,0,0,0]
[{"$nulls":13},136,{"$nulls":5},0,null,null,0,0,0]
[{"$nulls":13},137,{"$nulls":5},0,null,null,0,0,0]
[{"$nulls":13},138,{"$nulls":5},0,null,null,0,0,0]
[{"$nulls":13},139,{"$nulls":5},0,null,null,0,0,0]
[{"$nulls":13},140,{"$nulls":5},0,null,null,0,0,0]
[{"$nulls":13},141,{"$nulls":5},0,null,null,0,0,0]
[{"$nulls":13},142,{"$nulls":5},0,null,null,0,0,0]
[{"$nulls":13},143,{"$nulls":5},0,null,null,0,0,0]
[{"$nulls":13},144,{"$nulls":5},0,null,null,0,0,0]
[{"$nulls":13},145,{"$nulls":5},0,null,null,0,0,0]
[{"$nulls":13},146,{"$nulls":5},0,null,null,0,0,0]
[{"$nulls":13},147,{"$nulls":5},0,null,null,0,0,0]
[{"$nulls":13},148,{"$nulls":5},0,null,null,0,0,0]
[{"$nulls":13},149,{"$nulls":5},0,null,null,0,0,0]
[{"$nulls":13},150,{"$nulls":5},0,null,null,0,0,0]
[{"$nulls":13},151,{"$nulls":5},0,null,null,0,0,0]
[{"$nulls":13},152,{"$nulls":5},0,null,null,0,0,0]
[{"$nulls":13},153,{"$nulls":5},0,null,null,0,0,0]
[{"$nulls":13},154,{"$nulls":5},0,null,null,0,0,0]
[{"$nulls":13},155,{"$nulls":5},0,null,null,0,0,0]
[{"$nulls":13},156,{"$nulls":5},0,null,null,0,0,0]
[{"$nulls":13},157,{"$nulls":5},0,null,null,0,0,0]
[{"$nulls":13},158,{"$nulls":5},0,null,null,0,0,0]
[{"$nulls":13},159,{"$nulls":5},0,null,null,0,0,0]
[{"$nulls":13},160,{"$nulls":5},0,null,null,0,0,0]
[{"$nulls":13},161,{"$nulls":5},0,null,null,0,0,0]
[{"$nulls":13},162,{"$nulls":5},0,null,null,0,0,0]
[{"$nulls":13},163,{"$nulls":5},0,null,null,0,0,0]
[{"$nulls":13},164,{"$nulls":5},0,null,null,0,0,0]
[{"$nulls":13},165,{"$nulls":5},0,null,null,0,0,0]
[{"$nulls":13},166,{"$nulls":5},0,null,null,0,0,0]
[{"$nulls":13},167,{"$nulls":5},0,null,null,0,0,0]
[{"$nulls":13},168,{"$nulls":5},0,null,null,0,0,0]
[{"$nulls":13},169,{"$nulls":5},0,null,null,0,0,0]
[{"$nulls":13},170,{"$nulls":5},0,null,null,0,0,0]
[{"$nulls":13},171,{"$nulls":5},0,null,null,0,0,0]
[{"$nulls":13},172,{"$nulls":5},0,null,null,0,0,0]
[{"$nulls":13},173,{"$nulls":5},0,null,null,0,0,0]
[{"$nulls":13},174,{"$nulls":5},0,null,null,0,0,0]
[{"$nulls":13},175,{"$nulls":5},0,null,null,0,0,0]
[{"$nulls":13},176,{"$nulls":5},0,null,null,0,0,0]
[{"$nulls":13},177,{"$nulls":5},0,null,null,0,0,0]
[{"$nulls":13},178,{"$nulls":5},0,null,null,0,0,0]
[{"$nulls":13},179,{"$nulls":5},0,null,null,0,0,0]
[{"$nulls":13},180,{"$nulls":5},0,null,null,0,0,0]
[{"$nulls":13},181,{"$nulls":5},0,null,null,0,0,0]
[{"$nulls":13},182,{"$nulls":5},0,null,null,0,0,0]
[{"$nulls":13},183,{"$nulls":5},0,null,null,0,0,0]
[{"$nulls":13},184,{"$nulls":5},0,null,null,0,0,0]
[{"$nulls":13},185,{"$nulls":5},0,null,null,0,0,0]
[{"$nulls":13},186,{"$nulls":5},0,null,null,0,0,0]
[{"$nulls":13},187,{"$nulls":5},0,null,null,0,0,0]
[{"$nulls":13},188,{"$nulls":5},0,null,null,0,0,0]
[{"$nulls":13},189,{"$nulls":5},0,null,null,0,0,0]
[{"$nulls":13},190,{"$nulls":5},0,null,null,0,0,0]
[{"$nulls":13},191,{"$nulls":5},0,null,null,0,0,0]
[{"$nulls":13},192,{"$nulls":5},0,null,null,0,0,0]
[{"$nulls":13},193,{"$nulls":5},0,null,null,0,0,0]
[{"$nulls":13},194,{"$nulls":5},{"$f":"IF(OR(R197=5,R197=10, R197=15, R197=\"BP\",R197=\"SCR\"),\"NT\",S197)","v":0},null,null,{"$f":"IF(OR(U197=5,U197=10, U197=15, U197=\"BP\",U197=\"SCR\"),\"NT\",V197)","v":0},{"$f":"(T197+W197)","v":0},{"$f":"(T197+W197)/2","v":0}]
[{"$nulls":13},195,{"$nulls":5},0,null,null,0,0,0]
[{"$nulls":13},196,{"$nulls":5},0,null,null,0,0,0]
[{"$nulls":13},197,{"$nulls":5},0,null,null,0,0,0]
[{"$nulls":13},198,{"$nulls":5},0,null,null,0,0,0]
[{"$nulls":13},199,{"$nulls":5},0,null,null,0,0,0]
[{"$nulls":13},200,{"$nulls":5},0,null,null,0,0,0]
[{"$nulls":13},201,{"$nulls":5},0,null,null,0,0,0]
[{"$nulls":13},202,{"$nulls":5},0,null,null,0,0,0]
[{"$nulls":13},203,{"$nulls":5},0,null,null,0,0,0]
[{"$nulls":13},204,{"$nulls":5},0,null,null,0,0,0]
[{"$nulls":13},205,{"$nulls":5},0,null,null,0,0,0]
[{"$nulls":13},206,{"$nulls":5},0,null,null,0,0,0]
[{"$nulls":13},207,{"$nulls":5},0,null,null,0,0,0]
[{"$nulls":13},208,{"$nulls":5},0,null,null,0,0,0]
[{"$nulls":13},209,{"$nulls":5},0,null,null,0,0,0]
[{"$nulls":13},210,{"$nulls":5},0,null,null,0,0,0]
[{"$nulls":13},211,{"$nulls":5},0,null,null,0,0,0]
[{"$nulls":13},212,{"$nulls":5},0,null,null,0,0,0]
[{"$nulls":13},213,{"$nulls":5},0,null,null,0,0,0]
[{"$nulls":13},214,{"$nulls":5},0,null,null,0,0,0]
[{"$nulls":13},215,{"$nulls":5},0,null,null,0,0,0]
[{"$nulls":13},216,{"$nulls":5},0,null,null,0,0,0]
[{"$nulls":13},217,{"$nulls":5},0,null,null,0,0,0]
[{"$nulls":13},218,{"$nulls":5},0,null,null,0,0,0]
[{"$nulls":13},219,{"$nulls":5},0,null,null,0,0,0]
[{"$nulls":13},220,{"$nulls":5},0,null,null,0,0,0]
[{"$nulls":13},221,{"$nulls":5},0,null,null,0,0,0]
[{"$nulls":13},222,{"$nulls":5},0,null,null,0,0,0]
[{"$nulls":13},223,{"$nulls":5},0,null,null,0,0,0]
[{"$nulls":13},224,{"$nulls":5},0,null,null,0,0,0]
[{"$nulls":13},225,{"$nulls":5},0,null,null,0,0,0]
[{"$nulls":13},226,{"$nulls":5},0,null,null,0,0,0]
[{"$nulls":13},227,{"$nulls":5},0,null,null,0,0,0]
[{"$nulls":13},228,{"$nulls":5},0,null,null,0,0,0]
[{"$nulls":13},229,{"$nulls":5},0,null,null,0,0,0]
[{"$nulls":13},230,{"$nulls":5},0,null,null,0,0,0]
[{"$nulls":13},231,{"$nulls":5},0,null,null,0,0,0]
[{"$nulls":13},232,{"$nulls":5},0,null,null,0,0,0]
[{"$nulls":13},233,{"$nulls":5},0,null,null,0,0,0]
[{"$nulls":13},234,{"$nulls":5},0,null,null,0,0,0]
[{"$nulls":13},235,{"$nulls":5},0,null,null,0,0,0]
[{"$nulls":13},236,{"$nulls":5},0,null,null,0,0,0]
[{"$nulls":13},237,{"$nulls":5},0,null,null,0,0,0]
[{"$nulls":13},238,{"$nulls":5},0,null,null,0,0,0]
[{"$nulls":13},239,{"$nulls":5},0,null,null,0,0,0]
[{"$nulls":13},240,{"$nulls":5},0,null,null,0,0,0]
[{"$nulls":13},241,{"$nulls":5},0,null,null,0,0,0]
[{"$nulls":13},242,{"$nulls":5},0,null,null,0,0,0]
[{"$nulls":13},243,{"$nulls":5},0,null,null,0,0,0]
[{"$nulls":13},244,{"$nulls":5},0,null,null,0,0,0]
[{"$nulls":13},245,{"$nulls":5},0,null,null,0,0,0]
[{"$nulls":13},246,{"$nulls":5},0,null,null,0,0,0]
[{"$nulls":13},247,{"$nulls":5},0,null,null,0,0,0]
[{"$nulls":13},248,{"$nulls":5},0,null,null,0,0,0]
[{"$nulls":13},249,{"$nulls":5},0,null,null,0,0,0]
[{"$nulls":13},250,{"$nulls":5},0,null,null,0,0,0]
[{"$nulls":13},251,{"$nulls":5},0,null,null,0,0,0]
[{"$nulls":13},252,{"$nulls":5},0,null,null,0,0,0]
[{"$nulls":13},253,{"$nulls":5},0,null,null,0,0,0]
[{"$nulls":13},254,{"$nulls":5},0,null,null,0,0,0]
[{"$nulls":13},255,{"$nulls":5},0,null,null,0,0,0]
[{"$nulls":13},256,{"$nulls":5},0,null,null,0,0,0]
[{"$nulls":13},257,{"$nulls":5},0,null,null,0,0,0]
[{"$nulls":13},258,{"$nulls":5},{"$f":"IF(OR(R261=5,R261=10, R261=15, R261=\"BP\",R261=\"SCR\"),\"NT\",S261)","v":0},null,null,{"$f":"IF(OR(U261=5,U261=10, U261=15, U261=\"BP\",U261=\"SCR\"),\"NT\",V261)","v":0},{"$f":"(T261+W261)","v":0},{"$f":"(T261+W261)/2","v":0}]
[{"$nulls":13},259,{"$nulls":5},0,null,null,0,0,0]
[{"$nulls":13},260,{"$nulls":5},0,null,null,0,0,0]
[{"$nulls":13},261,{"$nulls":5},0,null,null,0,0,0]
[{"$nulls":13},262,{"$nulls":5},0,null,null,0,0,0]
[{"$nulls":13},263,{"$nulls":5},0,null,null,0,0,0]
[{"$nulls":13},264,{"$nulls":5},0,null,null,0,0,0]
[{"$nulls":13},265,{"$nulls":5},0,null,null,0,0,0]
[{"$nulls":13},266,{"$nulls":5},0,null,null,0,0,0]
[{"$nulls":13},267,{"$nulls":5},0,null,null,0,0,0]
[{"$nulls":13},268,{"$nulls":5},0,null,null,0,0,0]
[{"$nulls":13},269,{"$nulls":5},0,null,null,0,0,0]
[{"$nulls":13},270,{"$nulls":5},0,null,null,0,0,0]
[{"$nulls":13},271,{"$nulls":5},0,null,null,0,0,0]
[{"$nulls":13},272,{"$nulls":5},0,null,null,0,0,0]
[{"$nulls":13},273,{"$nulls":5},0,null,null,0,0,0]
[{"$nulls":13},274,{"$nulls":5},0,null,null,0,0,0]
[{"$nulls":13},275,{"$nulls":5},0,null,null,0,0,0]
[{"$nulls":13},276,{"$nulls":5},0,null,null,0,0,0]
[{"$nulls":13},277,{"$nulls":5},0,null,null,0,0,0]
[{"$nulls":13},278,{"$nulls":5},0,null,null,0,0,0]
[{"$nulls":13},279,{"$nulls":5},0,null,null,0,0,0]
[{"$nulls":13},280,{"$nulls":5},0,null,null,0,0,0]
[{"$nulls":13},281,{"$nulls":5},0,null,null,0,0,0]
[{"$nulls":13},282,{"$nulls":5},0,null,null,0,0,0]
[{"$nulls":13},283,{"$nulls":5},0,null,null,0,0,0]
[{"$nulls":13},284,{"$nulls":5},0,null,null,0,0,0]
[{"$nulls":13},285,{"$nulls":5},0,null,null,0,0,0]
[{"$nulls":13},286,{"$nulls":5},0,null,null,0,0,0]
[{"$nulls":13},287,{"$nulls":5},0,null,null,0,0,0]
[{"$nulls":13},288,{"$nulls":5},0,null,null,0,0,0]
[{"$nulls":13},289,{"$nulls":5},0,null,null,0,0,0]
[{"$nulls":13},290,{"$nulls":5},0,null,null,0,0,0]
[{"$nulls":13},291,{"$nulls":5},0,null,null,0,0,0]
[{"$nulls":13},292,{"$nulls":5},0,null,null,0,0,0]
[{"$nulls":13},293,{"$nulls":5},0,null,null,0,0,0]
[{"$nulls":13},294,{"$nulls":5},0,null,null,0,0,0]
[{"$nulls":13},295,{"$nulls":5},0,null,null,0,0,0]
[{"$nulls":13},296,{"$nulls":5},0,null,null,0,0,0]
[{"$nulls":13},297,{"$nulls":5},0,null,null,0,0,0]
[{"$nulls":13},298,{"$nulls":5},0,null,null,0,0,0]
[{"$nulls":13},299,{"$nulls":5},0,null,null,0,0,0]
[{"$nulls":13},300,{"$nulls":5},0,null,null,0,0,0]
[{"$nulls":13},301,{"$nulls":5},0,null,null,0,0,0]
[{"$nulls":13},302,{"$nulls":5},0,null,null,0,0,0]
[{"$nulls":13},303,{"$nulls":5},0,null,null,0,0,0]
[{"$nulls":13},304,{"$nulls":5},0,null,null,0,0,0]
[{"$nulls":13},305,{"$nulls":5},0,null,null,0,0,0]
[{"$nulls":13},306,{"$nulls":5},0,null,null,0,0,0]
[{"$nulls":13},307,{"$nulls":5},0,null,null,0,0,0]
[{"$nulls":13},308,{"$nulls":5},0,null,null,0,0,0]
[{"$nulls":13},309,{"$nulls":5},0,null,null,0,0,0]
[{"$nulls":13},310,{"$nulls":5},0,null,null,0,0,0]
[{"$nulls":13},311,{"$nulls":5},0,null,null,0,0,0]
[{"$nulls":13},312,{"$nulls":5},0,null,null,0,0,0]
[{"$nulls":13},313,{"$nulls":5},0,null,null,0,0,0]
[{"$nulls":13},314,{"$nulls":5},0,null,null,0,0,0]
[{"$nulls":13},315,{"$nulls":5},0,null,null,0,0,0]
[{"$nulls":13},316,{"$nulls":5},0,null,null,0,0,0]
[{"$nulls":13},317,{"$nulls":5},0,null,null,0,0,0]
[{"$nulls":13},318,{"$nulls":5},0,null,null,0,0,0]
[{"$nulls":13},319,{"$nulls":5},0,null,null,0,0,0]
[{"$nulls":13},320,{"$nulls":5},0,null,null,0,0,0]
[{"$nulls":13},321,{"$nulls":5},0,null,null,0,0,0]
[{"$nulls":13},322,{"$nulls":5},{"$f":"IF(OR(R325=5,R325=10, R325=15, R325=\"BP\",R325=\"SCR\"),\"NT\",S325)","v":0},null,null,{"$f":"IF(OR(U325=5,U325=10, U325=15, U325=\"BP\",U325=\"SCR\"),\"NT\",V325)","v":0},{"$f":"(T325+W325)","v":0},{"$f":"(T325+W325)/2","v":0}]
[{"$nulls":13},323,{"$nulls":5},0,null,null,0,0,0]
[{"$nulls":13},324,{"$nulls":5},0,null,null,0,0,0]
[{"$nulls":13},325,{"$nulls":5},0,null,null,0,0,0]
[{"$nulls":13},326,{"$nulls":5},0,null,null,0,0,0]
[{"$nulls":13},327,{"$nulls":5},0,null,null,0,0,0]
[{"$nulls":13},328,{"$nulls":5},0,null,null,0,0,0]
[{"$nulls":13},329,{"$nulls":5},0,null,null,0,0,0]
[{"$nulls":13},330,{"$nulls":5},0,null,null,0,0,0]
[{"$nulls":13},331,{"$nulls":5},0,null,null,0,0,0]
[{"$nulls":13},332,{"$nulls":5},0,null,null,0,0,0]
[{"$nulls":13},333,{"$nulls":5},0,null,null,0,0,0]
[{"$nulls":13},334,{"$nulls":5},0,null,null,0,0,0]
[{"$nulls":13},335,{"$nulls":5},0,null,null,0,0,0]
[{"$nulls":13},336,{"$nulls":5},0,null,null,0,0,0]
[{"$nulls":13},337,{"$nulls":5},0,null,null,0,0,0]
[{"$nulls":13},338,{"$nulls":5},0,null,null,0,0,0]
[{"$nulls":13},339,{"$nulls":5},0,null,null,0,0,0]
[{"$nulls":13},340,{"$nulls":5},0,null,null,0,0,0]
[{"$nulls":13},341,{"$nulls":5},0,null,null,0,0,0]
[{"$nulls":13},342,{"$nulls":5},0,null,null,0,0,0]
[{"$nulls":13},343,{"$nulls":5},0,null,null,0,0,0]
[{"$nulls":13},344,{"$nulls":5},0,null,null,0,0,0]
[{"$nulls":13},345,{"$nulls":5},0,null,null,0,0,0]
[{"$nulls":13},346,{"$nulls":5},0,null,null,0,0,0]
[{"$nulls":13},347,{"$nulls":5},0,null,null,0,0,0]
[{"$nulls":13},348,{"$nulls":5},0,null,null,0,0,0]
[{"$nulls":13},349,{"$nulls":5},0,null,null,0,0,0]
[{"$nulls":13},350,{"$nulls":5},0,null,null,0,0,0]
[{"$nulls":13},351,{"$nulls":5},0,null,null,0,0,0]
[{"$nulls":13},352,{"$nulls":5},0,null,null,0,0,0]
[{"$nulls":13},353,{"$nulls":5},0,null,null,0,0,0]
[{"$nulls":13},354,{"$nulls":5},0,null,null,0,0,0]
[{"$nulls":13},355,{"$nulls":5},0,null,null,0,0,0]
[{"$nulls":13},356,{"$nulls":5},0,null,null,0,0,0]
[{"$nulls":13},357,{"$nulls":5},0,null,null,0,0,0]
[{"$nulls":13},358,{"$nulls":5},0,null,null,0,0,0]
[{"$nulls":13},359,{"$nulls":5},0,null,null,0,0,0]
[{"$nulls":13},360,{"$nulls":5},0,null,null,0,0,0]
[{"$nulls":13},361,{"$nulls":5},0,null,null,0,0,0]
[{"$nulls":13},362,{"$nulls":5},0,null,null,0,0,0]
[{"$nulls":13},363,{"$nulls":5},0,null,null,0,0,0]
[{"$nulls":13},364,{"$nulls":5},0,null,null,0,0,0]
[{"$nulls":13},365,{"$nulls":5},0,null,null,0,0,0]
[{"$nulls":13},366,{"$nulls":5},0,null,null,0,0,0]
[{"$nulls":13},367,{"$nulls":5},0,null,null,0,0,0]
[{"$nulls":13},368,{"$nulls":5},0,null,null,0,0,0]
[{"$nulls":13},369,{"$nulls":5},0,null,null,0,0,0]
[{"$nulls":13},370,{"$nulls":5},0,null,null,0,0,0]
[{"$nulls":13},371,{"$nulls":5},0,null,null,0,0,0]
[{"$nulls":13},372,{"$nulls":5},0,null,null,0,0,0]
[{"$nulls":13},373,{"$nulls":5},0,null,null,0,0,0]
[{"$nulls":13},374,{"$nulls":5},0,null,null,0,0,0]
[{"$nulls":13},375,{"$nulls":5},0,null,null,0,0,0]
[{"$nulls":13},376,{"$nulls":5},0,null,null,0,0,0]
[{"$nulls":13},377,{"$nulls":5},0,null,null,0,0,0]
[{"$nulls":13},378,{"$nulls":5},0,null,null,0,0,0]
[{"$nulls":13},379,{"$nulls":5},0,null,null,0,0,0]
[{"$nulls":13},380,{"$nulls":5},0,null,null,0,0,0]
[{"$nulls":13},381,{"$nulls":5},0,null,null,0,0,0]
[{"$nulls":13},382,{"$nulls":5},0,null,null,0,0,0]
[{"$nulls":13},383,{"$nulls":5},0,null,null,0,0,0]
[{"$nulls":13},384,{"$nulls":5},0,null,null,0,0,0]
[{"$nulls":13},385,{"$nulls":5},0,null,null,0,0,0]
[{"$nulls":13},386,{"$nulls":5},{"$f":"IF(OR(R389=5,R389=10, R389=15, R389=\"BP\",R389=\"SCR\"),\"NT\",S389)","v":0},null,null,{"$f":"IF(OR(U389=5,U389=10, U389=15, U389=\"BP\",U389=\"SCR\"),\"NT\",V389)","v":0},{"$f":"(T389+W389)","v":0},{"$f":"(T389+W389)/2","v":0}]
[{"$nulls":13},387,{"$nulls":5},0,null,null,0,0,0]
[{"$nulls":13},388,{"$nulls":5},0,null,null,0,0,0]
[{"$nulls":13},389,{"$nulls":5},0,null,null,0,0,0]
[{"$nulls":13},390,{"$nulls":5},0,null,null,0,0,0]
[{"$nulls":13},391,{"$nulls":5},0,null,null,0,0,0]
[{"$nulls":13},392,{"$nulls":5},0,null,null,0,0,0]
[{"$nulls":13},393,{"$nulls":5},0,null,null,0,0,0]
[{"$nulls":13},394,{"$nulls":5},0,null,null,0,0,0]
[{"$nulls":13},395,{"$nulls":5},0,null,null,0,0,0]
[{"$nulls":13},396,{"$nulls":5},0,null,null,0,0,0]
[{"$nulls":13},397,{"$nulls":5},0,null,null,0,0,0]
[{"$nulls":13},398,{"$nulls":5},0,null,null,0,0,0]
[{"$nulls":13},399,{"$nulls":5},0,null,null,0,0,0]
[{"$nulls":13},400,{"$nulls":5},0,null,null,0,0,0]
[{"$nulls":13},401,{"$nulls":5},0,null,null,0,0,0]
[{"$nulls":13},402,{"$nulls":5},0,null,null,0,0,0]
[{"$nulls":13},403,{"$nulls":5},0,null,null,0,0,0]
[{"$nulls":13},404,{"$nulls":5},0,null,null,0,0,0]
[{"$nulls":13},405,{"$nulls":5},0,null,null,0,0,0]
[{"$nulls":13},406,{"$nulls":5},0,null,null,0,0,0]
[{"$nulls":13},407,{"$nulls":5},0,null,null,0,0,0]
[{"$nulls":13},408,{"$nulls":5},0,null,null,0,0,0]
[{"$nulls":13},409,{"$nulls":5},0,null,null,0,0,0]
[{"$nulls":13},410,{"$nulls":5},0,null,null,0,0,0]
[{"$nulls":13},411,{"$nulls":5},0,null,null,0,0,0]
[{"$nulls":13},412,{"$nulls":5},0,null,null,0,0,0]
[{"$nulls":13},413,{"$nulls":5},0,null,null,0,0,0]
[{"$nulls":13},414,{"$nulls":5},0,null,null,0,0,0]
[{"$nulls":13},415,{"$nulls":5},0,null,null,0,0,0]
[{"$nulls":13},416,{"$nulls":5},0,null,null,0,0,0]
[{"$nulls":13},417,{"$nulls":5},0,null,null,0,0,0]
[{"$nulls":13},418,{"$nulls":5},0,null,null,0,0,0]
[{"$nulls":13},419,{"$nulls":5},0,null,null,0,0,0]
[{"$nulls":13},420,{"$nulls":5},0,null,null,0,0,0]
[{"$nulls":13},421,{"$nulls":5},0,null,null,0,0,0]
[{"$nulls":13},422,{"$nulls":5},0,null,null,0,0,0]
[{"$nulls":13},423,{"$nulls":5},0,null,null,0,0,0]
[{"$nulls":13},424,{"$nulls":5},0,null,null,0,0,0]
[{"$nulls":13},425,{"$nulls":5},0,null,null,0,0,0]
[{"$nulls":13},426,{"$nulls":5},0,null,null,0,0,0]
[{"$nulls":13},427,{"$nulls":5},0,null,null,0,0,0]
[{"$nulls":13},428,{"$nulls":5},0,null,null,0,0,0]
[{"$nulls":13},429,{"$nulls":5},0,null,null,0,0,0]
[{"$nulls":13},430,{"$nulls":5},0,null,null,0,0,0]
[{"$nulls":13},431,{"$nulls":5},0,null,null,0,0,0]
[{"$nulls":13},432,{"$nulls":5},0,null,null,0,0,0]
[{"$nulls":13},433,{"$nulls":5},0,null,null,0,0,0]
[{"$nulls":13},434,{"$nulls":5},0,null,null,0,0,0]
[{"$nulls":13},435,{"$nulls":5},0,null,null,0,0,0]
[{"$nulls":13},436,{"$nulls":5},0,null,null,0,0,0]
[{"$nulls":13},437,{"$nulls":5},0,null,null,0,0,0]
[{"$nulls":13},438,{"$nulls":5},0,null,null,0,0,0]
[{"$nulls":13},439,{"$nulls":5},0,null,null,0,0,0]
[{"$nulls":13},440,{"$nulls":5},0,null,null,0,0,0]
[{"$nulls":13},441,{"$nulls":5},0,null,null,0,0,0]
[{"$nulls":13},442,{"$nulls":5},0,null,null,0,0,0]
[{"$nulls":13},443,{"$nulls":5},0,null,null,0,0,0]
[{"$nulls":13},444,{"$nulls":5},0,null,null,0,0,0]
[{"$nulls":13},445,{"$nulls":5},0,null,null,0,0,0]
[{"$nulls":13},446,{"$nulls":5},0,null,null,0,0,0]
[{"$nulls":13},447,{"$nulls":5},0,null,null,0,0,0]
[{"$nulls":13},448,{"$nulls":5},0,null,null,0,0,0]
[{"$nulls":13},449,{"$nulls":5},0,null,null,0,0,0]
[{"$nulls":13},450,{"$nulls":5},{"$f":"IF(OR(R453=5,R453=10, R453=15, R453=\"BP\",R453=\"SCR\"),\"NT\",S453)","v":0},null,null,{"$f":"IF(OR(U453=5,U453=10, U453=15, U453=\"BP\",U453=\"SCR\"),\"NT\",V453)","v":0},{"$f":"(T453+W453)","v":0},{"$f":"(T453+W453)/2","v":0}]
[{"$nulls":13},451,{"$nulls":5},0,null,null,0,0,0]
[{"$nulls":13},452,{"$nulls":5},0,null,null,0,0,0]
[{"$nulls":13},453,{"$nulls":5},0,null,null,0,0,0]
[{"$nulls":13},454,{"$nulls":5},0,null,null,0,0,0]
[{"$nulls":13},455,{"$nulls":5},0,null,null,0,0,0]
[{"$nulls":13},456,{"$nulls":5},0,null,null,0,0,0]
[{"$nulls":13},457,{"$nulls":5},0,null,null,0,0,0]
[{"$nulls":13},458,{"$nulls":5},0,null,null,0,0,0]
[{"$nulls":13},459,{"$nulls":5},0,null,null,0,0,0]
[{"$nulls":13},460,{"$nulls":5},0,null,null,0,0,0]
[{"$nulls":13},461,{"$nulls":5},0,null,null,0,0,0]
[{"$nulls":13},462,{"$nulls":5},0,null,null,0,0,0]
[{"$nulls":13},463,{"$nulls":5},0,null,null,0,0,0]
[{"$nulls":13},464,{"$nulls":5},0,null,null,0,0,0]
[{"$nulls":13},465,{"$nulls":5},0,null,null,0,0,0]
[{"$nulls":13},466,{"$nulls":5},0,null,null,0,0,0]
[{"$nulls":13},467,{"$nulls":5},0,null,null,0,0,0]
[{"$nulls":13},468,{"$nulls":5},0,null,null,0,0,0]
[{"$nulls":13},469,{"$nulls":5},0,null,null,0,0,0]
[{"$nulls":13},470,{"$nulls":5},0,null,null,0,0,0]
[{"$nulls":13},471,{"$nulls":5},0,null,null,0,0,0]
[{"$nulls":13},472,{"$nulls":5},0,null,null,0,0,0]
[{"$nulls":13},473,{"$nulls":5},0,null,null,0,0,0]
[{"$nulls":13},474,{"$nulls":5},0,null,null,0,0,0]
[{"$nulls":13},475,{"$nulls":5},0,null,null,0,0,0]
[{"$nulls":13},476,{"$nulls":5},0,null,null,0,0,0]
[{"$nulls":13},477,{"$nulls":5},0,null,null,0,0,0]
[{"$nulls":13},478,{"$nulls":5},0,null,null,0,0,0]
[{"$nulls":13},479,{"$nulls":5},0,null,null,0,0,0]
[{"$nulls":13},480,{"$nulls":5},0,null,null,0,0,0]
[{"$nulls":13},481,{"$nulls":5},0,null,null,0,0,0]
[{"$nulls":13},482,{"$nulls":5},0,null,null,0,0,0]
[{"$nulls":13},483,{"$nulls":5},0,null,null,0,0,0]
[{"$nulls":13},484,{"$nulls":5},0,null,null,0,0,0]
[{"$nulls":13},485,{"$nulls":5},0,null,null,0,0,0]
[{"$nulls":13},486,{"$nulls":5},0,null,null,0,0,0]
[{"$nulls":13},487,{"$nulls":5},0,null,null,0,0,0]
[{"$nulls":13},488,{"$nulls":5},0,null,null,0,0,0]
[{"$nulls":13},489,{"$nulls":5},0,null,null,0,0,0]
[{"$nulls":13},490,{"$nulls":5},0,null,null,0,0,0]
[{"$nulls":13},491,{"$nulls":5},0,null,null,0,0,0]
[{"$nulls":13},492,{"$nulls":5},0,null,null,0,0,0]
[{"$nulls":13},493,{"$nulls":5},0,null,null,0,0,0]
[{"$nulls":13},494,{"$nulls":5},0,null,null,0,0,0]
[{"$nulls":13},495,{"$nulls":5},0,null,null,0,0,0]
[{"$nulls":13},496,{"$nulls":5},0,null,null,0,0,0]
[{"$nulls":13},497,{"$nulls":5},0,null,null,0,0,0]
[{"$nulls":13},498,{"$nulls":5},0,null,null,0,0,0]
[{"$nulls":13},499,{"$nulls":5},0,null,null,0,0,0]
[{"$nulls":13},500,{"$nulls":5},0,null,null,0,0,0]

{"sheet":"BFA 2D Payout","index":11,"n_rows":52,"n_cols":6,"rows_kept":52,"cut":false,"hidden":true,"merged":[[19,0,19,4],[0,0,0,4],[3,0,3,4],[4,0,4,4],[11,0,11,4],[12,0,12,4],[7,3,9,4],[16,3,17,4],[51,0,51,4],[20,0,20,4],[28,0,28,4],[29,0,29,4],[39,0,39,4],[40,0,40,4],[25,3,26,4],[35,3,37,4],[46,3,49,4]]}
["BFA 2D Payout"]
["Entry Fee","# Entries","% Payback","Added $","  Total Payout","Each Go"]
[25,19,0.8,200,{"$f":"(A3*$C$3)*B3+D3","v":580},0.3]
[{"$nulls":5},{"$f":"$E$3*$F$3","v":174}]
["$5,000-7,500 Pays 5 Places         4 to 1D 1 to 2D"]
["Placings","1D",null,"2D"]
["1st",{"$f":"($F$4*$C$7)","v":57.42},0.33,{"$f":"$F$4*$E$7","v":12.180000000000001},7.0000000000000007E-2]
["2nd",{"$f":"$F$4*$C$8","v":46.980000000000004},0.27]
["3rd",{"$f":"$F$4*$C$9","v":34.800000000000004},0.2]
["4th",{"$f":"$F$4*$C$10","v":22.62},0.13]
["Totals",{"$f":"SUM(B7:B10)","v":161.82000000000002},null,{"$f":"SUM(D7:D10)","v":12.180000000000001},{"$f":"(C7+C8+C9+C10+E7+E8)","v":1}]
[{"$f":"B11+D11","v":174.00000000000003}]
["$7,501 - 10,000 Pays 6 Places        4 to 1D,  2 to 2D"]
["Placings","1D",null,"2D"]
["1st",{"$f":"$F$4*$C$15","v":50.459999999999994},0.28999999999999998,{"$f":"$F$4*$E$15","v":15.66},0.09]
["2nd",{"$f":"+$F$4*$C$16","v":41.76},0.24,{"$f":"F4*E16","v":8.7000000000000011},0.05]
["3rd",{"$f":"$F$4*$C$17","v":33.06},0.19]
["4th",{"$f":"$F$4*$C$18","v":24.360000000000003},0.14000000000000001]
["Totals",{"$f":"SUM(B15:B18)","v":149.64000000000001},null,{"$f":"D16+D15","v":24.36},{"$f":"SUM(C15+C16+C17+C18+E15+E16)","v":1}]
[{"$f":"D19+B19","v":174}]
["   $10,001 - $15,000 Payes 8 Places        5 to 1D, 3 to 2D"]
["Placings","1D",null,"2D"]
["1st",{"$f":"F4*C23","v":41.76},0.24,{"$f":"F4*E23","v":12.180000000000001},7.0000000000000007E-2]
["2nd",{"$f":"F4*C24","v":34.800000000000004},0.2,{"$f":"F4*E24","v":8.7000000000000011},0.05]
["3rd",{"$f":"F4*C25","v":29.580000000000002},0.17,{"$f":"F4*E25","v":6.96},0.04]
["4th",{"$f":"F4*C26","v":22.62},0.13]
["5th",{"$f":"F4*C27","v":17.400000000000002},0.1]
["Totals",{"$f":"SUM(B23:B27)","v":146.16},null,{"$f":"SUM(D23:D27)","v":27.840000000000003},{"$f":"C23+C24+C25+C26+C27+E23+E24+E25","v":1}]
[{"$f":"B28+D28","v":174}]
["$15,001 - $25,000 Payes 11 Places        7 to 1D, 4 to 2D"]
["Placings","1D",null,"2D"]
["1st",{"$f":"$F$4*C32","v":36.54},0.21,{"$f":"$F$4*E32","v":8.7000000000000011},0.05]
["2nd",{"$f":"$F$4*C33","v":31.32},0.18,{"$f":"$F$4*E33","v":6.96},0.04]
["3rd",26.099999999999998,0.15,5.22,0.03]
["4th",19.14,0.11,3.48,0.02]
["5th",13.92,0.08]
["6th",12.180000000000001,7.0000000000000007E-2]
["7th",10.44,0.06]
["Totals",{"$f":"SUM(B32:B38)","v":149.63999999999999},null,{"$f":"SUM(D32:D38)","v":24.36},{"$f":"C32+C33+C34+C35+C36+C37+C38+E32+E33+E34+E35","v":1.0000000000000002}]
[{"$f":"SUM(B39+D39)","v":174}]
["$25,001 - $35,000 Payes 12 Places          8 to 1D, 4 to 2D"]
["Placings","1D",null,"2D"]
["1st",{"$f":"$F$4*C43","v":33.06},0.19,{"$f":"$F$4*E43","v":8.7000000000000011},0.05]
["2nd",{"$f":"$F$4*C44","v":26.099999999999998},0.15,{"$f":"$F$4*E44","v":6.96},0.04]
["3rd",20.88,0.12,5.22,0.03]
["4th",17.400000000000002,0.1,3.48,0.02]
["5th",15.66,0.09]
["6th",13.92,0.08]
["7th",12.180000000000001,7.0000000000000007E-2]
["8th",10.44,0.06]
["Totals",{"$f":"SUM(B43:B50)","v":149.63999999999999},null,{"$f":"SUM(D43:D46)","v":24.36},{"$f":"C43+C44+C45+C46+C47+C48+C49+C50+E43+E44+E45+E46","v":1}]
[{"$f":"D51+B51","v":174}]

{"sheet":"2D Payout","index":12,"n_rows":76,"n_cols":5,"rows_kept":76,"cut":false,"hidden":false,"merged":[[36,3,36,4],[76,0,76,4],[43,0,43,4],[53,0,53,4],[65,0,65,4],[44,0,44,4],[54,0,54,4],[64,0,64,4],[45,3,45,4],[55,3,55,4],[66,3,66,4],[0,0,0,4],[8,0,8,4],[9,0,9,4],[3,0,3,4],[10,3,10,4],[5,3,6,3],[5,4,7,4],[13,0,13,4],[14,0,14,4],[20,0,20,4],[15,3,15,4],[27,0,27,4],[35,0,35,4],[34,0,34,4],[28,3,28,4],[19,0,19,4],[26,0,26,4],[21,3,21,4]]}
["2D Payout"]
["Entry Fee","# Entries","% Payback","Added $","  Total Payout"]
[50,75,0.8,1500,{"$f":"(A3*$C$3)*B3+D3","v":4500}]
[]
["% in each D",0.7,0.3,"Total % =",{"$f":"SUM(B5:C5)","v":1}]
[null,"1D","2D"]
[null,{"$f":"(($A$3*$B$3*$C$3*$B$5)+($D$3*$B$5))","v":3150},{"$f":"(($A$3*$B$3*$C$3*$C$5)+($D$3*$C$5))","v":1350}]
["Totals",{"$f":"SUM(B7)","v":3150},{"$f":"SUM(C7)","v":1350},{"$f":"SUM(B8:C8)","v":4500}]
[]
["For 1-7 riders 1 place"]
["Placings","1D","2D"]
["1st",{"$f":"$B$7*$E$12","v":3150},{"$f":"$C$7*$E$5","v":1350},"è",1]
["Totals",{"$f":"SUM(B12:B12)","v":3150},{"$f":"SUM(C12:C12)","v":1350},{"$f":"SUM(B13:C13)","v":4500},{"$f":"SUM(E12)","v":1}]
[]
["For 8-11 riders 2 places"]
["Placings","1D","2D"]
["1st",{"$f":"$B$7*$E$17","v":1890},{"$f":"$C$7*$E$17","v":810},"è",0.6]
["2nd",{"$f":"$B$7*$E$18","v":1260},{"$f":"$C$7*$E$18","v":540},"è",0.4]
["Totals",{"$f":"SUM(B17:B18)","v":3150},{"$f":"SUM(C17:C18)","v":1350},{"$f":"SUM(B19:C19)","v":4500},{"$f":"SUM(E17:E18)","v":1}]
[]
["For 12-15 riders 3 places"]
["Placings","1D","2D"]
["1st",{"$f":"$B$7*$E$23","v":1575},{"$f":"$C$7*$E$23","v":675},"è",0.5]
["2nd",{"$f":"$B$7*$E$24","v":945},{"$f":"$C$7*$E$24","v":405},"è",0.3]
["3rd",{"$f":"$B$7*$E$25","v":630},{"$f":"$C$7*$E$25","v":270},"è",0.2]
["Totals",{"$f":"SUM(B23:B25)","v":3150},{"$f":"SUM(C23:C25)","v":1350},{"$f":"SUM(B26:C26)","v":4500},{"$f":"SUM(E23:E25)","v":1}]
[]
["For 16-19 riders 4 places"]
["Placings","1D","2D"]
["1st",{"$f":"$B$7*$E$30","v":1260},{"$f":"$C$7*$E$30","v":540},"è",0.4]
["2nd",{"$f":"$B$7*$E$31","v":945},{"$f":"$C$7*$E$31","v":405},"è",0.3]
["3rd",{"$f":"$B$7*$E$32","v":630},{"$f":"$C$7*$E$32","v":270},"è",0.2]
["4th",{"$f":"$B$7*$E$33","v":315},{"$f":"$C$7*$E$33","v":135},"è",0.1]
["Totals",{"$f":"SUM(B30:B33)","v":3150},{"$f":"SUM(C30:C33)","v":1350},{"$f":"SUM(B34:C34)","v":4500},{"$f":"SUM(E30:E33)","v":0.99999999999999989}]
[]
["For 20-23 riders 5 places"]
["Placings","1D","2D"]
["1st",{"$f":"$B$7*$E$38","v":945},{"$f":"$C$7*$E$38","v":405},"è",0.3]
["2nd",{"$f":"$B$7*$E$39","v":787.5},{"$f":"$C$7*$E$39","v":337.5},"è",0.25]
["3rd",{"$f":"$B$7*$E$40","v":630},{"$f":"$C$7*$E$40","v":270},"è",0.2]
["4th",{"$f":"$B$7*$E$41","v":472.5},{"$f":"$C$7*$E$41","v":202.5},"è",0.15]
["5th",{"$f":"$B$7*$E$42","v":315},{"$f":"$C$7*$E$42","v":135},"è",0.1]
["Totals",{"$f":"SUM(B38:B42)","v":3150},{"$f":"SUM(C38:C42)","v":1350},{"$f":"SUM(B43:C43)","v":4500},{"$f":"SUM(E38:E42)","v":1}]
[]
["For 24-27 riders 6 places"]
["Placings","1D","2D"]
["1st",{"$f":"$B$7*$E$47","v":787.5},{"$f":"$C$7*$E$47","v":337.5},"è",0.25]
["2nd",{"$f":"$B$7*$E$48","v":630},{"$f":"$C$7*$E$48","v":270},"è",0.2]
["3rd",{"$f":"$B$7*$E$49","v":567},{"$f":"$C$7*$E$49","v":243},"è",0.18]
["4th",{"$f":"$B$7*$E$50","v":472.5},{"$f":"$C$7*$E$50","v":202.5},"è",0.15]
["5th",{"$f":"$B$7*$E$51","v":378},{"$f":"$C$7*$E$51","v":162},"è",0.12]
["6th",{"$f":"$B$7*$E$52","v":315},{"$f":"$C$7*$E$52","v":135},"è",0.1]
["Totals",{"$f":"SUM(B47:B52)","v":3150},{"$f":"SUM(C47:C52)","v":1350},{"$f":"SUM(B53:C53)","v":4500},{"$f":"SUM(E47:E52)","v":1}]
[]
["For 28-31 riders 7 places"]
["Placings","1D","2D"]
["1st",{"$f":"$B$7*$E$57","v":693},{"$f":"$C$7*$E$57","v":297},"è",0.22]
["2nd",{"$f":"$B$7*$E$58","v":567},{"$f":"$C$7*$E$58","v":243},"è",0.18]
["3rd",{"$f":"$B$7*$E$59","v":504},{"$f":"$C$7*$E$59","v":216},"è",0.16]
["4th",{"$f":"$B$7*$E$60","v":441.00000000000006},{"$f":"$C$7*$E$60","v":189.00000000000003},"è",0.14000000000000001]
["5th",{"$f":"$B$7*$E$61","v":378},{"$f":"$C$7*$E$61","v":162},"è",0.12]
["6th",{"$f":"$B$7*$E$62","v":315},{"$f":"$C$7*$E$62","v":135},"è",0.1]
["7th",{"$f":"$B$7*$E$63","v":252},{"$f":"$C$7*$E$63","v":108},"è",0.08]
["Totals",{"$f":"SUM(B57:B63)","v":3150},{"$f":"SUM(C57:C63)","v":1350},{"$f":"SUM(B64:C64)","v":4500},{"$f":"SUM(E57:E63)","v":1}]
[]
["For 32 or more riders 8 places"]
["Placings","1D","2D"]
["1st",{"$f":"$B$7*$E$68","v":724.5},{"$f":"$C$7*$E$68","v":310.5},"è",0.23]
["2nd",{"$f":"$B$7*$E$69","v":630},{"$f":"$C$7*$E$69","v":270},"è",0.2]
["3rd",{"$f":"$B$7*$E$70","v":535.5},{"$f":"$C$7*$E$70","v":229.50000000000003},"è",0.17]
["4th",{"$f":"$B$7*$E$71","v":441.00000000000006},{"$f":"$C$7*$E$71","v":189.00000000000003},"è",0.14000000000000001]
["5th",{"$f":"$B$7*$E$72","v":346.5},{"$f":"$C$7*$E$72","v":148.5},"è",0.11]
["6th",{"$f":"$B$7*$E$73","v":252},{"$f":"$C$7*$E$73","v":108},"è",0.08]
["7th",{"$f":"$B$7*$E$74","v":157.5},{"$f":"$C$7*$E$74","v":67.5},"è",0.05]
["8th",{"$f":"$B$7*$E$75","v":63},{"$f":"$C$7*$E$75","v":27},"è",0.02]
["Totals",{"$f":"SUM(B68:B75)","v":3150},{"$f":"SUM(C68:C75)","v":1350},{"$f":"SUM(B76:C76)","v":4500},{"$f":"SUM(E68:E75)","v":1}]

{"sheet":"3D Payout","index":13,"n_rows":76,"n_cols":6,"rows_kept":76,"cut":false,"hidden":true,"merged":[[76,0,76,5],[43,0,43,5],[53,0,53,5],[64,0,64,5],[66,4,66,5],[13,0,13,5],[19,0,19,5],[14,0,14,5],[15,4,15,5],[10,4,10,5],[0,0,0,5],[3,0,3,5],[8,0,8,5],[9,0,9,5],[5,5,7,5],[5,4,6,4],[20,0,20,5],[26,0,26,5],[65,0,65,5],[44,0,44,5],[54,0,54,5],[27,0,27,5],[35,0,35,5],[21,4,21,5],[55,4,55,5],[45,4,45,5],[36,4,36,5],[28,4,28,5],[34,0,34,5]]}
["3D Payout"]
["Entry Fee","# Entries","% Payback","$ From Entry","Added $","  Total Payout"]
[10,3,0.8,{"$f":"$A$3*$C$3*$B$3","v":24},null,{"$f":"$D$3+$E$3","v":24}]
[]
["% in each D",0.5,0.3,0.2,"Total % =",{"$f":"SUM(B5:D5)","v":1}]
[null,"1D","2D","3D"]
[null,{"$f":"(($A$3*$B$3*$C$3*$B$5)+($E$3*$B$5))","v":12},{"$f":"(($A$3*$B$3*$C$3*$C$5)+($E$3*$C$5))","v":7.1999999999999993},{"$f":"(($A$3*$B$3*$C$3*$D$5)+($E$3*$D$5))","v":4.8000000000000007}]
["Totals",{"$f":"SUM(B7)","v":12},{"$f":"SUM(C7)","v":7.1999999999999993},4.8000000000000007,{"$f":"SUM(B8:D8)","v":24}]
[]
["For 1-10 riders 1 place"]
["Placings","1D","2D","3D"]
["1st",{"$f":"$B$7*$F$12","v":12},{"$f":"$C$7*$F$12","v":7.1999999999999993},{"$f":"$D$7*$F$12","v":4.8000000000000007},"è",1]
["Totals",{"$f":"SUM(B12:B12)","v":12},{"$f":"SUM(C12:C12)","v":7.1999999999999993},{"$f":"SUM(D12:D12)","v":4.8000000000000007},{"$f":"SUM(B13:D13)","v":24},{"$f":"SUM(F12)","v":1}]
[]
["For 11-15 riders 2 places"]
["Placings","1D","2D","3D"]
["1st",{"$f":"$B$7*$F$17","v":7.1999999999999993},{"$f":"$C$7*$F$17","v":4.3199999999999994},{"$f":"$D$7*$F$17","v":2.8800000000000003},"è",0.6]
["2nd",{"$f":"$B$7*$F$18","v":4.8000000000000007},{"$f":"$C$7*$F$18","v":2.88},{"$f":"$D$7*$F$18","v":1.9200000000000004},"è",0.4]
["Totals",{"$f":"SUM(B17:B18)","v":12},{"$f":"SUM(C17:C18)","v":7.1999999999999993},{"$f":"SUM(D17:D18)","v":4.8000000000000007},{"$f":"SUM(B19:D19)","v":24},{"$f":"SUM(F17:F18)","v":1}]
[]
["For 16-30 riders 3 places"]
["Placings","1D","2D","3D"]
["1st",{"$f":"$B$7*$F$23","v":6},{"$f":"$C$7*$F$23","v":3.5999999999999996},{"$f":"$D$7*$F$23","v":2.4000000000000004},"è",0.5]
["2nd",{"$f":"$B$7*$F$24","v":3.5999999999999996},{"$f":"$C$7*$F$24","v":2.1599999999999997},{"$f":"$D$7*$F$24","v":1.4400000000000002},"è",0.3]
["3rd",{"$f":"$B$7*$F$25","v":2.4000000000000004},{"$f":"$C$7*$F$25","v":1.44},{"$f":"$D$7*$F$25","v":0.96000000000000019},"è",0.2]
["Totals",{"$f":"SUM(B23:B25)","v":12},{"$f":"SUM(C23:C25)","v":7.1999999999999993},{"$f":"SUM(D22:D25)","v":4.8000000000000007},{"$f":"SUM(B26:D26)","v":24},{"$f":"SUM(F23:F25)","v":1}]
[]
["For 31-60 riders 4 places"]
["Placings","1D","2D","3D"]
["1st",{"$f":"$B$7*$F$30","v":5.04},{"$f":"$C$7*$F$30","v":3.0239999999999996},{"$f":"$D$7*$F$30","v":2.016},"è",0.42]
["2nd",{"$f":"$B$7*$F$31","v":3.4799999999999995},{"$f":"$C$7*$F$31","v":2.0879999999999996},{"$f":"$D$7*$F$31","v":1.3920000000000001},"è",0.28999999999999998]
["3rd",{"$f":"$B$7*$F$32","v":2.2800000000000002},{"$f":"$C$7*$F$32","v":1.3679999999999999},{"$f":"$D$7*$F$32","v":0.91200000000000014},"è",0.19]
["4th",{"$f":"$B$7*$F$33","v":1.2000000000000002},{"$f":"$C$7*$F$33","v":0.72},{"$f":"$D$7*$F$33","v":0.48000000000000009},"è",0.1]
["Totals",{"$f":"SUM(B30:B33)","v":12},{"$f":"SUM(C30:C33)","v":7.1999999999999984},{"$f":"SUM(D30:D33)","v":4.8000000000000007},{"$f":"SUM(B34:D34)","v":24},{"$f":"SUM(F30:F33)","v":0.99999999999999989}]
[]
["For 61-90 riders 5 places"]
["Placings","1D","2D","3D"]
["1st",{"$f":"$B$7*$F$38","v":4.5600000000000005},{"$f":"$C$7*$F$38","v":2.7359999999999998},{"$f":"$D$7*$F$38","v":1.8240000000000003},"è",0.38]
["2nd",{"$f":"$B$7*$F$39","v":3.3600000000000003},{"$f":"$C$7*$F$39","v":2.016},{"$f":"$D$7*$F$39","v":1.3440000000000003},"è",0.28000000000000003]
["3rd",{"$f":"$B$7*$F$40","v":2.16},{"$f":"$C$7*$F$40","v":1.2959999999999998},{"$f":"$D$7*$F$40","v":0.8640000000000001},"è",0.18]
["4th",{"$f":"$B$7*$F$41","v":1.2000000000000002},{"$f":"$C$7*$F$41","v":0.72},{"$f":"$D$7*$F$41","v":0.48000000000000009},"è",0.1]
["5th",{"$f":"$B$7*$F$42","v":0.72},{"$f":"$C$7*$F$42","v":0.43199999999999994},{"$f":"$D$7*$F$42","v":0.28800000000000003},"è",0.06]
["Totals",{"$f":"SUM(B38:B42)","v":12.000000000000002},{"$f":"SUM(C38:C42)","v":7.1999999999999993},{"$f":"SUM(D38:D42)","v":4.8000000000000016},{"$f":"SUM(B43:D43)","v":24.000000000000004},{"$f":"SUM(F38:F42)","v":1}]
[]
["For 91-120 riders 6 places"]
["Placings","1D","2D","3D"]
["1st",{"$f":"$B$7*$F$47","v":4.32},{"$f":"$C$7*$F$47","v":2.5919999999999996},{"$f":"$D$7*$F$47","v":1.7280000000000002},"è",0.36]
["2nd",{"$f":"$B$7*$F$48","v":3.12},{"$f":"$C$7*$F$48","v":1.8719999999999999},{"$f":"$D$7*$F$48","v":1.2480000000000002},"è",0.26]
["3rd",{"$f":"$B$7*$F$49","v":1.92},{"$f":"$C$7*$F$49","v":1.1519999999999999},{"$f":"$D$7*$F$49","v":0.76800000000000013},"è",0.16]
["4th",{"$f":"$B$7*$F$50","v":1.2000000000000002},{"$f":"$C$7*$F$50","v":0.72},{"$f":"$D$7*$F$50","v":0.48000000000000009},"è",0.1]
["5th",{"$f":"$B$7*$F$51","v":0.84000000000000008},{"$f":"$C$7*$F$51","v":0.504},{"$f":"$D$7*$F$51","v":0.33600000000000008},"è",7.0000000000000007E-2]
["6th",{"$f":"$B$7*$F$52","v":0.60000000000000009},{"$f":"$C$7*$F$52","v":0.36},{"$f":"$D$7*$F$52","v":0.24000000000000005},"è",0.05]
["Totals",{"$f":"SUM(B47:B52)","v":11.999999999999998},{"$f":"SUM(C47:C52)","v":7.2},{"$f":"SUM(D47:D52)","v":4.8000000000000016},{"$f":"SUM(B53:D53)","v":24},{"$f":"SUM(F47:F52)","v":1}]
[]
["For 121-200 riders 7 places"]
["Placings","1D","2D","3D"]
["1st",{"$f":"$B$7*$F$57","v":3.12},{"$f":"$C$7*$F$57","v":1.8719999999999999},{"$f":"$D$7*$F$57","v":1.2480000000000002},"è",0.26]
["2nd",{"$f":"$B$7*$F$58","v":2.4000000000000004},{"$f":"$C$7*$F$58","v":1.44},{"$f":"$D$7*$F$58","v":0.96000000000000019},"è",0.2]
["3rd",{"$f":"$B$7*$F$59","v":1.7999999999999998},{"$f":"$C$7*$F$59","v":1.0799999999999998},{"$f":"$D$7*$F$59","v":0.72000000000000008},"è",0.15]
["4th",{"$f":"$B$7*$F$60","v":1.44},{"$f":"$C$7*$F$60","v":0.86399999999999988},{"$f":"$D$7*$F$60","v":0.57600000000000007},"è",0.12]
["5th",{"$f":"$B$7*$F$61","v":1.2000000000000002},{"$f":"$C$7*$F$61","v":0.72},{"$f":"$D$7*$F$61","v":0.48000000000000009},"è",0.1]
["6th",{"$f":"$B$7*$F$62","v":1.08},{"$f":"$C$7*$F$62","v":0.64799999999999991},{"$f":"$D$7*$F$62","v":0.43200000000000005},"è",0.09]
["7th",{"$f":"$B$7*$F$63","v":0.96},{"$f":"$C$7*$F$63","v":0.57599999999999996},{"$f":"$D$7*$F$63","v":0.38400000000000006},"è",0.08]
["Totals",{"$f":"SUM(B57:B63)","v":12},{"$f":"SUM(C57:C63)","v":7.1999999999999984},{"$f":"SUM(D57:D63)","v":4.8000000000000007},{"$f":"SUM(B64:D64)","v":24},{"$f":"SUM(F57:F63)","v":0.99999999999999989}]
[]
["For 201 or more riders 8 places"]
["Placings","1D","2D","3D"]
["1st",{"$f":"$B$7*0.24","v":2.88},{"$f":"$C$7*0.24","v":1.7279999999999998},{"$f":"$D$7*0.24","v":1.1520000000000001},"è",0.24]
["2nd",{"$f":"$B$7*0.18","v":2.16},{"$f":"$C$7*0.18","v":1.2959999999999998},{"$f":"$D$7*0.18","v":0.8640000000000001},"è",0.18]
["3rd",{"$f":"$B$7*0.15","v":1.7999999999999998},{"$f":"$C$7*0.15","v":1.0799999999999998},{"$f":"$D$7*0.15","v":0.72000000000000008},"è",0.15]
["4th",{"$f":"$B$7*0.12","v":1.44},{"$f":"$C$7*0.12","v":0.86399999999999988},{"$f":"$D$7*0.12","v":0.57600000000000007},"è",0.12]
["5th",{"$f":"$B$7*0.1","v":1.2000000000000002},{"$f":"$C$7*0.1","v":0.72},{"$f":"$D$7*0.1","v":0.48000000000000009},"è",0.1]
["6th",{"$f":"$B$7*0.08","v":0.96},{"$f":"$C$7*0.08","v":0.57599999999999996},{"$f":"$D$7*0.08","v":0.38400000000000006},"è",0.08]
["7th",{"$f":"$B$7*0.07","v":0.84000000000000008},{"$f":"$C$7*0.07","v":0.504},{"$f":"$D$7*0.07","v":0.33600000000000008},"è",7.0000000000000007E-2]
["8th",{"$f":"$B$7*0.06","v":0.72},{"$f":"$C$7*0.06","v":0.43199999999999994},{"$f":"$D$7*0.06","v":0.28800000000000003},"è",0.06]
["Totals",{"$f":"SUM(B68:B75)","v":12.000000000000002},{"$f":"SUM(C68:C75)","v":7.1999999999999993},{"$f":"SUM(D68:D75)","v":4.8000000000000007},{"$f":"SUM(B76:D76)","v":24.000000000000004},{"$f":"SUM(F68:F75)","v":1}]

{"sheet":"4D Payout BBR","index":14,"n_rows":172,"n_cols":7,"rows_kept":172,"cut":false,"hidden":true,"merged":[[172,0,172,5],[21,5,21,6],[15,5,15,6],[27,0,27,6],[45,5,45,6],[54,0,54,6],[28,5,28,6],[35,0,35,6],[36,5,36,6],[44,0,44,6],[19,0,19,6],[67,5,67,6],[53,0,53,6],[43,0,43,6],[34,0,34,6],[26,0,26,6],[9,0,9,6],[10,5,10,6],[13,0,13,6],[14,0,14,6],[20,0,20,6],[0,0,0,6],[3,0,3,6],[5,5,6,5],[5,6,7,6],[8,0,8,6],[55,5,55,6],[65,0,65,6],[66,0,66,6],[116,5,116,6],[138,0,138,6],[139,0,139,6],[140,5,140,6],[79,0,79,6],[80,0,80,6],[81,5,81,6],[96,0,96,6],[97,5,97,6],[95,0,95,6],[114,0,114,6],[115,0,115,6]]}
["4D Payout BBR"]
["Entry Fee","# Entries","% Payback","$ From Entry","Added $","Total Payout"]
[40,200,0.8,{"$f":"$A$3*$C$3*$B$3","v":6400},1100,{"$f":"($A$3*$C$3)*$B$3+$E$3","v":7500}]
[]
["% in each D",0.35,0.3,0.2,0.15,"Total % Payout",{"$f":"SUM(B5:E5)","v":0.99999999999999989}]
[null,"1D","2D","3D","4D"]
[null,{"$f":"(($A$3*$B$3*$C$3*0.35)+($E$3/4))","v":2515},{"$f":"(($A$3*$B$3*$C$3*0.3)+($E$3/4))","v":2195},{"$f":"(($A$3*$B$3*$C$3*0.2)+($E$3/4))","v":1555},{"$f":"(($A$3*$B$3*$C$3*0.15)+($E$3/4))","v":1235}]
["Totals",{"$f":"SUM(B7)","v":2515},{"$f":"SUM(C7)","v":2195},1555,1235,{"$f":"SUM(B8:E8)","v":7500}]
[]
["For 1-16 riders 1 place"]
["Placings","1D","2D","3D","4D"]
["1st",{"$f":"$B$7*$G$12","v":2515},{"$f":"$C$7*$G$12","v":2195},{"$f":"$D$7*$G$12","v":1555},{"$f":"$E$7*$G$12","v":1235},"è",1]
["Totals",{"$f":"SUM(B12:B12)","v":2515},{"$f":"SUM(C12:C12)","v":2195},{"$f":"SUM(D12:D12)","v":1555},{"$f":"SUM(E12:E12)","v":1235},{"$f":"SUM(B13:E13)","v":7500},{"$f":"SUM(G12)","v":1}]
[]
["For 17-33 riders 2 places"]
["Placings","1D","2D","3D","4D"]
["1st",{"$f":"$B$7*$G$17","v":1509},{"$f":"$C$7*$G$17","v":1317},{"$f":"$D$7*$G$17","v":933},{"$f":"$E$7*$G$17","v":741},"è",0.6]
["2nd",{"$f":"$B$7*$G$18","v":1006},{"$f":"$C$7*$G$18","v":878},{"$f":"$D$7*$G$18","v":622},{"$f":"$E$7*$G$18","v":494},"è",0.4]
["Totals",{"$f":"SUM(B17:B18)","v":2515},{"$f":"SUM(C17:C18)","v":2195},{"$f":"SUM(D17:D18)","v":1555},{"$f":"SUM(E17:E18)","v":1235},{"$f":"SUM(B19:E19)","v":7500},{"$f":"SUM(G17:G18)","v":1}]
[]
["For 34-66 riders 3 places"]
["Placings","1D","2D","3D","4D"]
["1st",{"$f":"$B$7*$G$23","v":1257.5},{"$f":"$C$7*$G$23","v":1097.5},{"$f":"$D$7*$G$23","v":777.5},{"$f":"$E$7*$G$23","v":617.5},"è",0.5]
["2nd",{"$f":"$B$7*$G$24","v":754.5},{"$f":"$C$7*$G$24","v":658.5},{"$f":"$D$7*$G$24","v":466.5},{"$f":"$E$7*$G$24","v":370.5},"è",0.3]
["3rd",{"$f":"$B$7*$G$25","v":503},{"$f":"$C$7*$G$25","v":439},{"$f":"$D$7*$G$25","v":311},{"$f":"$E$7*$G$25","v":247},"è",0.2]
["Totals",{"$f":"SUM(B23:B25)","v":2515},{"$f":"SUM(C23:C25)","v":2195},{"$f":"SUM(D23:D25)","v":1555},{"$f":"SUM(E23:E25)","v":1235},{"$f":"SUM(B26:E26)","v":7500},{"$f":"SUM(G23:G25)","v":1}]
[]
["For 97-95 riders 4 places"]
["Placings","1D","2D","3D","4D"]
["1st",{"$f":"$B$7*$G$30","v":1006},{"$f":"$C$7*$G$30","v":878},{"$f":"$D$7*$G$30","v":622},{"$f":"$E$7*$G$30","v":494},"è",0.4]
["2nd",{"$f":"$B$7*$G$31","v":754.5},{"$f":"$C$7*$G$31","v":658.5},{"$f":"$D$7*$G$31","v":466.5},{"$f":"$E$7*$G$31","v":370.5},"è",0.3]
["3rd",{"$f":"$B$7*$G$32","v":503},{"$f":"$C$7*$G$32","v":439},{"$f":"$D$7*$G$32","v":311},{"$f":"$E$7*$G$32","v":247},"è",0.2]
["4th",{"$f":"$B$7*$G$33","v":251.5},{"$f":"$C$7*$G$33","v":219.5},{"$f":"$D$7*$G$33","v":155.5},{"$f":"$E$7*$G$33","v":123.5},"è",0.1]
["Totals",{"$f":"SUM(B30:B33)","v":2515},{"$f":"SUM(C30:C33)","v":2195},{"$f":"SUM(D30:D33)","v":1555},{"$f":"SUM(E30:E33)","v":1235},{"$f":"SUM(B34:E34)","v":7500},{"$f":"SUM(G30:G33)","v":0.99999999999999989}]
[]
["For 96-133 riders 5 places"]
["Placings","1D","2D","3D","4D"]
["1st",{"$f":"$B$7*$G$38","v":829.95},{"$f":"$C$7*$G$38","v":724.35},{"$f":"$D$7*G38","v":513.15},{"$f":"$E$7*$G$38","v":407.55},"è",0.33]
["2nd",{"$f":"$B$7*$G$39","v":679.05000000000007},{"$f":"$C$7*$G$39","v":592.65000000000009},{"$f":"$D$7*$G$39","v":419.85},{"$f":"$E$7*$G$39","v":333.45000000000005},"è",0.27]
["3rd",{"$f":"$B$7*$G$40","v":503},{"$f":"$C$7*$G$40","v":439},{"$f":"$D$7*$G$40","v":311},{"$f":"$E$7*$G$40","v":247},"è",0.2]
["4th",{"$f":"$B$7*$G$41","v":326.95},{"$f":"$C$7*$G$41","v":285.35000000000002},{"$f":"$D$7*$G$41","v":202.15},{"$f":"$E$7*$G$41","v":160.55000000000001},"è",0.13]
["5th",{"$f":"$B$7*$G$42","v":176.05},{"$f":"$C$7*$G$42","v":153.65},{"$f":"$D$7*$G$42","v":108.85000000000001},{"$f":"$E$7*$G$42","v":86.45},"è",7.0000000000000007E-2]
["Totals",{"$f":"SUM(B38:B42)","v":2515},{"$f":"SUM(C38:C42)","v":2195},{"$f":"SUM(D38:D42)","v":1555},{"$f":"SUM(E38:E42)","v":1235},{"$f":"SUM(B43:E43)","v":7500},{"$f":"SUM(G38:G42)","v":1}]
[]
["For 134-166 riders 6 places"]
["Placings","1D","2D","3D","4D"]
["1st",{"$f":"$B$7*$G$47","v":729.34999999999991},{"$f":"$C$7*$G$47","v":636.54999999999995},{"$f":"$D$7*$G$47","v":450.95},{"$f":"$E$7*$G$47","v":358.15},"è",0.28999999999999998]
["2nd",{"$f":"$B$7*$G$48","v":603.6},{"$f":"$C$7*$G$48","v":526.79999999999995},{"$f":"$D$7*$G$48","v":373.2},{"$f":"$E$7*$G$48","v":296.39999999999998},"è",0.24]
["3rd",{"$f":"$B$7*$G$49","v":477.85},{"$f":"$C$7*$G$49","v":417.05},{"$f":"$D$7*$G$49","v":295.45},{"$f":"$E$7*$G$49","v":234.65},"è",0.19]
["4th",{"$f":"$B$7*$G$50","v":352.1},{"$f":"$C$7*$G$50","v":307.3},{"$f":"$D$7*$G$50","v":217.70000000000002},{"$f":"$E$7*$G$50","v":172.9},"è",0.14000000000000001]
["5th",{"$f":"$B$7*$G$51","v":226.35},{"$f":"$C$7*$G$51","v":197.54999999999998},{"$f":"$D$7*$G$51","v":139.94999999999999},{"$f":"$E$7*$G$51","v":111.14999999999999},"è",0.09]
["6th",{"$f":"$B$7*$G$52","v":125.75},{"$f":"$C$7*$G$52","v":109.75},{"$f":"$D$7*$G$52","v":77.75},{"$f":"$E$7*$G$52","v":61.75},"è",0.05]
["Totals",{"$f":"SUM(B47:B52)","v":2514.9999999999995},{"$f":"SUM(C47:C52)","v":2195},{"$f":"SUM(D47:D52)","v":1555},{"$f":"SUM(E47:E52)","v":1235},{"$f":"SUM(B53:E53)","v":7500},{"$f":"SUM(G47:G52)","v":1}]
[]
["For 167-222 riders 8 places"]
["Placings","1D","2D","3D","4D"]
["1st",{"$f":"$B$7*$G$57","v":603.6},{"$f":"$C$7*$G$57","v":526.79999999999995},{"$f":"$D$7*$G$57","v":373.2},{"$f":"$E$7*$G$57","v":296.39999999999998},"è",0.24]
["2nd",{"$f":"$B$7*$G$58","v":503},{"$f":"$C$7*$G$58","v":439},{"$f":"$D$7*$G$58","v":311},{"$f":"$E$7*$G$58","v":247},"è",0.2]
["3rd",{"$f":"$B$7*$G$59","v":427.55},{"$f":"$C$7*$G$59","v":373.15000000000003},{"$f":"$D$7*$G$59","v":264.35000000000002},{"$f":"$E$7*$G$59","v":209.95000000000002},"è",0.17]
["4th",{"$f":"$B$7*$G$60","v":326.95},{"$f":"$C$7*$G$60","v":285.35000000000002},{"$f":"$D$7*$G$60","v":202.15},{"$f":"$E$7*$G$60","v":160.55000000000001},"è",0.13]
["5th",{"$f":"$B$7*$G$61","v":251.5},{"$f":"$C$7*$G$61","v":219.5},{"$f":"$D$7*$G$61","v":155.5},{"$f":"$E$7*$G$61","v":123.5},"è",0.1]
["6th",{"$f":"$B$7*$G$62","v":176.05},{"$f":"$C$7*$G$62","v":153.65},{"$f":"$D$7*$G$62","v":108.85000000000001},{"$f":"$E$7*$G$62","v":86.45},"è",7.0000000000000007E-2]
["7th",{"$f":"$B$7*$G$63","v":125.75},{"$f":"$C$7*$G$63","v":109.75},{"$f":"$D$7*$G$63","v":77.75},{"$f":"$E$7*$G$63","v":61.75},"è",0.05]
["8th",{"$f":"$B$7*$G$64","v":100.60000000000001},{"$f":"$C$7*$G$64","v":87.8},{"$f":"$D$7*$G$64","v":62.2},{"$f":"$E$7*$G$64","v":49.4},"è",0.04]
["Totals",{"$f":"SUM(B57:B64)","v":2515},{"$f":"SUM(C57:C64)","v":2195.0000000000005},{"$f":"SUM(D57:D64)","v":1555},{"$f":"SUM(E57:E64)","v":1235.0000000000002},{"$f":"SUM(B65:E65)","v":7500},{"$f":"SUM(G57:G64)","v":1}]
[]
["For 223-333 riders 10 places"]
["Placings","1D","2D","3D","4D"]
["1st",{"$f":"$B$7*$G$69","v":528.15},{"$f":"$C$7*$G$69","v":460.95},{"$f":"$D$7*$G$69","v":326.55},{"$f":"$E$7*$G$69","v":259.34999999999997},"è",0.21]
["2nd",{"$f":"$B$7*$G$70","v":452.7},{"$f":"$C$7*$G$70","v":395.09999999999997},{"$f":"$D$7*$G$70","v":279.89999999999998},{"$f":"$E$7*$G$70","v":222.29999999999998},"è",0.18]
["3rd",{"$f":"$B$7*$G$71","v":377.25},{"$f":"$C$7*$G$71","v":329.25},{"$f":"$D$7*$G$71","v":233.25},{"$f":"$E$7*$G$71","v":185.25},"è",0.15]
["4th",{"$f":"$B$7*$G$72","v":301.8},{"$f":"$C$7*$G$72","v":263.39999999999998},{"$f":"$D$7*$G$72","v":186.6},{"$f":"$E$7*$G$72","v":148.19999999999999},"è",0.12]
["5th",{"$f":"$B$7*$G$73","v":226.35},{"$f":"$C$7*$G$73","v":197.54999999999998},{"$f":"$D$7*$G$73","v":139.94999999999999},{"$f":"$E$7*$G$73","v":111.14999999999999},"è",0.09]
["6th",{"$f":"$B$7*$G$74","v":176.05},{"$f":"$C$7*$G$74","v":153.65},{"$f":"$D$7*$G$74","v":108.85000000000001},{"$f":"$E$7*$G$74","v":86.45},"è",7.0000000000000007E-2]
["7th",{"$f":"$B$7*$G$75","v":150.9},{"$f":"$C$7*$G$75","v":131.69999999999999},{"$f":"$D$7*$G$75","v":93.3},{"$f":"$E$7*$G$75","v":74.099999999999994},"è",0.06]
["8th",{"$f":"$B$7*$G$76","v":125.75},{"$f":"$C$7*$G$76","v":109.75},{"$f":"$D$7*$G$76","v":77.75},{"$f":"$E$7*$G$76","v":61.75},"è",0.05]
["9th",{"$f":"$B$7*$G$77","v":100.60000000000001},{"$f":"$C$7*$G$77","v":87.8},{"$f":"$D$7*$G$77","v":62.2},{"$f":"$E$7*$G$77","v":49.4},"è",0.04]
["10th",{"$f":"$B$7*$G$78","v":75.45},{"$f":"$C$7*$G$78","v":65.849999999999994},{"$f":"$D$7*$G$78","v":46.65},{"$f":"$E$7*$G$78","v":37.049999999999997},"è",0.03]
["Totals",{"$f":"SUM(B69:B78)","v":2514.9999999999995},{"$f":"SUM(C69:C78)","v":2195},{"$f":"SUM(D69:D78)","v":1555},{"$f":"SUM(E69:E78)","v":1235},{"$f":"B79+C79+D79+E79","v":7500},{"$f":"SUM(G69:G78)","v":1.0000000000000002}]
[]
["For 334-500 riders 12 places"]
["Placings","1D","2D","3D","4D"]
["1st",{"$f":"$B$7*$G$83","v":477.85},{"$f":"$C$7*$G$83","v":417.05},{"$f":"$D$7*$G$83","v":295.45},{"$f":"$E$7*$G$83","v":234.65},"è",0.19]
["2nd",{"$f":"$B$7*$G$84","v":377.25},{"$f":"$C$7*$G$84","v":329.25},{"$f":"$D$7*$G$84","v":233.25},{"$f":"$E$7*$G$84","v":185.25},"è",0.15]
["3rd",{"$f":"$B$7*$G$85","v":301.8},{"$f":"$C$7*$G$85","v":263.39999999999998},{"$f":"$D$7*$G$85","v":186.6},{"$f":"$E$7*$G$85","v":148.19999999999999},"è",0.12]
["4th",{"$f":"$B$7*$G$86","v":251.5},{"$f":"$C$7*$G$86","v":219.5},{"$f":"$D$7*$G$86","v":155.5},{"$f":"$E$7*$G$86","v":123.5},"è",0.1]
["5th",{"$f":"$B$7*$G$87","v":226.35},{"$f":"$C$7*$G$87","v":197.54999999999998},{"$f":"$D$7*$G$87","v":139.94999999999999},{"$f":"$E$7*$G$87","v":111.14999999999999},"è",0.09]
["6th",{"$f":"$B$7*$G$88","v":201.20000000000002},{"$f":"$C$7*$G$88","v":175.6},{"$f":"$D$7*$G$88","v":124.4},{"$f":"$E$7*$G$88","v":98.8},"è",0.08]
["7th",{"$f":"$B$7*$G$89","v":176.05},{"$f":"$C$7*$G$89","v":153.65},{"$f":"$D$7*$G$89","v":108.85000000000001},{"$f":"$E$7*$G$89","v":86.45},"è",7.0000000000000007E-2]
["8th",{"$f":"$B$7*$G$90","v":150.9},{"$f":"$C$7*$G$90","v":131.69999999999999},{"$f":"$D$7*$G$90","v":93.3},{"$f":"$E$7*$G$90","v":74.099999999999994},"è",0.06]
["9th",{"$f":"$B$7*$G$91","v":125.75},{"$f":"$C$7*$G$91","v":109.75},{"$f":"$D$7*$G$91","v":77.75},{"$f":"$E$7*$G$91","v":61.75},"è",0.05]
["10th",{"$f":"$B$7*$G$92","v":100.60000000000001},{"$f":"$C$7*$G$92","v":87.8},{"$f":"$D$7*$G$92","v":62.2},{"$f":"$E$7*$G$92","v":49.4},"è",0.04]
["11th",{"$f":"$B$7*$G$93","v":75.45},{"$f":"$C$7*$G$93","v":65.849999999999994},{"$f":"$D$7*$G$93","v":46.65},{"$f":"$E$7*$G$93","v":37.049999999999997},"è",0.03]
["12th",{"$f":"$B$7*$G$94","v":50.300000000000004},{"$f":"$C$7*$G$94","v":43.9},{"$f":"$D$7*$G$94","v":31.1},{"$f":"$E$7*$G$94","v":24.7},"è",0.02]
["Totals",{"$f":"SUM(B83:B94)","v":2515},{"$f":"SUM(C83:C94)","v":2195},1555,1235,{"$f":"B95+C95+D95+E95","v":7500},{"$f":"SUM(G83:G94)","v":1}]
[]
["For 501-750 riders 15 places"]
["Placings","1D","2D","3D","4D"]
["1st",{"$f":"$B$7*$G$99","v":452.7},{"$f":"$C$7*$G$99","v":395.09999999999997},{"$f":"$D$7*$G$99","v":279.89999999999998},{"$f":"$E$7*$G$99","v":222.29999999999998},"è",0.18]
["2nd",{"$f":"$B$7*$G$100","v":377.25},{"$f":"$C$7*$G$100","v":329.25},{"$f":"$D$7*$G$100","v":233.25},{"$f":"$E$7*$G$100","v":185.25},"è",0.15]
["3rd",{"$f":"$B$7*$G$101","v":301.8},{"$f":"$C$7*$G$101","v":263.39999999999998},{"$f":"$D$7*$G$101","v":186.6},{"$f":"$E$7*$G$101","v":148.19999999999999},"è",0.12]
["4th",{"$f":"$B$7*$G$102","v":251.5},{"$f":"$C$7*$G$102","v":219.5},{"$f":"$D$7*$G$102","v":155.5},{"$f":"$E$7*$G$102","v":123.5},"è",0.1]
["5th",{"$f":"$B$7*$G$103","v":213.77500000000001},{"$f":"$C$7*$G$103","v":186.57500000000002},{"$f":"$D$7*$G$103","v":132.17500000000001},{"$f":"$E$7*$G$103","v":104.97500000000001},"è",8.5000000000000006E-2]
["6th",{"$f":"$B$7*$G$104","v":176.05},{"$f":"$C$7*$G$104","v":153.65},{"$f":"$D$7*$G$104","v":108.85000000000001},{"$f":"$E$7*$G$104","v":86.45},"è",7.0000000000000007E-2]
["7th",{"$f":"$B$7*$G$105","v":150.9},{"$f":"$C$7*$G$105","v":131.69999999999999},{"$f":"$D$7*$G$105","v":93.3},{"$f":"$E$7*$G$105","v":74.099999999999994},"è",0.06]
["8th",{"$f":"$B$7*$G$106","v":125.75},{"$f":"$C$7*$G$106","v":109.75},{"$f":"$D$7*$G$106","v":77.75},{"$f":"$E$7*$G$106","v":61.75},"è",0.05]
["9th",{"$f":"$B$7*$G$107","v":106.8875},{"$f":"$C$7*$G$107","v":93.287500000000009},{"$f":"$D$7*$G$107","v":66.087500000000006},{"$f":"$E$7*$G$107","v":52.487500000000004},"è",4.2500000000000003E-2]
["10th",{"$f":"$B$7*$G$108","v":88.025000000000006},{"$f":"$C$7*$G$108","v":76.825000000000003},{"$f":"$D$7*$G$108","v":54.425000000000004},{"$f":"$E$7*$G$108","v":43.225000000000001},"è",3.5000000000000003E-2]
["11th",{"$f":"$B$7*$G$109","v":75.45},{"$f":"$C$7*$G$109","v":65.849999999999994},{"$f":"$D$7*$G$109","v":46.65},{"$f":"$E$7*$G$109","v":37.049999999999997},"è",0.03]
["12th",{"$f":"$B$7*$G$110","v":62.875},{"$f":"$C$7*$G$110","v":54.875},{"$f":"$D$7*$G$110","v":38.875},{"$f":"$E$7*$G$110","v":30.875},"è",2.5000000000000001E-2]
["13th",{"$f":"$B$7*$G$111","v":50.300000000000004},{"$f":"$C$7*$G$111","v":43.9},{"$f":"$D$7*$G$111","v":31.1},{"$f":"$E$7*$G$111","v":24.7},"è",0.02]
["14th",{"$f":"$B$7*$G$112","v":44.012500000000003},{"$f":"$C$7*$G$112","v":38.412500000000001},{"$f":"$D$7*$G$112","v":27.212500000000002},{"$f":"$E$7*$G$112","v":21.612500000000001},"è",1.7500000000000002E-2]
["15th",{"$f":"$B$7*$G$113","v":37.725000000000001},{"$f":"$C$7*$G$113","v":32.924999999999997},{"$f":"$D$7*$G$113","v":23.324999999999999},{"$f":"$E$7*$G$113","v":18.524999999999999},"è",1.4999999999999999E-2]
["Totals",{"$f":"SUM(B99:B113)","v":2515},{"$f":"SUM(C99:C113)","v":2195},1555,1235,{"$f":"B114+C114+D114+E114","v":7500},{"$f":"SUM(G99:G113)","v":1}]
[]
["For 751-1200 riders 20 places"]
["Placings","1D","2D","3D","4D"]
["1st",{"$f":"$B$7*$G$118","v":352.1},{"$f":"$C$7*$G$118","v":307.3},{"$f":"$D$7*$G$118","v":217.70000000000002},{"$f":"$E$7*$G$118","v":172.9},"è",0.14000000000000001]
["2nd",{"$f":"$B$7*$G$119","v":276.64999999999998},{"$f":"$C$7*$G$119","v":241.45},{"$f":"$D$7*$G$119","v":171.05},{"$f":"$E$7*$G$119","v":135.85},"è",0.11]
["3rd",{"$f":"$B$7*$G$120","v":226.35},{"$f":"$C$7*$G$120","v":197.54999999999998},{"$f":"$D$7*$G$120","v":139.94999999999999},{"$f":"$E$7*$G$120","v":111.14999999999999},"è",0.09]
["4th",{"$f":"$B$7*$G$121","v":193.655},{"$f":"$C$7*$G$121","v":169.01499999999999},{"$f":"$D$7*$G$121","v":119.735},{"$f":"$E$7*$G$121","v":95.094999999999999},"è",7.6999999999999999E-2]
["5th",{"$f":"$B$7*$G$122","v":176.05},{"$f":"$C$7*$G$122","v":153.65},{"$f":"$D$7*$G$122","v":108.85000000000001},{"$f":"$E$7*$G$122","v":86.45},"è",7.0000000000000007E-2]
["6th",{"$f":"$B$7*$G$123","v":163.47499999999999},{"$f":"$C$7*$G$123","v":142.67500000000001},{"$f":"$D$7*$G$123","v":101.075},{"$f":"$E$7*$G$123","v":80.275000000000006},"è",6.5000000000000002E-2]
["7th",{"$f":"$B$7*$G$124","v":150.9},{"$f":"$C$7*$G$124","v":131.69999999999999},{"$f":"$D$7*$G$124","v":93.3},{"$f":"$E$7*$G$124","v":74.099999999999994},"è",0.06]
["8th",{"$f":"$B$7*$G$125","v":138.32499999999999},{"$f":"$C$7*$G$125","v":120.72499999999999},{"$f":"$D$7*$G$125","v":85.525000000000006},{"$f":"$E$7*$G$125","v":67.924999999999997},"è",5.5E-2]
["9th",{"$f":"$B$7*$G$126","v":125.75},{"$f":"$C$7*$G$126","v":109.75},{"$f":"$D$7*$G$126","v":77.75},{"$f":"$E$7*$G$126","v":61.75},"è",0.05]
["10th",{"$f":"$B$7*$G$127","v":113.175},{"$f":"$C$7*$G$127","v":98.774999999999991},{"$f":"$D$7*$G$127","v":69.974999999999994},{"$f":"$E$7*$G$127","v":55.574999999999996},"è",4.4999999999999998E-2]
["11th",{"$f":"$B$7*$G$128","v":100.60000000000001},{"$f":"$C$7*$G$128","v":87.8},{"$f":"$D$7*$G$128","v":62.2},{"$f":"$E$7*$G$128","v":49.4},"è",0.04]
["12th",{"$f":"$B$7*$G$129","v":93.054999999999993},{"$f":"$C$7*$G$129","v":81.214999999999989},{"$f":"$D$7*$G$129","v":57.534999999999997},{"$f":"$E$7*$G$129","v":45.695},"è",3.6999999999999998E-2]
["13th",{"$f":"$B$7*$G$130","v":82.995000000000005},{"$f":"$C$7*$G$130","v":72.435000000000002},{"$f":"$D$7*$G$130","v":51.315000000000005},{"$f":"$E$7*$G$130","v":40.755000000000003},"è",3.3000000000000002E-2]
["14th",{"$f":"$B$7*$G$131","v":72.935000000000002},{"$f":"$C$7*$G$131","v":63.655000000000001},{"$f":"$D$7*$G$131","v":45.094999999999999},{"$f":"$E$7*$G$131","v":35.815000000000005},"è",2.9000000000000001E-2]
["15th",{"$f":"$B$7*$G$132","v":62.875},{"$f":"$C$7*$G$132","v":54.875},{"$f":"$D$7*$G$132","v":38.875},{"$f":"$E$7*$G$132","v":30.875},"è",2.5000000000000001E-2]
["16th",{"$f":"$B$7*$G$133","v":52.815000000000005},{"$f":"$C$7*$G$133","v":46.095000000000006},{"$f":"$D$7*$G$133","v":32.655000000000001},{"$f":"$E$7*$G$133","v":25.935000000000002},"è",2.1000000000000001E-2]
["17th",{"$f":"$B$7*$G$134","v":42.755000000000003},{"$f":"$C$7*$G$134","v":37.315000000000005},{"$f":"$D$7*$G$134","v":26.435000000000002},{"$f":"$E$7*$G$134","v":20.995000000000001},"è",1.7000000000000001E-2]
["18th",{"$f":"$B$7*$G$135","v":35.21},{"$f":"$C$7*$G$135","v":30.73},{"$f":"$D$7*$G$135","v":21.77},{"$f":"$E$7*$G$135","v":17.29},"è",1.4E-2]
["19th",{"$f":"$B$7*$G$136","v":30.18},{"$f":"$C$7*$G$136","v":26.34},{"$f":"$D$7*$G$136","v":18.66},{"$f":"$E$7*$G$136","v":14.82},"è",1.2E-2]
["20th",{"$f":"$B$7*$G$137","v":25.150000000000002},{"$f":"$C$7*$G$137","v":21.95},{"$f":"$D$7*$G$137","v":15.55},{"$f":"$E$7*$G$137","v":12.35},"è",0.01]
["Totals",{"$f":"SUM(B118:B137)","v":2515},{"$f":"SUM(C118:C137)","v":2194.9999999999995},1555.0000000000002,1234.9999999999998,{"$f":"B138+C138+D138+E138","v":7500},{"$f":"SUM(G118:G137)","v":1.0000000000000004}]
[]
["For 1201 or More riders 30 places"]
["Placings","1D","2D","3D","4D"]
["1st",{"$f":"$B$7*$G$142","v":301.8},{"$f":"$C$7*$G$142","v":263.39999999999998},{"$f":"$D$7*$G$142","v":186.6},{"$f":"$E$7*$G$142","v":148.19999999999999},"è",0.12]
["2nd",{"$f":"$B$7*$G$143","v":238.92500000000001},{"$f":"$C$7*$G$143","v":208.52500000000001},{"$f":"$D$7*$G$143","v":147.72499999999999},{"$f":"$E$7*$G$143","v":117.325},"è",9.5000000000000001E-2]
["3rd",{"$f":"$B$7*$G$144","v":183.595},{"$f":"$C$7*$G$144","v":160.23499999999999},{"$f":"$D$7*$G$144","v":113.51499999999999},{"$f":"$E$7*$G$144","v":90.155000000000001},"è",7.2999999999999995E-2]
["4th",{"$f":"$B$7*$G$145","v":155.93},{"$f":"$C$7*$G$145","v":136.09},{"$f":"$D$7*$G$145","v":96.41},{"$f":"$E$7*$G$145","v":76.569999999999993},"è",6.2E-2]
["5th",{"$f":"$B$7*$G$146","v":125.75},{"$f":"$C$7*$G$146","v":109.75},{"$f":"$D$7*$G$146","v":77.75},{"$f":"$E$7*$G$146","v":61.75},"è",0.05]
["6th",{"$f":"$B$7*$G$147","v":113.175},{"$f":"$C$7*$G$147","v":98.774999999999991},{"$f":"$D$7*$G$147","v":69.974999999999994},{"$f":"$E$7*$G$147","v":55.574999999999996},"è",4.4999999999999998E-2]
["7th",{"$f":"$B$7*$G$148","v":108.145},{"$f":"$C$7*$G$148","v":94.384999999999991},{"$f":"$D$7*$G$148","v":66.864999999999995},{"$f":"$E$7*$G$148","v":53.104999999999997},"è",4.2999999999999997E-2]
["8th",{"$f":"$B$7*$G$149","v":100.60000000000001},{"$f":"$C$7*$G$149","v":87.8},{"$f":"$D$7*$G$149","v":62.2},{"$f":"$E$7*$G$149","v":49.4},"è",0.04]
["9th",{"$f":"$B$7*$G$150","v":93.054999999999993},{"$f":"$C$7*$G$150","v":81.214999999999989},{"$f":"$D$7*$G$150","v":57.534999999999997},{"$f":"$E$7*$G$150","v":45.695},"è",3.6999999999999998E-2]
["10th",{"$f":"$B$7*$G$151","v":88.025000000000006},{"$f":"$C$7*$G$151","v":76.825000000000003},{"$f":"$D$7*$G$151","v":54.425000000000004},{"$f":"$E$7*$G$151","v":43.225000000000001},"è",3.5000000000000003E-2]
["11th",{"$f":"$B$7*$G$152","v":82.995000000000005},{"$f":"$C$7*$G$152","v":72.435000000000002},{"$f":"$D$7*$G$152","v":51.315000000000005},{"$f":"$E$7*$G$152","v":40.755000000000003},"è",3.3000000000000002E-2]
["12th",{"$f":"$B$7*$G$153","v":77.965000000000003},{"$f":"$C$7*$G$153","v":68.045000000000002},{"$f":"$D$7*$G$153","v":48.204999999999998},{"$f":"$E$7*$G$153","v":38.284999999999997},"è",3.1E-2]
["13th",{"$f":"$B$7*$G$154","v":72.935000000000002},{"$f":"$C$7*$G$154","v":63.655000000000001},{"$f":"$D$7*$G$154","v":45.094999999999999},{"$f":"$E$7*$G$154","v":35.815000000000005},"è",2.9000000000000001E-2]
["14th",{"$f":"$B$7*$G$155","v":67.905000000000001},{"$f":"$C$7*$G$155","v":59.265000000000001},{"$f":"$D$7*$G$155","v":41.984999999999999},{"$f":"$E$7*$G$155","v":33.344999999999999},"è",2.7E-2]
["15th",{"$f":"$B$7*$G$156","v":62.875},{"$f":"$C$7*$G$156","v":54.875},{"$f":"$D$7*$G$156","v":38.875},{"$f":"$E$7*$G$156","v":30.875},"è",2.5000000000000001E-2]
["16th",{"$f":"$B$7*$G$157","v":60.36},{"$f":"$C$7*$G$157","v":52.68},{"$f":"$D$7*$G$157","v":37.32},{"$f":"$E$7*$G$157","v":29.64},"è",2.4E-2]
["17th",{"$f":"$B$7*$G$158","v":57.844999999999999},{"$f":"$C$7*$G$158","v":50.484999999999999},{"$f":"$D$7*$G$158","v":35.765000000000001},{"$f":"$E$7*$G$158","v":28.405000000000001},"è",2.3E-2]
["18th",{"$f":"$B$7*$G$159","v":55.33},{"$f":"$C$7*$G$159","v":48.29},{"$f":"$D$7*$G$159","v":34.21},{"$f":"$E$7*$G$159","v":27.169999999999998},"è",2.1999999999999999E-2]
["19th",{"$f":"$B$7*$G$160","v":52.815000000000005},{"$f":"$C$7*$G$160","v":46.095000000000006},{"$f":"$D$7*$G$160","v":32.655000000000001},{"$f":"$E$7*$G$160","v":25.935000000000002},"è",2.1000000000000001E-2]
["20th",{"$f":"$B$7*$G$161","v":50.300000000000004},{"$f":"$C$7*$G$161","v":43.9},{"$f":"$D$7*$G$161","v":31.1},{"$f":"$E$7*$G$161","v":24.7},"è",0.02]
["21st",{"$f":"$B$7*$G$162","v":47.784999999999997},{"$f":"$C$7*$G$162","v":41.704999999999998},{"$f":"$D$7*$G$162","v":29.544999999999998},{"$f":"$E$7*$G$162","v":23.465},"è",1.9E-2]
["22nd",{"$f":"$B$7*$G$163","v":45.269999999999996},{"$f":"$C$7*$G$163","v":39.51},{"$f":"$D$7*$G$163","v":27.99},{"$f":"$E$7*$G$163","v":22.229999999999997},"è",1.7999999999999999E-2]
["23rd",{"$f":"$B$7*$G$164","v":42.755000000000003},{"$f":"$C$7*$G$164","v":37.315000000000005},{"$f":"$D$7*$G$164","v":26.435000000000002},{"$f":"$E$7*$G$164","v":20.995000000000001},"è",1.7000000000000001E-2]
["24th",{"$f":"$B$7*$G$165","v":40.24},{"$f":"$C$7*$G$165","v":35.119999999999997},{"$f":"$D$7*$G$165","v":24.88},{"$f":"$E$7*$G$165","v":19.760000000000002},"è",1.6E-2]
["25th",{"$f":"$B$7*$G$166","v":37.725000000000001},{"$f":"$C$7*$G$166","v":32.924999999999997},{"$f":"$D$7*$G$166","v":23.324999999999999},{"$f":"$E$7*$G$166","v":18.524999999999999},"è",1.4999999999999999E-2]
["26th",{"$f":"$B$7*$G$167","v":35.21},{"$f":"$C$7*$G$167","v":30.73},{"$f":"$D$7*$G$167","v":21.77},{"$f":"$E$7*$G$167","v":17.29},"è",1.4E-2]
["27th",{"$f":"$B$7*$G$168","v":32.695},{"$f":"$C$7*$G$168","v":28.535},{"$f":"$D$7*$G$168","v":20.215},{"$f":"$E$7*$G$168","v":16.055},"è",1.2999999999999999E-2]
["28th",{"$f":"$B$7*$G$169","v":30.18},{"$f":"$C$7*$G$169","v":26.34},{"$f":"$D$7*$G$169","v":18.66},{"$f":"$E$7*$G$169","v":14.82},"è",1.2E-2]
["29th",{"$f":"$B$7*$G$170","v":27.664999999999999},{"$f":"$C$7*$G$170","v":24.145},{"$f":"$D$7*$G$170","v":17.105},{"$f":"$E$7*$G$170","v":13.584999999999999},"è",1.0999999999999999E-2]
["30th",{"$f":"$B$7*$G$171","v":25.150000000000002},{"$f":"$C$7*$G$171","v":21.95},{"$f":"$D$7*$G$171","v":15.55},{"$f":"$E$7*$G$171","v":12.35},"è",0.01]
["Totals",{"$f":"SUM(B142:B171)","v":2514.9999999999995},{"$f":"SUM(C142:C171)","v":2194.9999999999995},{"$f":"SUM(D142:D171)","v":1555},{"$f":"SUM(E142:E171)","v":1234.9999999999998},{"$f":"B172+C172+D172+E172","v":7499.9999999999991},{"$f":"SUM(G142:G171)","v":1.0000000000000002}]

{"sheet":"5D Payout BBR","index":15,"n_rows":172,"n_cols":8,"rows_kept":172,"cut":false,"hidden":false,"merged":[[10,6,10,7],[13,0,13,7],[14,0,14,7],[140,6,140,7],[5,7,7,7],[15,6,15,7],[19,0,19,7],[20,0,20,7],[21,6,21,7],[26,0,26,7],[27,0,27,7],[28,6,28,7],[34,0,34,7],[35,0,35,7],[36,6,36,7],[43,0,43,7],[0,0,0,7],[3,0,3,7],[8,0,8,7],[9,0,9,7],[5,6,6,6],[44,0,44,7],[45,6,45,7],[53,0,53,7],[54,0,54,7],[55,6,55,7],[65,0,65,7],[66,0,66,7],[79,0,79,7],[67,6,67,7],[138,0,138,7],[139,0,139,7],[80,0,80,7],[95,0,95,7],[96,0,96,7],[81,6,81,7],[97,6,97,7],[116,6,116,7],[114,0,114,7],[115,0,115,7]]}
["5D Payout BBR"]
["Entry Fee","# Entries","% Payback","$ From Entry","Added $","Total Payout","Total $ Held"]
[50,415,0.8,{"$f":"$A$3*$C$3*$B$3","v":16600},2000,{"$f":"($A$3*$C$3)*$B$3+$E$3","v":18600},{"$f":"$A$3*(100%-$C$3)*$B$3","v":4149.9999999999991}]
[]
["% in each D",0.3,0.25,0.2,0.15,0.1,"Total % Payout",{"$f":"SUM(B5:F5)","v":1}]
[null,"1D","2D","3D","4D","5D"]
[null,{"$f":"(($A$3*$B$3*$C$3*$B$5)+($E$3*$B$5))","v":5580},{"$f":"(($A$3*$B$3*$C$3*$C$5)+($E$3*$C$5))","v":4650},{"$f":"(($A$3*$B$3*$C$3*$D$5)+($E$3*$D$5))","v":3720},{"$f":"(($A$3*$B$3*$C$3*$E$5)+($E$3*$E$5))","v":2790},{"$f":"(($A$3*$B$3*$C$3*$F$5)+($E$3*$F$5))","v":1860}]
["Totals",{"$f":"SUM(B7)","v":5580},{"$f":"SUM(C7)","v":4650},3720,2790,1860,{"$f":"SUM(B8:F8)","v":18600}]
[]
["For 1-25 riders 1 place"]
["Placings","1D","2D","3D","4D","5D"]
["1st",{"$f":"$B$7*$H$12","v":5580},{"$f":"$C$7*$H$12","v":4650},{"$f":"$D$7*$H$12","v":3720},{"$f":"$E$7*$H$12","v":2790},{"$f":"$F$7*$H$12","v":1860},"è",1]
["Totals",{"$f":"SUM(B12:B12)","v":5580},{"$f":"SUM(C12:C12)","v":4650},{"$f":"SUM(D12:D12)","v":3720},{"$f":"SUM(E12:E12)","v":2790},{"$f":"SUM(F12)","v":1860},{"$f":"SUM(B13:F13)","v":18600},{"$f":"SUM(H12)","v":1}]
[]
["For 26-50 riders 2 places"]
["Placings","1D","2D","3D","4D","5D"]
["1st",{"$f":"$B$7*$H$17","v":3348},{"$f":"$C$7*$H$17","v":2790},{"$f":"$D$7*$H$17","v":2232},{"$f":"$E$7*$H$17","v":1674},{"$f":"$F$7*$H$17","v":1116},"è",0.6]
["2nd",{"$f":"$B$7*$H$18","v":2232},{"$f":"$C$7*$H$18","v":1860},{"$f":"$D$7*$H$18","v":1488},{"$f":"$E$7*$H$18","v":1116},{"$f":"$F$7*$H$18","v":744},"è",0.4]
["Totals",{"$f":"SUM(B17:B18)","v":5580},{"$f":"SUM(C17:C18)","v":4650},{"$f":"SUM(D17:D18)","v":3720},{"$f":"SUM(E17:E18)","v":2790},{"$f":"SUM(F17:F18)","v":1860},{"$f":"SUM(B19:F19)","v":18600},{"$f":"SUM(H17:H18)","v":1}]
[]
["For 51-100 riders 3 places"]
["Placings","1D","2D","3D","4D","5D"]
["1st",{"$f":"$B$7*$H$23","v":2790},{"$f":"$C$7*$H$23","v":2325},{"$f":"$D$7*$H$23","v":1860},{"$f":"$E$7*$H$23","v":1395},{"$f":"$F$7*$H$23","v":930},"è",0.5]
["2nd",{"$f":"$B$7*$H$24","v":1674},{"$f":"$C$7*$H$24","v":1395},{"$f":"$D$7*$H$24","v":1116},{"$f":"$E$7*$H$24","v":837},{"$f":"$F$7*$H$24","v":558},"è",0.3]
["3rd",{"$f":"$B$7*$H$25","v":1116},{"$f":"$C$7*$H$25","v":930},{"$f":"$D$7*$H$25","v":744},{"$f":"$E$7*$H$25","v":558},{"$f":"$F$7*$H$25","v":372},"è",0.2]
["Totals",{"$f":"SUM(B23:B25)","v":5580},{"$f":"SUM(C23:C25)","v":4650},{"$f":"SUM(D23:D25)","v":3720},{"$f":"SUM(E23:E25)","v":2790},{"$f":"SUM(F23:F25)","v":1860},{"$f":"SUM(B26:F26)","v":18600},{"$f":"SUM(H23:H25)","v":1}]
[]
["For 101-143 riders 4 places"]
["Placings","1D","2D","3D","4D","5D"]
["1st",{"$f":"$B$7*$H$30","v":2232},{"$f":"$C$7*$H$30","v":1860},{"$f":"$D$7*$H$30","v":1488},{"$f":"$E$7*$H$30","v":1116},{"$f":"$F$7*$H$30","v":744},"è",0.4]
["2nd",{"$f":"$B$7*$H$31","v":1674},{"$f":"$C$7*$H$31","v":1395},{"$f":"$D$7*$H$31","v":1116},{"$f":"$E$7*$H$31","v":837},{"$f":"$F$7*$H$31","v":558},"è",0.3]
["3rd",{"$f":"$B$7*$H$32","v":1116},{"$f":"$C$7*$H$32","v":930},{"$f":"$D$7*$H$32","v":744},{"$f":"$E$7*$H$32","v":558},{"$f":"$F$7*$H$32","v":372},"è",0.2]
["4th",{"$f":"$B$7*$H$33","v":558},{"$f":"$C$7*$H$33","v":465},{"$f":"$D$7*$H$33","v":372},{"$f":"$E$7*$H$33","v":279},{"$f":"$F$7*$H$33","v":186},"è",0.1]
["Totals",{"$f":"SUM(B30:B33)","v":5580},{"$f":"SUM(C30:C33)","v":4650},{"$f":"SUM(D30:D33)","v":3720},{"$f":"SUM(E30:E33)","v":2790},{"$f":"SUM(F30:F33)","v":1860},{"$f":"SUM(B34:F34)","v":18600},{"$f":"SUM(H30:H33)","v":0.99999999999999989}]
[]
["For 144-200 riders 5 places"]
["Placings","1D","2D","3D","4D","5D"]
["1st",{"$f":"$B$7*$H$38","v":1841.4},{"$f":"$C$7*$H$38","v":1534.5},{"$f":"$D$7*$H$38","v":1227.6000000000001},{"$f":"$E$7*$H$38","v":920.7},{"$f":"$F$7*$H$38","v":613.80000000000007},"è",0.33]
["2nd",{"$f":"$B$7*$H$39","v":1506.6000000000001},{"$f":"$C$7*$H$39","v":1255.5},{"$f":"$D$7*$H$39","v":1004.4000000000001},{"$f":"$E$7*$H$39","v":753.30000000000007},{"$f":"$F$7*$H$39","v":502.20000000000005},"è",0.27]
["3rd",{"$f":"$B$7*$H$40","v":1116},{"$f":"$C$7*$H$40","v":930},{"$f":"$D$7*$H$40","v":744},{"$f":"$E$7*$H$40","v":558},{"$f":"$F$7*$H$40","v":372},"è",0.2]
["4th",{"$f":"$B$7*$H$41","v":725.4},{"$f":"$C$7*$H$41","v":604.5},{"$f":"$D$7*$H$41","v":483.6},{"$f":"$E$7*$H$41","v":362.7},{"$f":"$F$7*$H$41","v":241.8},"è",0.13]
["5th",{"$f":"$B$7*$H$42","v":390.6},{"$f":"$C$7*$H$42","v":325.50000000000006},{"$f":"$D$7*$H$42","v":260.40000000000003},{"$f":"$E$7*$H$42","v":195.3},{"$f":"$F$7*$H$42","v":130.20000000000002},"è",7.0000000000000007E-2]
["Totals",{"$f":"SUM(B38:B42)","v":5580},{"$f":"SUM(C38:C42)","v":4650},{"$f":"SUM(D38:D42)","v":3720},{"$f":"SUM(E38:E42)","v":2790},{"$f":"SUM(F38:F42)","v":1860},{"$f":"SUM(B43:F43)","v":18600},{"$f":"SUM(H38:H42)","v":1}]
[]
["For 201-250 riders 6 places"]
["Placings","1D","2D","3D","4D","5D"]
["1st",{"$f":"$B$7*$H$47","v":1618.1999999999998},{"$f":"$C$7*$H$47","v":1348.5},{"$f":"$D$7*$H$47","v":1078.8},{"$f":"$E$7*$H$47","v":809.09999999999991},{"$f":"$F$7*$H$47","v":539.4},"è",0.28999999999999998]
["2nd",{"$f":"$B$7*$H$48","v":1339.2},{"$f":"$C$7*$H$48","v":1116},{"$f":"$D$7*$H$48","v":892.8},{"$f":"$E$7*$H$48","v":669.6},{"$f":"$F$7*$H$48","v":446.4},"è",0.24]
["3rd",{"$f":"$B$7*$H$49","v":1060.2},{"$f":"$C$7*$H$49","v":883.5},{"$f":"$D$7*$H$49","v":706.8},{"$f":"$E$7*$H$49","v":530.1},{"$f":"$F$7*$H$49","v":353.4},"è",0.19]
["4th",{"$f":"$B$7*$H$50","v":781.2},{"$f":"$C$7*$H$50","v":651.00000000000011},{"$f":"$D$7*$H$50","v":520.80000000000007},{"$f":"$E$7*$H$50","v":390.6},{"$f":"$F$7*$H$50","v":260.40000000000003},"è",0.14000000000000001]
["5th",{"$f":"$B$7*$H$51","v":502.2},{"$f":"$C$7*$H$51","v":418.5},{"$f":"$D$7*$H$51","v":334.8},{"$f":"$E$7*$H$51","v":251.1},{"$f":"$F$7*$H$51","v":167.4},"è",0.09]
["6th",{"$f":"$B$7*$H$52","v":279},{"$f":"$C$7*$H$52","v":232.5},{"$f":"$D$7*$H$52","v":186},{"$f":"$E$7*$H$52","v":139.5},{"$f":"$F$7*$H$52","v":93},"è",0.05]
["Totals",{"$f":"SUM(B47:B52)","v":5579.9999999999991},{"$f":"SUM(C47:C52)","v":4650},{"$f":"SUM(D47:D52)","v":3720},{"$f":"SUM(E47:E52)","v":2789.9999999999995},{"$f":"SUM(F47:F52)","v":1860},{"$f":"SUM(B53:F53)","v":18600},{"$f":"SUM(H47:H52)","v":1}]
[]
["For 251-333 riders 8 places"]
["Placings","1D","2D","3D","4D","5D"]
["1st",{"$f":"$B$7*$H$57","v":1339.2},{"$f":"$C$7*$H$57","v":1116},{"$f":"$D$7*$H$57","v":892.8},{"$f":"$E$7*$H$57","v":669.6},{"$f":"$F$7*$H$57","v":446.4},"è",0.24]
["2nd",{"$f":"$B$7*$H$58","v":1116},{"$f":"$C$7*$H$58","v":930},{"$f":"$D$7*$H$58","v":744},{"$f":"$E$7*$H$58","v":558},{"$f":"$F$7*$H$58","v":372},"è",0.2]
["3rd",{"$f":"$B$7*$H$59","v":948.6},{"$f":"$C$7*$H$59","v":790.5},{"$f":"$D$7*$H$59","v":632.40000000000009},{"$f":"$E$7*$H$59","v":474.3},{"$f":"$F$7*$H$59","v":316.20000000000005},"è",0.17]
["4th",{"$f":"$B$7*$H$60","v":725.4},{"$f":"$C$7*$H$60","v":604.5},{"$f":"$D$7*$H$60","v":483.6},{"$f":"$E$7*$H$60","v":362.7},{"$f":"$F$7*$H$60","v":241.8},"è",0.13]
["5th",{"$f":"$B$7*$H$61","v":558},{"$f":"$C$7*$H$61","v":465},{"$f":"$D$7*$H$61","v":372},{"$f":"$E$7*$H$61","v":279},{"$f":"$F$7*$H$61","v":186},"è",0.1]
["6th",{"$f":"$B$7*$H$62","v":390.6},{"$f":"$C$7*$H$62","v":325.50000000000006},{"$f":"$D$7*$H$62","v":260.40000000000003},{"$f":"$E$7*$H$62","v":195.3},{"$f":"$F$7*$H$62","v":130.20000000000002},"è",7.0000000000000007E-2]
["7th",{"$f":"$B$7*$H$63","v":279},{"$f":"$C$7*$H$63","v":232.5},{"$f":"$D$7*$H$63","v":186},{"$f":"$E$7*$H$63","v":139.5},{"$f":"$F$7*$H$63","v":93},"è",0.05]
["8th",{"$f":"$B$7*$H$64","v":223.20000000000002},{"$f":"$C$7*$H$64","v":186},{"$f":"$D$7*$H$64","v":148.80000000000001},{"$f":"$E$7*$H$64","v":111.60000000000001},{"$f":"$F$7*$H$64","v":74.400000000000006},"è",0.04]
["Totals",{"$f":"SUM(B57:B64)","v":5580},{"$f":"SUM(C57:C64)","v":4650},{"$f":"SUM(D57:D64)","v":3720},{"$f":"SUM(E57:E64)","v":2790},{"$f":"SUM(F57:F64)","v":1860},{"$f":"SUM(B65:F65)","v":18600},{"$f":"SUM(H57:H64)","v":1}]
[]
["For 334-500 riders 10 places"]
["Placings","1D","2D","3D","4D","5D"]
["1st",{"$f":"$B$7*$H$69","v":1171.8},{"$f":"$C$7*$H$69","v":976.5},{"$f":"$D$7*$H$69","v":781.19999999999993},{"$f":"$E$7*$H$69","v":585.9},{"$f":"$F$7*$H$69","v":390.59999999999997},"è",0.21]
["2nd",{"$f":"$B$7*$H$70","v":1004.4},{"$f":"$C$7*$H$70","v":837},{"$f":"$D$7*$H$70","v":669.6},{"$f":"$E$7*$H$70","v":502.2},{"$f":"$F$7*$H$70","v":334.8},"è",0.18]
["3rd",{"$f":"$B$7*$H$71","v":837},{"$f":"$C$7*$H$71","v":697.5},{"$f":"$D$7*$H$71","v":558},{"$f":"$E$7*$H$71","v":418.5},{"$f":"$F$7*$H$71","v":279},"è",0.15]
["4th",{"$f":"$B$7*$H$72","v":669.6},{"$f":"$C$7*$H$72","v":558},{"$f":"$D$7*$H$72","v":446.4},{"$f":"$E$7*$H$72","v":334.8},{"$f":"$F$7*$H$72","v":223.2},"è",0.12]
["5th",{"$f":"$B$7*$H$73","v":502.2},{"$f":"$C$7*$H$73","v":418.5},{"$f":"$D$7*$H$73","v":334.8},{"$f":"$E$7*$H$73","v":251.1},{"$f":"$F$7*$H$73","v":167.4},"è",0.09]
["6th",{"$f":"$B$7*$H$74","v":390.6},{"$f":"$C$7*$H$74","v":325.50000000000006},{"$f":"$D$7*$H$74","v":260.40000000000003},{"$f":"$E$7*$H$74","v":195.3},{"$f":"$F$7*$H$74","v":130.20000000000002},"è",7.0000000000000007E-2]
["7th",{"$f":"$B$7*$H$75","v":334.8},{"$f":"$C$7*$H$75","v":279},{"$f":"$D$7*$H$75","v":223.2},{"$f":"$E$7*$H$75","v":167.4},{"$f":"$F$7*$H$75","v":111.6},"è",0.06]
["8th",{"$f":"$B$7*$H$76","v":279},{"$f":"$C$7*$H$76","v":232.5},{"$f":"$D$7*$H$76","v":186},{"$f":"$E$7*$H$76","v":139.5},{"$f":"$F$7*$H$76","v":93},"è",0.05]
["9th",{"$f":"$B$7*$H$77","v":223.20000000000002},{"$f":"$C$7*$H$77","v":186},{"$f":"$D$7*$H$77","v":148.80000000000001},{"$f":"$E$7*$H$77","v":111.60000000000001},{"$f":"$F$7*$H$77","v":74.400000000000006},"è",0.04]
["10th",{"$f":"$B$7*$H$78","v":167.4},{"$f":"$C$7*$H$78","v":139.5},{"$f":"$D$7*$H$78","v":111.6},{"$f":"$E$7*$H$78","v":83.7},{"$f":"$F$7*$H$78","v":55.8},"è",0.03]
["Totals",{"$f":"SUM(B69:B78)","v":5580},{"$f":"SUM(C69:C78)","v":4650},3720,2790,1860,{"$f":"SUM(B79:F79)","v":18600},{"$f":"SUM(H69:H78)","v":1.0000000000000002}]
[]
["For 501-666 riders 12 places"]
["Placings","1D","2D","3D","4D","5D"]
["1st",{"$f":"$B$7*$H$83","v":1060.2},{"$f":"$C$7*$H$83","v":883.5},{"$f":"$D$7*$H$83","v":706.8},{"$f":"$E$7*$H$83","v":530.1},{"$f":"$F$7*$H$83","v":353.4},"è",0.19]
["2nd",{"$f":"$B$7*$H$84","v":837},{"$f":"$C$7*$H$84","v":697.5},{"$f":"$D$7*$H$84","v":558},{"$f":"$E$7*$H$84","v":418.5},{"$f":"$F$7*$H$84","v":279},"è",0.15]
["3rd",{"$f":"$B$7*$H$85","v":669.6},{"$f":"$C$7*$H$85","v":558},{"$f":"$D$7*$H$85","v":446.4},{"$f":"$E$7*$H$85","v":334.8},{"$f":"$F$7*$H$85","v":223.2},"è",0.12]
["4th",{"$f":"$B$7*$H$86","v":558},{"$f":"$C$7*$H$86","v":465},{"$f":"$D$7*$H$86","v":372},{"$f":"$E$7*$H$86","v":279},{"$f":"$F$7*$H$86","v":186},"è",0.1]
["5th",{"$f":"$B$7*$H$87","v":502.2},{"$f":"$C$7*$H$87","v":418.5},{"$f":"$D$7*$H$87","v":334.8},{"$f":"$E$7*$H$87","v":251.1},{"$f":"$F$7*$H$87","v":167.4},"è",0.09]
["6th",{"$f":"$B$7*$H$88","v":446.40000000000003},{"$f":"$C$7*$H$88","v":372},{"$f":"$D$7*$H$88","v":297.60000000000002},{"$f":"$E$7*$H$88","v":223.20000000000002},{"$f":"$F$7*$H$88","v":148.80000000000001},"è",0.08]
["7th",{"$f":"$B$7*$H$89","v":390.6},{"$f":"$C$7*$H$89","v":325.50000000000006},{"$f":"$D$7*$H$89","v":260.40000000000003},{"$f":"$E$7*$H$89","v":195.3},{"$f":"$F$7*$H$89","v":130.20000000000002},"è",7.0000000000000007E-2]
["8th",{"$f":"$B$7*$H$90","v":334.8},{"$f":"$C$7*$H$90","v":279},{"$f":"$D$7*$H$90","v":223.2},{"$f":"$E$7*$H$90","v":167.4},{"$f":"$F$7*$H$90","v":111.6},"è",0.06]
["9th",{"$f":"$B$7*$H$91","v":279},{"$f":"$C$7*$H$91","v":232.5},{"$f":"$D$7*$H$91","v":186},{"$f":"$E$7*$H$91","v":139.5},{"$f":"$F$7*$H$91","v":93},"è",0.05]
["10th",{"$f":"$B$7*$H$92","v":223.20000000000002},{"$f":"$C$7*$H$92","v":186},{"$f":"$D$7*$H$92","v":148.80000000000001},{"$f":"$E$7*$H$92","v":111.60000000000001},{"$f":"$F$7*$H$92","v":74.400000000000006},"è",0.04]
["11th",{"$f":"$B$7*$H$93","v":167.4},{"$f":"$C$7*$H$93","v":139.5},{"$f":"$D$7*$H$93","v":111.6},{"$f":"$E$7*$H$93","v":83.7},{"$f":"$F$7*$H$93","v":55.8},"è",0.03]
["12th",{"$f":"$B$7*$H$94","v":111.60000000000001},{"$f":"$C$7*$H$94","v":93},{"$f":"$D$7*$H$94","v":74.400000000000006},{"$f":"$E$7*$H$94","v":55.800000000000004},{"$f":"$F$7*$H$94","v":37.200000000000003},"è",0.02]
["Totals",{"$f":"SUM(B83:B94)","v":5580},{"$f":"SUM(C83:C94)","v":4650},{"$f":"SUM(D83:D94)","v":3720},{"$f":"SUM(E83:E94)","v":2790},{"$f":"SUM(F83:F94)","v":1860},{"$f":"SUM(B95:F95)","v":18600},{"$f":"SUM(H83:H94)","v":1}]
[]
["For 667-1000 riders 15 places"]
["Placings","1D","2D","3D","4D","5D"]
["1st",{"$f":"$B$7*$H$99","v":1004.4},{"$f":"$C$7*$H$99","v":837},{"$f":"$D$7*$H$99","v":669.6},{"$f":"$E$7*$H$99","v":502.2},{"$f":"$F$7*$H$99","v":334.8},"è",0.18]
["2nd",{"$f":"$B$7*$H$100","v":837},{"$f":"$C$7*$H$100","v":697.5},{"$f":"$D$7*$H$100","v":558},{"$f":"$E$7*$H$100","v":418.5},{"$f":"$F$7*$H$100","v":279},"è",0.15]
["3rd",{"$f":"$B$7*$H$101","v":669.6},{"$f":"$C$7*$H$101","v":558},{"$f":"$D$7*$H$101","v":446.4},{"$f":"$E$7*$H$101","v":334.8},{"$f":"$F$7*$H$101","v":223.2},"è",0.12]
["4th",{"$f":"$B$7*$H$102","v":558},{"$f":"$C$7*$H$102","v":465},{"$f":"$D$7*$H$102","v":372},{"$f":"$E$7*$H$102","v":279},{"$f":"$F$7*$H$102","v":186},"è",0.1]
["5th",{"$f":"$B$7*$H$103","v":474.3},{"$f":"$C$7*$H$103","v":395.25},{"$f":"$D$7*$H$103","v":316.20000000000005},{"$f":"$E$7*$H$103","v":237.15},{"$f":"$F$7*$H$103","v":158.10000000000002},"è",8.5000000000000006E-2]
["6th",{"$f":"$B$7*$H$104","v":390.6},{"$f":"$C$7*$H$104","v":325.50000000000006},{"$f":"$D$7*$H$104","v":260.40000000000003},{"$f":"$E$7*$H$104","v":195.3},{"$f":"$F$7*$H$104","v":130.20000000000002},"è",7.0000000000000007E-2]
["7th",{"$f":"$B$7*$H$105","v":334.8},{"$f":"$C$7*$H$105","v":279},{"$f":"$D$7*$H$105","v":223.2},{"$f":"$E$7*$H$105","v":167.4},{"$f":"$F$7*$H$105","v":111.6},"è",0.06]
["8th",{"$f":"$B$7*$H$106","v":279},{"$f":"$C$7*$H$106","v":232.5},{"$f":"$D$7*$H$106","v":186},{"$f":"$E$7*$H$106","v":139.5},{"$f":"$F$7*$H$106","v":93},"è",0.05]
["9th",{"$f":"$B$7*$H$107","v":237.15},{"$f":"$C$7*$H$107","v":197.625},{"$f":"$D$7*$H$107","v":158.10000000000002},{"$f":"$E$7*$H$107","v":118.575},{"$f":"$F$7*$H$107","v":79.050000000000011},"è",4.2500000000000003E-2]
["10th",{"$f":"$B$7*$H$108","v":195.3},{"$f":"$C$7*$H$108","v":162.75000000000003},{"$f":"$D$7*$H$108","v":130.20000000000002},{"$f":"$E$7*$H$108","v":97.65},{"$f":"$F$7*$H$108","v":65.100000000000009},"è",3.5000000000000003E-2]
["11th",{"$f":"$B$7*$H$109","v":167.4},{"$f":"$C$7*$H$109","v":139.5},{"$f":"$D$7*$H$109","v":111.6},{"$f":"$E$7*$H$109","v":83.7},{"$f":"$F$7*$H$109","v":55.8},"è",0.03]
["12th",{"$f":"$B$7*$H$110","v":139.5},{"$f":"$C$7*$H$110","v":116.25},{"$f":"$D$7*$H$110","v":93},{"$f":"$E$7*$H$110","v":69.75},{"$f":"$F$7*$H$110","v":46.5},"è",2.5000000000000001E-2]
["13th",{"$f":"$B$7*$H$111","v":111.60000000000001},{"$f":"$C$7*$H$111","v":93},{"$f":"$D$7*$H$111","v":74.400000000000006},{"$f":"$E$7*$H$111","v":55.800000000000004},{"$f":"$F$7*$H$111","v":37.200000000000003},"è",0.02]
["14th",{"$f":"$B$7*$H$112","v":97.65},{"$f":"$C$7*$H$112","v":81.375000000000014},{"$f":"$D$7*$H$112","v":65.100000000000009},{"$f":"$E$7*$H$112","v":48.825000000000003},{"$f":"$F$7*$H$112","v":32.550000000000004},"è",1.7500000000000002E-2]
["15th",{"$f":"$B$7*$H$113","v":83.7},{"$f":"$C$7*$H$113","v":69.75},{"$f":"$D$7*$H$113","v":55.8},{"$f":"$E$7*$H$113","v":41.85},{"$f":"$F$7*$H$113","v":27.9},"è",1.4999999999999999E-2]
["Totals",{"$f":"SUM(B99:B113)","v":5579.9999999999991},{"$f":"SUM(C99:C113)","v":4650},{"$f":"SUM(D99:D113)","v":3719.9999999999995},{"$f":"SUM(E99:E113)","v":2789.9999999999995},{"$f":"SUM(F99:F113)","v":1859.9999999999998},{"$f":"SUM(B114:F114)","v":18600},{"$f":"SUM(H99:H113)","v":1}]
[]
["For 1001-1500 riders 20 places"]
["Placings","1D","2D","3D","4D","5D"]
["1st",{"$f":"$B$7*$H$118","v":781.2},{"$f":"$C$7*$H$118","v":651.00000000000011},{"$f":"$D$7*$H$118","v":520.80000000000007},{"$f":"$E$7*$H$118","v":390.6},{"$f":"$F$7*$H$118","v":260.40000000000003},"è",0.14000000000000001]
["2nd",{"$f":"$B$7*$H$119","v":613.79999999999995},{"$f":"$C$7*$H$119","v":511.5},{"$f":"$D$7*$H$119","v":409.2},{"$f":"$E$7*$H$119","v":306.89999999999998},{"$f":"$F$7*$H$119","v":204.6},"è",0.11]
["3rd",{"$f":"$B$7*$H$120","v":502.2},{"$f":"$C$7*$H$120","v":418.5},{"$f":"$D$7*$H$120","v":334.8},{"$f":"$E$7*$H$120","v":251.1},{"$f":"$F$7*$H$120","v":167.4},"è",0.09]
["4th",{"$f":"$B$7*$H$121","v":429.65999999999997},{"$f":"$C$7*$H$121","v":358.05},{"$f":"$D$7*$H$121","v":286.44},{"$f":"$E$7*$H$121","v":214.82999999999998},{"$f":"$F$7*$H$121","v":143.22},"è",7.6999999999999999E-2]
["5th",{"$f":"$B$7*$H$122","v":390.6},{"$f":"$C$7*$H$122","v":325.50000000000006},{"$f":"$D$7*$H$122","v":260.40000000000003},{"$f":"$E$7*$H$122","v":195.3},{"$f":"$F$7*$H$122","v":130.20000000000002},"è",7.0000000000000007E-2]
["6th",{"$f":"$B$7*$H$123","v":362.7},{"$f":"$C$7*$H$123","v":302.25},{"$f":"$D$7*$H$123","v":241.8},{"$f":"$E$7*$H$123","v":181.35},{"$f":"$F$7*$H$123","v":120.9},"è",6.5000000000000002E-2]
["7th",{"$f":"$B$7*$H$124","v":334.8},{"$f":"$C$7*$H$124","v":279},{"$f":"$D$7*$H$124","v":223.2},{"$f":"$E$7*$H$124","v":167.4},{"$f":"$F$7*$H$124","v":111.6},"è",0.06]
["8th",{"$f":"$B$7*$H$125","v":306.89999999999998},{"$f":"$C$7*$H$125","v":255.75},{"$f":"$D$7*$H$125","v":204.6},{"$f":"$E$7*$H$125","v":153.44999999999999},{"$f":"$F$7*$H$125","v":102.3},"è",5.5E-2]
["9th",{"$f":"$B$7*$H$126","v":279},{"$f":"$C$7*$H$126","v":232.5},{"$f":"$D$7*$H$126","v":186},{"$f":"$E$7*$H$126","v":139.5},{"$f":"$F$7*$H$126","v":93},"è",0.05]
["10th",{"$f":"$B$7*$H$127","v":251.1},{"$f":"$C$7*$H$127","v":209.25},{"$f":"$D$7*$H$127","v":167.4},{"$f":"$E$7*$H$127","v":125.55},{"$f":"$F$7*$H$127","v":83.7},"è",4.4999999999999998E-2]
["11th",{"$f":"$B$7*$H$128","v":223.20000000000002},{"$f":"$C$7*$H$128","v":186},{"$f":"$D$7*$H$128","v":148.80000000000001},{"$f":"$E$7*$H$128","v":111.60000000000001},{"$f":"$F$7*$H$128","v":74.400000000000006},"è",0.04]
["12th",{"$f":"$B$7*$H$129","v":206.45999999999998},{"$f":"$C$7*$H$129","v":172.04999999999998},{"$f":"$D$7*$H$129","v":137.63999999999999},{"$f":"$E$7*$H$129","v":103.22999999999999},{"$f":"$F$7*$H$129","v":68.819999999999993},"è",3.6999999999999998E-2]
["13th",{"$f":"$B$7*$H$130","v":184.14000000000001},{"$f":"$C$7*$H$130","v":153.45000000000002},{"$f":"$D$7*$H$130","v":122.76},{"$f":"$E$7*$H$130","v":92.070000000000007},{"$f":"$F$7*$H$130","v":61.38},"è",3.3000000000000002E-2]
["14th",{"$f":"$B$7*$H$131","v":161.82000000000002},{"$f":"$C$7*$H$131","v":134.85},{"$f":"$D$7*$H$131","v":107.88000000000001},{"$f":"$E$7*$H$131","v":80.910000000000011},{"$f":"$F$7*$H$131","v":53.940000000000005},"è",2.9000000000000001E-2]
["15th",{"$f":"$B$7*$H$132","v":139.5},{"$f":"$C$7*$H$132","v":116.25},{"$f":"$D$7*$H$132","v":93},{"$f":"$E$7*$H$132","v":69.75},{"$f":"$F$7*$H$132","v":46.5},"è",2.5000000000000001E-2]
["16th",{"$f":"$B$7*$H$133","v":117.18},{"$f":"$C$7*$H$133","v":97.65},{"$f":"$D$7*$H$133","v":78.12},{"$f":"$E$7*$H$133","v":58.59},{"$f":"$F$7*$H$133","v":39.06},"è",2.1000000000000001E-2]
["17th",{"$f":"$B$7*$H$134","v":94.860000000000014},{"$f":"$C$7*$H$134","v":79.050000000000011},{"$f":"$D$7*$H$134","v":63.24},{"$f":"$E$7*$H$134","v":47.430000000000007},{"$f":"$F$7*$H$134","v":31.62},"è",1.7000000000000001E-2]
["18th",{"$f":"$B$7*$H$135","v":78.12},{"$f":"$C$7*$H$135","v":65.099999999999994},{"$f":"$D$7*$H$135","v":52.08},{"$f":"$E$7*$H$135","v":39.06},{"$f":"$F$7*$H$135","v":26.04},"è",1.4E-2]
["19th",{"$f":"$B$7*$H$136","v":66.960000000000008},{"$f":"$C$7*$H$136","v":55.800000000000004},{"$f":"$D$7*$H$136","v":44.64},{"$f":"$E$7*$H$136","v":33.480000000000004},{"$f":"$F$7*$H$136","v":22.32},"è",1.2E-2]
["20th",{"$f":"$B$7*$H$137","v":55.800000000000004},{"$f":"$C$7*$H$137","v":46.5},{"$f":"$D$7*$H$137","v":37.200000000000003},{"$f":"$E$7*$H$137","v":27.900000000000002},{"$f":"$F$7*$H$137","v":18.600000000000001},"è",0.01]
["Totals",{"$f":"SUM(B118:B137)","v":5580},{"$f":"SUM(C118:C137)","v":4650.0000000000009},3719.9999999999995,2790,1859.9999999999998,{"$f":"SUM(B138:F138)","v":18600},{"$f":"SUM(H118:H137)","v":1.0000000000000004}]
[]
["For 1501 or More riders 30 places"]
["Placings","1D","2D","3D","4D","5D"]
["1st",{"$f":"$B$7*$H142","v":669.6},{"$f":"$C$7*$H142","v":558},{"$f":"$D$7*$H142","v":446.4},{"$f":"$E$7*$H142","v":334.8},{"$f":"$F$7*$H142","v":223.2},"è",0.12]
["2nd",{"$f":"$B$7*$H143","v":530.1},441.75,353.4,265.05,176.7,"è",9.5000000000000001E-2]
["3rd",{"$f":"$B$7*$H144","v":407.34},339.45,271.56,203.67,135.78,"è",7.2999999999999995E-2]
["4th",{"$f":"$B$7*$H145","v":345.96},288.3,230.64,172.98,115.32,"è",6.2E-2]
["5th",279,232.5,186,139.5,93,"è",0.05]
["6th",251.1,209.25,167.4,125.55,83.7,"è",4.4999999999999998E-2]
["7th",239.93999999999997,199.95,159.95999999999998,119.96999999999998,79.97999999999999,"è",4.2999999999999997E-2]
["8th",223.20000000000002,186,148.80000000000001,111.60000000000001,74.400000000000006,"è",0.04]
["9th",206.45999999999998,172.04999999999998,137.63999999999999,103.22999999999999,68.819999999999993,"è",3.6999999999999998E-2]
["10th",195.3,162.75000000000003,130.20000000000002,97.65,65.100000000000009,"è",3.5000000000000003E-2]
["11th",184.14000000000001,153.45000000000002,122.76,92.070000000000007,61.38,"è",3.3000000000000002E-2]
["12th",172.98,144.15,115.32,86.49,57.66,"è",3.1E-2]
["13th",161.82000000000002,134.85,107.88000000000001,80.910000000000011,53.940000000000005,"è",2.9000000000000001E-2]
["14th",150.66,125.55,100.44,75.33,50.22,"è",2.7E-2]
["15th",139.5,116.25,93,69.75,46.5,"è",2.5000000000000001E-2]
["16th",133.92000000000002,111.60000000000001,89.28,66.960000000000008,44.64,"è",2.4E-2]
["17th",128.34,106.95,85.56,64.17,42.78,"è",2.3E-2]
["18th",122.75999999999999,102.3,81.839999999999989,61.379999999999995,40.919999999999995,"è",2.1999999999999999E-2]
["19th",117.18,97.65,78.12,58.59,39.06,"è",2.1000000000000001E-2]
["20th",111.60000000000001,93,74.400000000000006,55.800000000000004,37.200000000000003,"è",0.02]
["21st",106.02,88.35,70.679999999999993,53.01,35.339999999999996,"è",1.9E-2]
["22nd",100.44,83.699999999999989,66.959999999999994,50.22,33.479999999999997,"è",1.7999999999999999E-2]
["23rd",94.860000000000014,79.050000000000011,63.24,47.430000000000007,31.62,"è",1.7000000000000001E-2]
["24th",89.28,74.400000000000006,59.52,44.64,29.76,"è",1.6E-2]
["25th",83.7,69.75,55.8,41.85,27.9,"è",1.4999999999999999E-2]
["26th",78.12,65.099999999999994,52.08,39.06,26.04,"è",1.4E-2]
["27th",72.539999999999992,60.449999999999996,48.36,36.269999999999996,24.18,"è",1.2999999999999999E-2]
["28th",66.960000000000008,55.800000000000004,44.64,33.480000000000004,22.32,"è",1.2E-2]
["29th",61.379999999999995,51.15,40.919999999999995,30.689999999999998,20.459999999999997,"è",1.0999999999999999E-2]
["30th",55.800000000000004,46.5,37.200000000000003,27.900000000000002,18.600000000000001,"è",0.01]
["Totals",{"$f":"SUM(B142:B171)","v":5580.0000000000009},{"$f":"SUM(C142:C171)","v":4650},3720.0000000000005,2790.0000000000005,1860.0000000000002,{"$f":"SUM(B172:F172)","v":18600},{"$f":"SUM(H142:H171)","v":1.0000000000000002}]

{"sheet":"DON'T TOUCH","index":16,"n_rows":6,"n_cols":5,"rows_kept":6,"cut":false,"hidden":true,"merged":[]}
[]
["Yes",null,"S",5,"X"]
[null,null,"A",10]
[null,null,"Y",15]
[null,null,"P","BP"]
[null,null,null,"SCR"]